geode-dev mailing list archives

Site index · List index
Message view « Date » · « Thread »
Top « Date » · « Thread »
From Apache Jenkins Server <jenk...@builds.apache.org>
Subject Build failed in Jenkins: Geode-nightly-flaky #88
Date Sat, 12 Aug 2017 02:28:53 GMT
See <https://builds.apache.org/job/Geode-nightly-flaky/88/display/redirect?page=changes>

Changes:

[dbarnes] GEODE-3328 Properties to set Key/Trust Store Type for SSL configuration

[huynhja] GEODE-3397: Fixed issue with Tomcat locators in cache-client.xml file

[jiliao] GEODE-3328: refactor ConnectCommand

[dbarnes] GEODE-3396 pub-tools support for product name & version variables,

[klund] GEODE-3413: overhaul launcher and process classes and tests

[kmiller] GEODE-3410 Doc update for gfsh query command changes

[gzhou] GEODE-3304: when colocated child bucket is destroyed, it should not

[dschneider] GEODE-3300: Complete and expose parallel export feature for use

[dbarnes] GEODE-3395 Variable-ize product version and name in user guide -

[klund] GEODE-3230: Cleaning up unused (Cli)Strings

[klund] GEODE-3255: Refactor CreateAlterDestroyRegionCommands and tests

[klund] GEODE-3257: Refactoring DeployCommands

[klund] GEODE-3266: Refactoring PDXCommands

[klund] GEODE-3268: Refactoring RegionCommands

[klund] GEODE-3267: Refactoring QueueCommands - updated based on feedback

[klund] GEODE-3270: Refactoring (renaming) StatusCommands

[klund] GEODE-3267: Refactoring QueueCommands

[klund] GEODE-3261: Refactoring GfshHelpCommands

[klund] GEODE-3265: Refactoring MiscellaneousCommands

[klund] GEODE-3337: Refactoring LauncherLifecycleCommandsDUnitTest

[klund] GEODE-3258: Refactoring DiskStoreCommands

[klund] GEODE-3260: Refactoring FunctionCommands

[klund] GEODE-3262: Refactoring IndexCommands

[bschuchardt] GEODE-3403: Modify rolling upgrade test configurations for 1.2.x release

[klund] GEODE-3254: Refactoring ConfigCommands

[klund] GEODE-3259: Refactoring DurableClientCommands

[klund] GEODE-3264: Refactoring MemberCommands

[bschuchardt] GEODE-3427: CI failure in

[dbarnes] GEODE-3395 Variable-ize product version and name in user guide - Getting

------------------------------------------
[...truncated 110.67 KB...]
Download https://repo1.maven.org/maven2/org/springframework/hateoas/spring-hateoas/0.23.0.RELEASE/spring-hateoas-0.23.0.RELEASE.jar
Download https://repo1.maven.org/maven2/org/scala-lang/scala-library/2.10.6/scala-library-2.10.6.jar
Download https://repo1.maven.org/maven2/org/scala-lang/scala-reflect/2.10.6/scala-reflect-2.10.6.jar
Download https://repo1.maven.org/maven2/com/fasterxml/jackson/module/jackson-module-paranamer/2.8.6/jackson-module-paranamer-2.8.6.jar
Download https://repo1.maven.org/maven2/io/swagger/swagger-annotations/1.5.10/swagger-annotations-1.5.10.jar
Download https://repo1.maven.org/maven2/io/swagger/swagger-models/1.5.10/swagger-models-1.5.10.jar
Download https://repo1.maven.org/maven2/io/springfox/springfox-spi/2.6.1/springfox-spi-2.6.1.jar
Download https://repo1.maven.org/maven2/io/springfox/springfox-schema/2.6.1/springfox-schema-2.6.1.jar
Download https://repo1.maven.org/maven2/io/springfox/springfox-swagger-common/2.6.1/springfox-swagger-common-2.6.1.jar
Download https://repo1.maven.org/maven2/io/springfox/springfox-spring-web/2.6.1/springfox-spring-web-2.6.1.jar
Download https://repo1.maven.org/maven2/com/fasterxml/classmate/1.3.1/classmate-1.3.1.jar
Download https://repo1.maven.org/maven2/org/springframework/plugin/spring-plugin-core/1.2.0.RELEASE/spring-plugin-core-1.2.0.RELEASE.jar
Download https://repo1.maven.org/maven2/org/springframework/plugin/spring-plugin-metadata/1.2.0.RELEASE/spring-plugin-metadata-1.2.0.RELEASE.jar
Download https://repo1.maven.org/maven2/org/mapstruct/mapstruct/1.0.0.Final/mapstruct-1.0.0.Final.jar
Download https://repo1.maven.org/maven2/com/thoughtworks/paranamer/paranamer/2.8/paranamer-2.8.jar
Download https://repo1.maven.org/maven2/io/springfox/springfox-core/2.6.1/springfox-core-2.6.1.jar
Note: Some input files use unchecked or unsafe operations.
Note: Recompile with -Xlint:unchecked for details.
:geode-web-api:processResources
:geode-web-api:classes
:geode-assembly:docs
:geode-assembly:gfshDepsJar
:geode-common:javadocJar
:geode-common:sourcesJar
:geode-common:signArchives SKIPPED
:geode-core:javadocJar
:geode-core:raJar
:geode-core:jcaJar
:geode-core:sourcesJar
:geode-core:signArchives SKIPPED
:geode-core:webJar
:geode-cq:jar
:geode-cq:javadoc
:geode-cq:javadocJar
:geode-cq:sourcesJar
:geode-cq:signArchives SKIPPED
:geode-json:javadocJar
:geode-json:sourcesJar
:geode-json:signArchives SKIPPED
:geode-lucene:jar
:geode-lucene:javadoc
:geode-lucene:javadocJar
:geode-lucene:sourcesJar
:geode-lucene:signArchives SKIPPED
:geode-old-client-support:jar
:geode-old-client-support:javadoc
:geode-old-client-support:javadocJar
:geode-old-client-support:sourcesJar
:geode-old-client-support:signArchives SKIPPED
:geode-protobuf:jar
:geode-protobuf:javadoc
:geode-protobuf:javadocJar
:geode-protobuf:sourcesJar
:geode-protobuf:signArchives SKIPPED
:geode-pulse:javadoc
:geode-pulse:javadocJar
:geode-pulse:sourcesJar
:geode-pulse:war
:geode-pulse:signArchives SKIPPED
:geode-rebalancer:jar
:geode-rebalancer:javadoc
:geode-rebalancer:javadocJar
:geode-rebalancer:sourcesJar
:geode-rebalancer:signArchives SKIPPED
:geode-wan:jar
:geode-wan:javadoc
:geode-wan:javadocJar
:geode-wan:sourcesJar
:geode-wan:signArchives SKIPPED
:geode-web:javadoc UP-TO-DATE
:geode-web:javadocJar
:geode-web:sourcesJar
:geode-web:war
:geode-web:signArchives SKIPPED
:geode-web-api:javadoc
:geode-web-api:javadocJar
:geode-web-api:sourcesJar
:geode-web-api:war
:geode-web-api:signArchives SKIPPED
:geode-assembly:installDist
:geode-pulse:jar
:geode-assembly:compileTestJava
Download https://repo1.maven.org/maven2/org/codehaus/cargo/cargo-core-uberjar/1.6.3/cargo-core-uberjar-1.6.3.pom
Download https://repo1.maven.org/maven2/org/codehaus/cargo/cargo-core/1.6.3/cargo-core-1.6.3.pom
Download https://repo1.maven.org/maven2/org/codehaus/cargo/codehaus-cargo/1.6.3/codehaus-cargo-1.6.3.pom
Download https://repo1.maven.org/maven2/commons-discovery/commons-discovery/0.5/commons-discovery-0.5.pom
Download https://repo1.maven.org/maven2/org/codehaus/cargo/cargo-core-uberjar/1.6.3/cargo-core-uberjar-1.6.3.jar
Download https://repo1.maven.org/maven2/commons-discovery/commons-discovery/0.5/commons-discovery-0.5.jar
Note: Some input files use or override a deprecated API.
Note: Recompile with -Xlint:deprecation for details.
Note: Some input files use unchecked or unsafe operations.
Note: Recompile with -Xlint:unchecked for details.
:geode-assembly:processTestResources
:geode-assembly:testClasses
:geode-assembly:flakyTest
:geode-benchmarks:compileTestJava UP-TO-DATE
:geode-benchmarks:processTestResources UP-TO-DATE
:geode-benchmarks:testClasses UP-TO-DATE
:geode-benchmarks:flakyTest UP-TO-DATE
:geode-common:compileTestJava
:geode-common:processTestResources UP-TO-DATE
:geode-common:testClasses
:geode-common:flakyTest
:geode-core:flakyTest

org.apache.geode.management.internal.security.MultiUserDUnitTest > testMultiUser FAILED
    java.lang.AssertionError: An exception occurred during asynchronous invocation.
        at org.apache.geode.test.dunit.AsyncInvocation.checkException(AsyncInvocation.java:148)
        at org.apache.geode.management.internal.security.MultiUserDUnitTest.testMultiUser(MultiUserDUnitTest.java:151)

        Caused by:
        java.lang.AssertionError: Not an expected result: CommandResult [gfJsonObject={"content":{"errorCode":110,"message":["Aborted
destroy of InterestCalculations"]}}, status=ERROR, index=1, isDataBuilt=true, resultData=org.apache.geode.management.internal.cli.result.ErrorResultData@341d15e0,
resultLines=[Aborted destroy of InterestCalculations
        ], failedToPersist=false] expected:<415> but was:<110>
            at org.junit.Assert.fail(Assert.java:88)
            at org.junit.Assert.failNotEquals(Assert.java:834)
            at org.junit.Assert.assertEquals(Assert.java:645)
            at org.apache.geode.management.internal.security.MultiUserDUnitTest.lambda$testMultiUser$f3200e9$1(MultiUserDUnitTest.java:110)

org.apache.geode.management.internal.cli.commands.AlterRegionCommandDUnitTest > testAlterRegionResetCacheListeners
FAILED
    java.lang.AssertionError
        at org.junit.Assert.fail(Assert.java:86)
        at org.junit.Assert.assertTrue(Assert.java:41)
        at org.junit.Assert.assertTrue(Assert.java:52)
        at org.apache.geode.management.internal.cli.commands.AlterRegionCommandDUnitTest.testAlterRegionResetCacheListeners(AlterRegionCommandDUnitTest.java:150)

252 tests completed, 2 failed, 7 skipped
:geode-core:flakyTest FAILED
:geode-cq:compileTestJavaNote: Some input files use or override a deprecated API.
Note: Recompile with -Xlint:deprecation for details.
Note: Some input files use unchecked or unsafe operations.
Note: Recompile with -Xlint:unchecked for details.

:geode-cq:processTestResources
:geode-cq:testClasses
:geode-cq:flakyTest
:geode-json:compileTestJava UP-TO-DATE
:geode-json:processTestResources
:geode-json:testClasses
:geode-json:flakyTest UP-TO-DATE
:geode-junit:compileTestJavaNote: <https://builds.apache.org/job/Geode-nightly-flaky/ws/geode-junit/src/test/java/org/apache/geode/test/compiler/JarBuilderTest.java>
uses or overrides a deprecated API.
Note: Recompile with -Xlint:deprecation for details.
Note: <https://builds.apache.org/job/Geode-nightly-flaky/ws/geode-junit/src/test/java/org/apache/geode/test/compiler/ClassNameExtractorTest.java>
uses unchecked or unsafe operations.
Note: Recompile with -Xlint:unchecked for details.

:geode-junit:processTestResources
:geode-junit:testClasses
:geode-junit:flakyTest
:geode-lucene:compileTestJava
Download https://repo1.maven.org/maven2/org/apache/lucene/lucene-test-framework/6.4.1/lucene-test-framework-6.4.1.pom
Download https://repo1.maven.org/maven2/org/apache/lucene/lucene-codecs/6.4.1/lucene-codecs-6.4.1.pom
Download https://repo1.maven.org/maven2/com/carrotsearch/randomizedtesting/randomizedtesting-runner/2.4.0/randomizedtesting-runner-2.4.0.pom
Download https://repo1.maven.org/maven2/com/carrotsearch/randomizedtesting/randomizedtesting-parent/2.4.0/randomizedtesting-parent-2.4.0.pom
Download https://repo1.maven.org/maven2/org/apache/lucene/lucene-test-framework/6.4.1/lucene-test-framework-6.4.1.jar
Download https://repo1.maven.org/maven2/org/apache/lucene/lucene-codecs/6.4.1/lucene-codecs-6.4.1.jar
Download https://repo1.maven.org/maven2/com/carrotsearch/randomizedtesting/randomizedtesting-runner/2.4.0/randomizedtesting-runner-2.4.0.jar
Note: Some input files use or override a deprecated API.
Note: Recompile with -Xlint:deprecation for details.
Note: Some input files use unchecked or unsafe operations.
Note: Recompile with -Xlint:unchecked for details.
:geode-lucene:processTestResources
:geode-lucene:testClasses
:geode-lucene:flakyTest
:geode-old-client-support:compileTestJavaNote: <https://builds.apache.org/job/Geode-nightly-flaky/ws/geode-old-client-support/src/test/java/com/gemstone/gemfire/cache/execute/FunctionExceptionTest.java>
uses or overrides a deprecated API.
Note: Recompile with -Xlint:deprecation for details.

:geode-old-client-support:processTestResources UP-TO-DATE
:geode-old-client-support:testClasses
:geode-old-client-support:flakyTest
:geode-old-versions:compileTestJava UP-TO-DATE
:geode-old-versions:processTestResources UP-TO-DATE
:geode-old-versions:testClasses UP-TO-DATE
:geode-old-versions:flakyTest UP-TO-DATE
:geode-protobuf:extractIncludeTestProto
Download https://repo1.maven.org/maven2/org/powermock/powermock-api-mockito/1.7.0RC4/powermock-api-mockito-1.7.0RC4.pom
Download https://repo1.maven.org/maven2/org/powermock/powermock-api-mockito/1.7.0RC4/powermock-api-mockito-1.7.0RC4.jar
:geode-protobuf:extractTestProto
:geode-protobuf:generateTestProto UP-TO-DATE
:geode-protobuf:compileTestJavaNote: Some input files use unchecked or unsafe operations.
Note: Recompile with -Xlint:unchecked for details.

:geode-protobuf:processTestResources
:geode-protobuf:testClasses
:geode-protobuf:flakyTest
:geode-pulse:compileTestJava
Download https://repo1.maven.org/maven2/com/codeborne/phantomjsdriver/1.3.0/phantomjsdriver-1.3.0.pom
Download https://repo1.maven.org/maven2/org/seleniumhq/selenium/selenium-api/3.0.1/selenium-api-3.0.1.pom
Download https://repo1.maven.org/maven2/org/seleniumhq/selenium/selenium-remote-driver/3.0.1/selenium-remote-driver-3.0.1.pom
Download https://repo1.maven.org/maven2/org/seleniumhq/selenium/selenium-support/3.0.1/selenium-support-3.0.1.pom
Download https://repo1.maven.org/maven2/org/springframework/spring-test/4.3.6.RELEASE/spring-test-4.3.6.RELEASE.pom
Download https://repo1.maven.org/maven2/com/tdunning/json/1.8/json-1.8.pom
Download https://repo1.maven.org/maven2/com/codeborne/phantomjsdriver/1.3.0/phantomjsdriver-1.3.0.jar
Download https://repo1.maven.org/maven2/org/seleniumhq/selenium/selenium-api/3.0.1/selenium-api-3.0.1.jar
Download https://repo1.maven.org/maven2/org/seleniumhq/selenium/selenium-remote-driver/3.0.1/selenium-remote-driver-3.0.1.jar
Download https://repo1.maven.org/maven2/org/seleniumhq/selenium/selenium-support/3.0.1/selenium-support-3.0.1.jar
Download https://repo1.maven.org/maven2/org/springframework/spring-test/4.3.6.RELEASE/spring-test-4.3.6.RELEASE.jar
Download https://repo1.maven.org/maven2/com/tdunning/json/1.8/json-1.8.jar
Note: Some input files use or override a deprecated API.
Note: Recompile with -Xlint:deprecation for details.
Note: <https://builds.apache.org/job/Geode-nightly-flaky/ws/geode-pulse/src/test/java/org/apache/geode/tools/pulse/controllers/PulseControllerJUnitTest.java>
uses unchecked or unsafe operations.
Note: Recompile with -Xlint:unchecked for details.
:geode-pulse:processTestResources
:geode-pulse:testClasses
:geode-pulse:flakyTest
Download https://repo1.maven.org/maven2/com/google/code/gson/gson/2.8.0/gson-2.8.0.pom
Download https://repo1.maven.org/maven2/com/google/code/gson/gson-parent/2.8.0/gson-parent-2.8.0.pom
Download https://repo1.maven.org/maven2/com/google/code/gson/gson/2.8.0/gson-2.8.0.jar
:geode-rebalancer:compileTestJava
:geode-rebalancer:processTestResources UP-TO-DATE
:geode-rebalancer:testClasses
:geode-rebalancer:flakyTest
:geode-wan:compileTestJavaNote: Some input files use or override a deprecated API.
Note: Recompile with -Xlint:deprecation for details.
Note: Some input files use unchecked or unsafe operations.
Note: Recompile with -Xlint:unchecked for details.

:geode-wan:processTestResources
:geode-wan:testClasses
:geode-wan:flakyTest
:geode-web:compileTestJavaNote: Some input files use or override a deprecated API.
Note: Recompile with -Xlint:deprecation for details.
Note: <https://builds.apache.org/job/Geode-nightly-flaky/ws/geode-web/src/test/java/org/apache/geode/management/internal/web/AbstractWebTestCase.java>
uses unchecked or unsafe operations.
Note: Recompile with -Xlint:unchecked for details.

:geode-web:processTestResources UP-TO-DATE
:geode-web:testClasses
:geode-web:flakyTest
:geode-web-api:compileTestJava
:geode-web-api:processTestResources UP-TO-DATE
:geode-web-api:testClasses
:geode-web-api:flakyTest
:combineReports
All test reports at <https://builds.apache.org/job/Geode-nightly-flaky/ws/build/reports/combined>

FAILURE: Build failed with an exception.

* What went wrong:
Execution failed for task ':geode-core:flakyTest'.
> There were failing tests. See the report at: file://<https://builds.apache.org/job/Geode-nightly-flaky/ws/geode-core/build/reports/flakyTest/index.html>

* Try:
Run with --stacktrace option to get the stack trace. Run with --info or --debug option to
get more log output.

BUILD FAILED

Total time: 1 hrs 44 mins 47.679 secs
Build step 'Invoke Gradle script' changed build result to FAILURE
Build step 'Invoke Gradle script' marked build as failure
Archiving artifacts
Recording test results

Mime
View raw message