geode-dev mailing list archives

Site index · List index
Message view « Date » · « Thread »
Top « Date » · « Thread »
From Apache Jenkins Server <jenk...@builds.apache.org>
Subject Build failed in Jenkins: Geode-nightly-flaky #71
Date Fri, 21 Jul 2017 02:58:21 GMT
See <https://builds.apache.org/job/Geode-nightly-flaky/71/display/redirect?page=changes>

Changes:

[jiliao] GEODE-2818: Making "groups" a valid option when starting locators or

[klund] GEODE-3156: add AcceptanceTest gradle target and junit category

[ukohlmeyer] GetServersResponse number of servers was redundant. This now closes #641

[jiliao] GEODE-3108: update lucene security permission to use "LUCENE" target

[kmiller] GEODE-3208 Revise docs with outdated JAR references

[jiliao] GEODE-3090: Fixing gfsh help message (and a lot of other typos)

[lhughesgodfrey] GEODE-3112: Fixing improper ordering of client timeout setting

------------------------------------------
[...truncated 98.27 KB...]
Download https://repo1.maven.org/maven2/io/springfox/springfox-spring-web/2.6.1/springfox-spring-web-2.6.1.pom
Download https://repo1.maven.org/maven2/com/fasterxml/classmate/1.3.1/classmate-1.3.1.pom
Download https://repo1.maven.org/maven2/org/springframework/plugin/spring-plugin-core/1.2.0.RELEASE/spring-plugin-core-1.2.0.RELEASE.pom
Download https://repo1.maven.org/maven2/org/springframework/plugin/spring-plugin/1.2.0.RELEASE/spring-plugin-1.2.0.RELEASE.pom
Download https://repo1.maven.org/maven2/org/springframework/plugin/spring-plugin-metadata/1.2.0.RELEASE/spring-plugin-metadata-1.2.0.RELEASE.pom
Download https://repo1.maven.org/maven2/org/mapstruct/mapstruct/1.0.0.Final/mapstruct-1.0.0.Final.pom
Download https://repo1.maven.org/maven2/org/mapstruct/mapstruct-parent/1.0.0.Final/mapstruct-parent-1.0.0.Final.pom
Download https://repo1.maven.org/maven2/io/springfox/springfox-core/2.6.1/springfox-core-2.6.1.pom
Download https://repo1.maven.org/maven2/com/fasterxml/jackson/module/jackson-module-scala_2.10/2.8.6/jackson-module-scala_2.10-2.8.6.jar
Download https://repo1.maven.org/maven2/io/springfox/springfox-swagger2/2.6.1/springfox-swagger2-2.6.1.jar
Download https://repo1.maven.org/maven2/io/springfox/springfox-swagger-ui/2.6.1/springfox-swagger-ui-2.6.1.jar
Download https://repo1.maven.org/maven2/org/springframework/hateoas/spring-hateoas/0.23.0.RELEASE/spring-hateoas-0.23.0.RELEASE.jar
Download https://repo1.maven.org/maven2/com/fasterxml/jackson/module/jackson-module-paranamer/2.8.6/jackson-module-paranamer-2.8.6.jar
Download https://repo1.maven.org/maven2/io/swagger/swagger-annotations/1.5.10/swagger-annotations-1.5.10.jar
Download https://repo1.maven.org/maven2/io/swagger/swagger-models/1.5.10/swagger-models-1.5.10.jar
Download https://repo1.maven.org/maven2/io/springfox/springfox-spi/2.6.1/springfox-spi-2.6.1.jar
Download https://repo1.maven.org/maven2/io/springfox/springfox-schema/2.6.1/springfox-schema-2.6.1.jar
Download https://repo1.maven.org/maven2/io/springfox/springfox-swagger-common/2.6.1/springfox-swagger-common-2.6.1.jar
Download https://repo1.maven.org/maven2/io/springfox/springfox-spring-web/2.6.1/springfox-spring-web-2.6.1.jar
Download https://repo1.maven.org/maven2/org/springframework/plugin/spring-plugin-core/1.2.0.RELEASE/spring-plugin-core-1.2.0.RELEASE.jar
Download https://repo1.maven.org/maven2/org/springframework/plugin/spring-plugin-metadata/1.2.0.RELEASE/spring-plugin-metadata-1.2.0.RELEASE.jar
Download https://repo1.maven.org/maven2/org/mapstruct/mapstruct/1.0.0.Final/mapstruct-1.0.0.Final.jar
Download https://repo1.maven.org/maven2/com/thoughtworks/paranamer/paranamer/2.8/paranamer-2.8.jar
Download https://repo1.maven.org/maven2/io/springfox/springfox-core/2.6.1/springfox-core-2.6.1.jar
Note: Some input files use unchecked or unsafe operations.
Note: Recompile with -Xlint:unchecked for details.
:geode-web-api:processResources
:geode-web-api:classes
:geode-assembly:docs
:geode-assembly:gfshDepsJar
:geode-common:javadocJar
:geode-common:sourcesJar
:geode-common:signArchives SKIPPED
:geode-core:javadocJar
:geode-core:raJar
:geode-core:jcaJar
:geode-core:sourcesJar
:geode-core:signArchives SKIPPED
:geode-core:webJar
:geode-cq:jar
:geode-cq:javadoc
:geode-cq:javadocJar
:geode-cq:sourcesJar
:geode-cq:signArchives SKIPPED
:geode-json:javadocJar
:geode-json:sourcesJar
:geode-json:signArchives SKIPPED
:geode-lucene:jar
:geode-lucene:javadoc
:geode-lucene:javadocJar
:geode-lucene:sourcesJar
:geode-lucene:signArchives SKIPPED
:geode-old-client-support:jar
:geode-old-client-support:javadoc
:geode-old-client-support:javadocJar
:geode-old-client-support:sourcesJar
:geode-old-client-support:signArchives SKIPPED
:geode-protobuf:jar
:geode-protobuf:javadoc
:geode-protobuf:javadocJar
:geode-protobuf:sourcesJar
:geode-protobuf:signArchives SKIPPED
:geode-pulse:javadoc
:geode-pulse:javadocJar
:geode-pulse:sourcesJar
:geode-pulse:war
:geode-pulse:signArchives SKIPPED
:geode-rebalancer:jar
:geode-rebalancer:javadoc
:geode-rebalancer:javadocJar
:geode-rebalancer:sourcesJar
:geode-rebalancer:signArchives SKIPPED
:geode-wan:jar
:geode-wan:javadoc
:geode-wan:javadocJar
:geode-wan:sourcesJar
:geode-wan:signArchives SKIPPED
:geode-web:javadoc UP-TO-DATE
:geode-web:javadocJar
:geode-web:sourcesJar
:geode-web:war
:geode-web:signArchives SKIPPED
:geode-web-api:javadoc
:geode-web-api:javadocJar
:geode-web-api:sourcesJar
:geode-web-api:war
:geode-web-api:signArchives SKIPPED
:geode-assembly:installDist
:geode-pulse:jar
:geode-assembly:compileTestJava
Download https://repo1.maven.org/maven2/org/codehaus/cargo/cargo-core-uberjar/1.6.3/cargo-core-uberjar-1.6.3.pom
Download https://repo1.maven.org/maven2/org/codehaus/cargo/cargo-core/1.6.3/cargo-core-1.6.3.pom
Download https://repo1.maven.org/maven2/org/codehaus/cargo/codehaus-cargo/1.6.3/codehaus-cargo-1.6.3.pom
Download https://repo1.maven.org/maven2/org/codehaus/cargo/cargo-core-uberjar/1.6.3/cargo-core-uberjar-1.6.3.jar
Note: Some input files use or override a deprecated API.
Note: Recompile with -Xlint:deprecation for details.
Note: Some input files use unchecked or unsafe operations.
Note: Recompile with -Xlint:unchecked for details.
:geode-assembly:processTestResources
:geode-assembly:testClasses
:geode-assembly:flakyTest

org.apache.geode.management.internal.configuration.ClusterConfigurationServiceEndToEndDUnitTest
> testStartServerAndExecuteCommands FAILED
    java.lang.AssertionError: Suspicious strings were written to the log during this run.
    Fix the strings or use IgnoredException.addIgnoredException to ignore.
    -----------------------------------------------------------------------
    Found suspect string in log4j at line 1347

    [error 2017/07/21 01:07:28.999 UTC <DiskStoreMonitor> tid=62] The disk volume ds1
for disk store ds1 has exceeded the critical usage threshold and is 95% full

    -----------------------------------------------------------------------
    Found suspect string in log4j at line 1349

    [error 2017/07/21 01:07:29.000 UTC <DiskStoreMonitor> tid=62] A DiskAccessException
has occurred while writing to the disk for disk store ds1. The cache will be closed.
    org.apache.geode.cache.DiskAccessException: For DiskStore: ds1: Critical disk usage threshold
exceeded for volume <https://builds.apache.org/job/Geode-nightly-flaky/ws/geode-assembly/build/flakyTest/dunit/vm1/ds1>:
95% full
    	at org.apache.geode.internal.cache.DiskStoreMonitor$DirectoryHolderUsage.handleStateChange(DiskStoreMonitor.java:388)
    	at org.apache.geode.internal.cache.DiskStoreMonitor$DiskUsage.update(DiskStoreMonitor.java:297)
    	at org.apache.geode.internal.cache.DiskStoreMonitor.checkUsage(DiskStoreMonitor.java:201)
    	at org.apache.geode.internal.cache.DiskStoreMonitor.access$000(DiskStoreMonitor.java:39)
    	at org.apache.geode.internal.cache.DiskStoreMonitor$2.run(DiskStoreMonitor.java:135)
    	at java.util.concurrent.Executors$RunnableAdapter.call(Executors.java:511)
    	at java.util.concurrent.FutureTask.runAndReset(FutureTask.java:308)
    	at java.util.concurrent.ScheduledThreadPoolExecutor$ScheduledFutureTask.access$301(ScheduledThreadPoolExecutor.java:180)
    	at java.util.concurrent.ScheduledThreadPoolExecutor$ScheduledFutureTask.run(ScheduledThreadPoolExecutor.java:294)
    	at java.util.concurrent.ThreadPoolExecutor.runWorker(ThreadPoolExecutor.java:1142)
    	at java.util.concurrent.ThreadPoolExecutor$Worker.run(ThreadPoolExecutor.java:617)
    	at java.lang.Thread.run(Thread.java:748)

1 test completed, 1 failed
:geode-assembly:flakyTest FAILED
:geode-benchmarks:compileTestJava UP-TO-DATE
:geode-benchmarks:processTestResources UP-TO-DATE
:geode-benchmarks:testClasses UP-TO-DATE
:geode-benchmarks:flakyTest UP-TO-DATE
:geode-common:compileTestJava
:geode-common:processTestResources UP-TO-DATE
:geode-common:testClasses
:geode-common:flakyTest
:geode-core:flakyTest
:geode-cq:compileTestJavaNote: Some input files use or override a deprecated API.
Note: Recompile with -Xlint:deprecation for details.
Note: Some input files use unchecked or unsafe operations.
Note: Recompile with -Xlint:unchecked for details.

:geode-cq:processTestResources
:geode-cq:testClasses
:geode-cq:flakyTest
:geode-json:compileTestJava UP-TO-DATE
:geode-json:processTestResources
:geode-json:testClasses
:geode-json:flakyTest UP-TO-DATE
:geode-junit:compileTestJava
:geode-junit:processTestResources UP-TO-DATE
:geode-junit:testClasses
:geode-junit:flakyTest
:geode-lucene:compileTestJava
Download https://repo1.maven.org/maven2/org/apache/lucene/lucene-test-framework/6.4.1/lucene-test-framework-6.4.1.pom
Download https://repo1.maven.org/maven2/org/apache/lucene/lucene-codecs/6.4.1/lucene-codecs-6.4.1.pom
Download https://repo1.maven.org/maven2/org/apache/lucene/lucene-analyzers-phonetic/6.4.1/lucene-analyzers-phonetic-6.4.1.pom
Download https://repo1.maven.org/maven2/com/carrotsearch/randomizedtesting/randomizedtesting-runner/2.4.0/randomizedtesting-runner-2.4.0.pom
Download https://repo1.maven.org/maven2/com/carrotsearch/randomizedtesting/randomizedtesting-parent/2.4.0/randomizedtesting-parent-2.4.0.pom
Download https://repo1.maven.org/maven2/org/apache/lucene/lucene-test-framework/6.4.1/lucene-test-framework-6.4.1.jar
Download https://repo1.maven.org/maven2/org/apache/lucene/lucene-codecs/6.4.1/lucene-codecs-6.4.1.jar
Download https://repo1.maven.org/maven2/org/apache/lucene/lucene-analyzers-phonetic/6.4.1/lucene-analyzers-phonetic-6.4.1.jar
Download https://repo1.maven.org/maven2/com/carrotsearch/randomizedtesting/randomizedtesting-runner/2.4.0/randomizedtesting-runner-2.4.0.jar
Note: Some input files use or override a deprecated API.
Note: Recompile with -Xlint:deprecation for details.
Note: Some input files use unchecked or unsafe operations.
Note: Recompile with -Xlint:unchecked for details.
:geode-lucene:processTestResources
:geode-lucene:testClasses
:geode-lucene:flakyTest
:geode-old-client-support:compileTestJavaNote: <https://builds.apache.org/job/Geode-nightly-flaky/ws/geode-old-client-support/src/test/java/com/gemstone/gemfire/cache/execute/FunctionExceptionTest.java>
uses or overrides a deprecated API.
Note: Recompile with -Xlint:deprecation for details.

:geode-old-client-support:processTestResources UP-TO-DATE
:geode-old-client-support:testClasses
:geode-old-client-support:flakyTest
:geode-old-versions:compileTestJava UP-TO-DATE
:geode-old-versions:processTestResources UP-TO-DATE
:geode-old-versions:testClasses UP-TO-DATE
:geode-old-versions:flakyTest UP-TO-DATE
:geode-protobuf:extractIncludeTestProto
Download https://repo1.maven.org/maven2/org/powermock/powermock-api-mockito/1.7.0RC4/powermock-api-mockito-1.7.0RC4.pom
Download https://repo1.maven.org/maven2/org/powermock/powermock-api-mockito/1.7.0RC4/powermock-api-mockito-1.7.0RC4.jar
:geode-protobuf:extractTestProto
:geode-protobuf:generateTestProto UP-TO-DATE
:geode-protobuf:compileTestJavaNote: Some input files use unchecked or unsafe operations.
Note: Recompile with -Xlint:unchecked for details.

:geode-protobuf:processTestResources
:geode-protobuf:testClasses
:geode-protobuf:flakyTest
:geode-pulse:compileTestJava
Download https://repo1.maven.org/maven2/com/codeborne/phantomjsdriver/1.3.0/phantomjsdriver-1.3.0.pom
Download https://repo1.maven.org/maven2/com/codeborne/phantomjsdriver/1.3.0/phantomjsdriver-1.3.0.jar
Download https://repo1.maven.org/maven2/org/seleniumhq/selenium/selenium-api/3.0.1/selenium-api-3.0.1.jar
Download https://repo1.maven.org/maven2/org/seleniumhq/selenium/selenium-remote-driver/3.0.1/selenium-remote-driver-3.0.1.jar
Download https://repo1.maven.org/maven2/org/seleniumhq/selenium/selenium-support/3.0.1/selenium-support-3.0.1.jar
Note: Some input files use or override a deprecated API.
Note: Recompile with -Xlint:deprecation for details.
Note: <https://builds.apache.org/job/Geode-nightly-flaky/ws/geode-pulse/src/test/java/org/apache/geode/tools/pulse/controllers/PulseControllerJUnitTest.java>
uses unchecked or unsafe operations.
Note: Recompile with -Xlint:unchecked for details.
:geode-pulse:processTestResources
:geode-pulse:testClasses
:geode-pulse:flakyTest
:geode-rebalancer:compileTestJava
:geode-rebalancer:processTestResources UP-TO-DATE
:geode-rebalancer:testClasses
:geode-rebalancer:flakyTest
:geode-wan:compileTestJavaNote: Some input files use or override a deprecated API.
Note: Recompile with -Xlint:deprecation for details.
Note: Some input files use unchecked or unsafe operations.
Note: Recompile with -Xlint:unchecked for details.

:geode-wan:processTestResources
:geode-wan:testClasses
:geode-wan:flakyTest
:geode-web:compileTestJavaNote: Some input files use or override a deprecated API.
Note: Recompile with -Xlint:deprecation for details.
Note: <https://builds.apache.org/job/Geode-nightly-flaky/ws/geode-web/src/test/java/org/apache/geode/management/internal/web/AbstractWebTestCase.java>
uses unchecked or unsafe operations.
Note: Recompile with -Xlint:unchecked for details.

:geode-web:processTestResources UP-TO-DATE
:geode-web:testClasses
:geode-web:flakyTest
:geode-web-api:compileTestJava
:geode-web-api:processTestResources UP-TO-DATE
:geode-web-api:testClasses
:geode-web-api:flakyTest
:combineReports
All test reports at <https://builds.apache.org/job/Geode-nightly-flaky/ws/build/reports/combined>

FAILURE: Build failed with an exception.

* What went wrong:
Execution failed for task ':geode-assembly:flakyTest'.
> There were failing tests. See the report at: file://<https://builds.apache.org/job/Geode-nightly-flaky/ws/geode-assembly/build/reports/flakyTest/index.html>

* Try:
Run with --stacktrace option to get the stack trace. Run with --info or --debug option to
get more log output.

BUILD FAILED

Total time: 1 hrs 59 mins 46.727 secs
Build step 'Invoke Gradle script' changed build result to FAILURE
Build step 'Invoke Gradle script' marked build as failure
Archiving artifacts
Recording test results

Mime
View raw message