geode-dev mailing list archives

Site index · List index
Message view « Date » · « Thread »
Top « Date » · « Thread »
From Apache Jenkins Server <jenk...@builds.apache.org>
Subject Build failed in Jenkins: Geode-release-flaky #19
Date Wed, 28 Jun 2017 13:00:31 GMT
See <https://builds.apache.org/job/Geode-release-flaky/19/display/redirect?page=changes>

Changes:

[bschuchardt] GEODE-3072: Events do not get removed from the client queue for 1.0

------------------------------------------
[...truncated 98.55 KB...]
Download https://repo1.maven.org/maven2/io/swagger/swagger-models/1.5.10/swagger-models-1.5.10.pom
Download https://repo1.maven.org/maven2/io/springfox/springfox-spi/2.6.1/springfox-spi-2.6.1.pom
Download https://repo1.maven.org/maven2/io/springfox/springfox-schema/2.6.1/springfox-schema-2.6.1.pom
Download https://repo1.maven.org/maven2/io/springfox/springfox-swagger-common/2.6.1/springfox-swagger-common-2.6.1.pom
Download https://repo1.maven.org/maven2/io/springfox/springfox-spring-web/2.6.1/springfox-spring-web-2.6.1.pom
Download https://repo1.maven.org/maven2/com/fasterxml/classmate/1.3.1/classmate-1.3.1.pom
Download https://repo1.maven.org/maven2/org/springframework/plugin/spring-plugin-core/1.2.0.RELEASE/spring-plugin-core-1.2.0.RELEASE.pom
Download https://repo1.maven.org/maven2/org/springframework/plugin/spring-plugin/1.2.0.RELEASE/spring-plugin-1.2.0.RELEASE.pom
Download https://repo1.maven.org/maven2/org/springframework/plugin/spring-plugin-metadata/1.2.0.RELEASE/spring-plugin-metadata-1.2.0.RELEASE.pom
Download https://repo1.maven.org/maven2/org/mapstruct/mapstruct/1.0.0.Final/mapstruct-1.0.0.Final.pom
Download https://repo1.maven.org/maven2/org/mapstruct/mapstruct-parent/1.0.0.Final/mapstruct-parent-1.0.0.Final.pom
Download https://repo1.maven.org/maven2/com/thoughtworks/paranamer/paranamer/2.8/paranamer-2.8.pom
Download https://repo1.maven.org/maven2/com/thoughtworks/paranamer/paranamer-parent/2.8/paranamer-parent-2.8.pom
Download https://repo1.maven.org/maven2/io/springfox/springfox-core/2.6.1/springfox-core-2.6.1.pom
Download https://repo1.maven.org/maven2/com/fasterxml/jackson/module/jackson-module-scala_2.10/2.8.6/jackson-module-scala_2.10-2.8.6.jar
Download https://repo1.maven.org/maven2/io/springfox/springfox-swagger2/2.6.1/springfox-swagger2-2.6.1.jar
Download https://repo1.maven.org/maven2/io/springfox/springfox-swagger-ui/2.6.1/springfox-swagger-ui-2.6.1.jar
Download https://repo1.maven.org/maven2/org/springframework/hateoas/spring-hateoas/0.23.0.RELEASE/spring-hateoas-0.23.0.RELEASE.jar
Download https://repo1.maven.org/maven2/org/scala-lang/scala-library/2.10.6/scala-library-2.10.6.jar
Download https://repo1.maven.org/maven2/org/scala-lang/scala-reflect/2.10.6/scala-reflect-2.10.6.jar
Download https://repo1.maven.org/maven2/com/fasterxml/jackson/module/jackson-module-paranamer/2.8.6/jackson-module-paranamer-2.8.6.jar
Download https://repo1.maven.org/maven2/io/swagger/swagger-annotations/1.5.10/swagger-annotations-1.5.10.jar
Download https://repo1.maven.org/maven2/io/swagger/swagger-models/1.5.10/swagger-models-1.5.10.jar
Download https://repo1.maven.org/maven2/io/springfox/springfox-spi/2.6.1/springfox-spi-2.6.1.jar
Download https://repo1.maven.org/maven2/io/springfox/springfox-schema/2.6.1/springfox-schema-2.6.1.jar
Download https://repo1.maven.org/maven2/io/springfox/springfox-swagger-common/2.6.1/springfox-swagger-common-2.6.1.jar
Download https://repo1.maven.org/maven2/io/springfox/springfox-spring-web/2.6.1/springfox-spring-web-2.6.1.jar
Download https://repo1.maven.org/maven2/org/springframework/plugin/spring-plugin-core/1.2.0.RELEASE/spring-plugin-core-1.2.0.RELEASE.jar
Download https://repo1.maven.org/maven2/org/springframework/plugin/spring-plugin-metadata/1.2.0.RELEASE/spring-plugin-metadata-1.2.0.RELEASE.jar
Download https://repo1.maven.org/maven2/org/mapstruct/mapstruct/1.0.0.Final/mapstruct-1.0.0.Final.jar
Download https://repo1.maven.org/maven2/com/thoughtworks/paranamer/paranamer/2.8/paranamer-2.8.jar
Download https://repo1.maven.org/maven2/io/springfox/springfox-core/2.6.1/springfox-core-2.6.1.jar
Note: Some input files use unchecked or unsafe operations.
Note: Recompile with -Xlint:unchecked for details.
:geode-web-api:processResources
:geode-web-api:classes
:geode-assembly:docs
:geode-assembly:gfshDepsJar
:geode-common:javadocJar
:geode-common:sourcesJar
:geode-common:signArchives SKIPPED
:geode-core:javadocJar
:geode-core:raJar
:geode-core:jcaJar
:geode-core:sourcesJar
:geode-core:signArchives SKIPPED
:geode-core:webJar
:geode-cq:jar
:geode-cq:javadoc
:geode-cq:javadocJar
:geode-cq:sourcesJar
:geode-cq:signArchives SKIPPED
:geode-json:javadocJar
:geode-json:sourcesJar
:geode-json:signArchives SKIPPED
:geode-lucene:jar
:geode-lucene:javadoc
:geode-lucene:javadocJar
:geode-lucene:sourcesJar
:geode-lucene:signArchives SKIPPED
:geode-old-client-support:jar
:geode-old-client-support:javadoc
:geode-old-client-support:javadocJar
:geode-old-client-support:sourcesJar
:geode-old-client-support:signArchives SKIPPED
:geode-pulse:javadoc
:geode-pulse:javadocJar
:geode-pulse:sourcesJar
:geode-pulse:war
:geode-pulse:signArchives SKIPPED
:geode-rebalancer:jar
:geode-rebalancer:javadoc
:geode-rebalancer:javadocJar
:geode-rebalancer:sourcesJar
:geode-rebalancer:signArchives SKIPPED
:geode-wan:jar
:geode-wan:javadoc
:geode-wan:javadocJar
:geode-wan:sourcesJar
:geode-wan:signArchives SKIPPED
:geode-web:javadoc UP-TO-DATE
:geode-web:javadocJar
:geode-web:sourcesJar
:geode-web:war
:geode-web:signArchives SKIPPED
:geode-web-api:javadoc
:geode-web-api:javadocJar
:geode-web-api:sourcesJar
:geode-web-api:war
:geode-web-api:signArchives SKIPPED
:geode-assembly:installDist
:geode-pulse:jar
:geode-assembly:compileTestJavaNote: Some input files use or override a deprecated API.
Note: Recompile with -Xlint:deprecation for details.
Note: Some input files use unchecked or unsafe operations.
Note: Recompile with -Xlint:unchecked for details.

:geode-assembly:processTestResources
:geode-assembly:testClasses
:geode-assembly:flakyTest
:geode-benchmarks:compileTestJava UP-TO-DATE
:geode-benchmarks:processTestResources UP-TO-DATE
:geode-benchmarks:testClasses UP-TO-DATE
:geode-benchmarks:flakyTest UP-TO-DATE
:geode-common:compileTestJava
:geode-common:processTestResources UP-TO-DATE
:geode-common:testClasses
:geode-common:flakyTest
:geode-core:flakyTest

org.apache.geode.internal.cache.partitioned.PersistentPartitionedRegionDUnitTest > testBug42226
FAILED
    java.lang.AssertionError: An exception occurred during asynchronous invocation.
        at org.apache.geode.test.dunit.AsyncInvocation.checkException(AsyncInvocation.java:148)
        at org.apache.geode.test.dunit.AsyncInvocation.get(AsyncInvocation.java:422)
        at org.apache.geode.test.dunit.AsyncInvocation.getResult(AsyncInvocation.java:193)
        at org.apache.geode.internal.cache.partitioned.PersistentPartitionedRegionDUnitTest.testBug42226(PersistentPartitionedRegionDUnitTest.java:1763)

        Caused by:
        org.apache.geode.cache.CacheClosedException: The cache is closed.

283 tests completed, 1 failed, 6 skipped
:geode-core:flakyTest FAILED
:geode-cq:compileTestJavaNote: Some input files use or override a deprecated API.
Note: Recompile with -Xlint:deprecation for details.
Note: Some input files use unchecked or unsafe operations.
Note: Recompile with -Xlint:unchecked for details.

:geode-cq:processTestResources
:geode-cq:testClasses
:geode-cq:flakyTest
:geode-json:compileTestJava UP-TO-DATE
:geode-json:processTestResources
:geode-json:testClasses
:geode-json:flakyTest UP-TO-DATE
:geode-junit:compileTestJava
:geode-junit:processTestResources UP-TO-DATE
:geode-junit:testClasses
:geode-junit:flakyTest
:geode-lucene:compileTestJava
Download https://repo1.maven.org/maven2/org/apache/lucene/lucene-test-framework/6.4.1/lucene-test-framework-6.4.1.pom
Download https://repo1.maven.org/maven2/org/apache/lucene/lucene-codecs/6.4.1/lucene-codecs-6.4.1.pom
Download https://repo1.maven.org/maven2/org/apache/lucene/lucene-analyzers-phonetic/6.4.1/lucene-analyzers-phonetic-6.4.1.pom
Download https://repo1.maven.org/maven2/com/carrotsearch/randomizedtesting/randomizedtesting-runner/2.4.0/randomizedtesting-runner-2.4.0.pom
Download https://repo1.maven.org/maven2/com/carrotsearch/randomizedtesting/randomizedtesting-parent/2.4.0/randomizedtesting-parent-2.4.0.pom
Download https://repo1.maven.org/maven2/org/apache/lucene/lucene-test-framework/6.4.1/lucene-test-framework-6.4.1.jar
Download https://repo1.maven.org/maven2/org/apache/lucene/lucene-codecs/6.4.1/lucene-codecs-6.4.1.jar
Download https://repo1.maven.org/maven2/org/apache/lucene/lucene-analyzers-phonetic/6.4.1/lucene-analyzers-phonetic-6.4.1.jar
Download https://repo1.maven.org/maven2/com/carrotsearch/randomizedtesting/randomizedtesting-runner/2.4.0/randomizedtesting-runner-2.4.0.jar
Note: Some input files use or override a deprecated API.
Note: Recompile with -Xlint:deprecation for details.
Note: Some input files use unchecked or unsafe operations.
Note: Recompile with -Xlint:unchecked for details.
:geode-lucene:processTestResources
:geode-lucene:testClasses
:geode-lucene:flakyTest
:geode-old-client-support:compileTestJavaNote: <https://builds.apache.org/job/Geode-release-flaky/ws/geode-old-client-support/src/test/java/com/gemstone/gemfire/cache/execute/FunctionExceptionTest.java>
uses or overrides a deprecated API.
Note: Recompile with -Xlint:deprecation for details.

:geode-old-client-support:processTestResources UP-TO-DATE
:geode-old-client-support:testClasses
:geode-old-client-support:flakyTest
:geode-old-versions:compileTestJava UP-TO-DATE
:geode-old-versions:processTestResources UP-TO-DATE
:geode-old-versions:testClasses UP-TO-DATE
:geode-old-versions:flakyTest UP-TO-DATE
:geode-pulse:compileTestJava
Download https://repo1.maven.org/maven2/com/codeborne/phantomjsdriver/1.3.0/phantomjsdriver-1.3.0.pom
Download https://repo1.maven.org/maven2/org/springframework/spring-test/4.3.6.RELEASE/spring-test-4.3.6.RELEASE.pom
Download https://repo1.maven.org/maven2/com/codeborne/phantomjsdriver/1.3.0/phantomjsdriver-1.3.0.jar
Download https://repo1.maven.org/maven2/org/seleniumhq/selenium/selenium-api/3.0.1/selenium-api-3.0.1.jar
Download https://repo1.maven.org/maven2/org/seleniumhq/selenium/selenium-remote-driver/3.0.1/selenium-remote-driver-3.0.1.jar
Download https://repo1.maven.org/maven2/org/seleniumhq/selenium/selenium-support/3.0.1/selenium-support-3.0.1.jar
Download https://repo1.maven.org/maven2/org/springframework/spring-test/4.3.6.RELEASE/spring-test-4.3.6.RELEASE.jar
Note: <https://builds.apache.org/job/Geode-release-flaky/ws/geode-pulse/src/test/java/org/apache/geode/tools/pulse/tests/ui/PulseBase.java>
uses or overrides a deprecated API.
Note: Recompile with -Xlint:deprecation for details.
Note: <https://builds.apache.org/job/Geode-release-flaky/ws/geode-pulse/src/test/java/org/apache/geode/tools/pulse/controllers/PulseControllerJUnitTest.java>
uses unchecked or unsafe operations.
Note: Recompile with -Xlint:unchecked for details.
:geode-pulse:processTestResources
:geode-pulse:testClasses
:geode-pulse:flakyTest
:geode-rebalancer:compileTestJava
:geode-rebalancer:processTestResources UP-TO-DATE
:geode-rebalancer:testClasses
:geode-rebalancer:flakyTest
:geode-wan:compileTestJavaNote: Some input files use or override a deprecated API.
Note: Recompile with -Xlint:deprecation for details.
Note: Some input files use unchecked or unsafe operations.
Note: Recompile with -Xlint:unchecked for details.

:geode-wan:processTestResources
:geode-wan:testClasses
:geode-wan:flakyTest

org.apache.geode.internal.cache.wan.offheap.SerialWANPropagationOffHeapDUnitTest > testReplicatedSerialPropagationWithRemoteReceiverStopped
FAILED
    java.lang.AssertionError: An exception occurred during asynchronous invocation.

        Caused by:
        java.rmi.ConnectException: Connection refused to host: 10.20.2.231; nested exception
is: 
        	java.net.ConnectException: Connection refused (Connection refused)

            Caused by:
            java.net.ConnectException: Connection refused (Connection refused)

21 tests completed, 1 failed
:geode-wan:flakyTest FAILED
:geode-web:compileTestJavaNote: Some input files use or override a deprecated API.
Note: Recompile with -Xlint:deprecation for details.
Note: Some input files use unchecked or unsafe operations.
Note: Recompile with -Xlint:unchecked for details.

:geode-web:processTestResources UP-TO-DATE
:geode-web:testClasses
:geode-web:flakyTest
:geode-web-api:compileTestJava
:geode-web-api:processTestResources UP-TO-DATE
:geode-web-api:testClasses
:geode-web-api:flakyTest
:combineReports
All test reports at <https://builds.apache.org/job/Geode-release-flaky/ws/build/reports/combined>

FAILURE: Build completed with 2 failures.

1: Task failed with an exception.
-----------
* What went wrong:
Execution failed for task ':geode-core:flakyTest'.
> There were failing tests. See the report at: file://<https://builds.apache.org/job/Geode-release-flaky/ws/geode-core/build/reports/flakyTest/index.html>

* Try:
Run with --stacktrace option to get the stack trace. Run with --info or --debug option to
get more log output.
==============================================================================

2: Task failed with an exception.
-----------
* What went wrong:
Execution failed for task ':geode-wan:flakyTest'.
> There were failing tests. See the report at: file://<https://builds.apache.org/job/Geode-release-flaky/ws/geode-wan/build/reports/flakyTest/index.html>

* Try:
Run with --stacktrace option to get the stack trace. Run with --info or --debug option to
get more log output.
==============================================================================

BUILD FAILED

Total time: 1 hrs 52 mins 52.332 secs
Build step 'Invoke Gradle script' changed build result to FAILURE
Build step 'Invoke Gradle script' marked build as failure
Archiving artifacts
Recording test results

Mime
View raw message