geode-dev mailing list archives

Site index · List index
Message view « Date » · « Thread »
Top « Date » · « Thread »
From Apache Jenkins Server <jenk...@builds.apache.org>
Subject Build failed in Jenkins: Geode-release-flaky #14
Date Wed, 14 Jun 2017 20:44:16 GMT
See <https://builds.apache.org/job/Geode-release-flaky/14/display/redirect?page=changes>

Changes:

[jiliao] GEODE-2294: revert to avoid rest protocol change

[abaker] Update LICENSE after review

[abaker] GEODE-3024 race condition between server locator preparing membership

[abaker] GEODE-3024 race condition between server locator preparing membership

------------------------------------------
[...truncated 114.09 KB...]
:geode-assembly:testClasses
:geode-assembly:flakyTest

org.apache.geode.management.internal.configuration.ClusterConfigurationServiceEndToEndDUnitTest
> testStartServerAndExecuteCommands FAILED
    java.lang.AssertionError: expected:<OK> but was:<ERROR>
        at org.junit.Assert.fail(Assert.java:88)
        at org.junit.Assert.failNotEquals(Assert.java:834)
        at org.junit.Assert.assertEquals(Assert.java:118)
        at org.junit.Assert.assertEquals(Assert.java:144)
        at org.apache.geode.management.internal.configuration.ClusterConfigurationServiceEndToEndDUnitTest.startServers(ClusterConfigurationServiceEndToEndDUnitTest.java:158)
        at org.apache.geode.management.internal.configuration.ClusterConfigurationServiceEndToEndDUnitTest.testStartServerAndExecuteCommands(ClusterConfigurationServiceEndToEndDUnitTest.java:131)

1 test completed, 1 failed
:geode-assembly:flakyTest FAILED
:geode-benchmarks:compileTestJava UP-TO-DATE
:geode-benchmarks:processTestResources UP-TO-DATE
:geode-benchmarks:testClasses UP-TO-DATE
:geode-benchmarks:flakyTest UP-TO-DATE
:geode-common:compileTestJava
:geode-common:processTestResources UP-TO-DATE
:geode-common:testClasses
:geode-common:flakyTest
:geode-core:flakyTest

org.apache.geode.internal.cache.execute.FunctionServiceMultipleOnMemberDUnitTest > classMethod
FAILED
    java.lang.RuntimeException: Unable to launch dunit VMs

        Caused by:
        java.lang.RuntimeException: VMs did not start up within 120 seconds

282 tests completed, 1 failed, 6 skipped
:geode-core:flakyTest FAILED
:geode-cq:compileTestJavaNote: Some input files use or override a deprecated API.
Note: Recompile with -Xlint:deprecation for details.
Note: Some input files use unchecked or unsafe operations.
Note: Recompile with -Xlint:unchecked for details.

:geode-cq:processTestResources
:geode-cq:testClasses
:geode-cq:flakyTest
:geode-json:compileTestJava UP-TO-DATE
:geode-json:processTestResources
:geode-json:testClasses
:geode-json:flakyTest UP-TO-DATE
:geode-junit:compileTestJava
:geode-junit:processTestResources UP-TO-DATE
:geode-junit:testClasses
:geode-junit:flakyTest
:geode-lucene:compileTestJava
Download https://repo1.maven.org/maven2/org/apache/lucene/lucene-test-framework/6.4.1/lucene-test-framework-6.4.1.pom
Download https://repo1.maven.org/maven2/org/apache/lucene/lucene-codecs/6.4.1/lucene-codecs-6.4.1.pom
Download https://repo1.maven.org/maven2/org/apache/lucene/lucene-analyzers-phonetic/6.4.1/lucene-analyzers-phonetic-6.4.1.pom
Download https://repo1.maven.org/maven2/com/carrotsearch/randomizedtesting/randomizedtesting-runner/2.4.0/randomizedtesting-runner-2.4.0.pom
Download https://repo1.maven.org/maven2/com/carrotsearch/randomizedtesting/randomizedtesting-parent/2.4.0/randomizedtesting-parent-2.4.0.pom
Download https://repo1.maven.org/maven2/org/apache/lucene/lucene-test-framework/6.4.1/lucene-test-framework-6.4.1.jar
Download https://repo1.maven.org/maven2/org/apache/lucene/lucene-codecs/6.4.1/lucene-codecs-6.4.1.jar
Download https://repo1.maven.org/maven2/org/apache/lucene/lucene-analyzers-phonetic/6.4.1/lucene-analyzers-phonetic-6.4.1.jar
Download https://repo1.maven.org/maven2/com/carrotsearch/randomizedtesting/randomizedtesting-runner/2.4.0/randomizedtesting-runner-2.4.0.jar
Note: Some input files use or override a deprecated API.
Note: Recompile with -Xlint:deprecation for details.
Note: Some input files use unchecked or unsafe operations.
Note: Recompile with -Xlint:unchecked for details.
:geode-lucene:processTestResources
:geode-lucene:testClasses
:geode-lucene:flakyTest
:geode-old-client-support:compileTestJavaNote: <https://builds.apache.org/job/Geode-release-flaky/ws/geode-old-client-support/src/test/java/com/gemstone/gemfire/cache/execute/FunctionExceptionTest.java>
uses or overrides a deprecated API.
Note: Recompile with -Xlint:deprecation for details.

:geode-old-client-support:processTestResources UP-TO-DATE
:geode-old-client-support:testClasses
:geode-old-client-support:flakyTest
:geode-old-versions:compileTestJava UP-TO-DATE
:geode-old-versions:processTestResources UP-TO-DATE
:geode-old-versions:testClasses UP-TO-DATE
:geode-old-versions:flakyTest UP-TO-DATE
:geode-pulse:compileTestJava
Download https://repo1.maven.org/maven2/com/codeborne/phantomjsdriver/1.3.0/phantomjsdriver-1.3.0.pom
Download https://repo1.maven.org/maven2/org/springframework/spring-test/4.3.6.RELEASE/spring-test-4.3.6.RELEASE.pom
Download https://repo1.maven.org/maven2/com/codeborne/phantomjsdriver/1.3.0/phantomjsdriver-1.3.0.jar
Download https://repo1.maven.org/maven2/org/seleniumhq/selenium/selenium-api/3.0.1/selenium-api-3.0.1.jar
Download https://repo1.maven.org/maven2/org/seleniumhq/selenium/selenium-remote-driver/3.0.1/selenium-remote-driver-3.0.1.jar
Download https://repo1.maven.org/maven2/org/seleniumhq/selenium/selenium-support/3.0.1/selenium-support-3.0.1.jar
Download https://repo1.maven.org/maven2/org/springframework/spring-test/4.3.6.RELEASE/spring-test-4.3.6.RELEASE.jar
Note: <https://builds.apache.org/job/Geode-release-flaky/ws/geode-pulse/src/test/java/org/apache/geode/tools/pulse/tests/ui/PulseBase.java>
uses or overrides a deprecated API.
Note: Recompile with -Xlint:deprecation for details.
Note: <https://builds.apache.org/job/Geode-release-flaky/ws/geode-pulse/src/test/java/org/apache/geode/tools/pulse/controllers/PulseControllerJUnitTest.java>
uses unchecked or unsafe operations.
Note: Recompile with -Xlint:unchecked for details.
:geode-pulse:processTestResources
:geode-pulse:testClasses
:geode-pulse:flakyTest
:geode-rebalancer:compileTestJava
:geode-rebalancer:processTestResources UP-TO-DATE
:geode-rebalancer:testClasses
:geode-rebalancer:flakyTest
:geode-wan:compileTestJavaNote: Some input files use or override a deprecated API.
Note: Recompile with -Xlint:deprecation for details.
Note: Some input files use unchecked or unsafe operations.
Note: Recompile with -Xlint:unchecked for details.

:geode-wan:processTestResources
:geode-wan:testClasses
:geode-wan:flakyTest

org.apache.geode.internal.cache.wan.parallel.ParallelWANPropagationDUnitTest > testParallelPropagationWithLocalCacheClosedAndRebuilt
FAILED
    org.apache.geode.test.dunit.RMIException: While invoking org.apache.geode.internal.cache.wan.parallel.ParallelWANPropagationDUnitTest$$Lambda$18/632734625.call
in VM 0 running on Host jenkins-ubuntu2.apache.org with 8 VMs
        at org.apache.geode.test.dunit.VM.invoke(VM.java:377)
        at org.apache.geode.test.dunit.VM.invoke(VM.java:347)
        at org.apache.geode.test.dunit.VM.invoke(VM.java:315)
        at org.apache.geode.internal.cache.wan.parallel.ParallelWANPropagationDUnitTest.testParallelPropagationWithLocalCacheClosedAndRebuilt(ParallelWANPropagationDUnitTest.java:291)

        Caused by:
        java.lang.OutOfMemoryError: Failed creating 314572800 bytes of off-heap memory during
cache creation.
            at org.apache.geode.internal.offheap.AddressableMemoryManager.allocate(AddressableMemoryManager.java:64)
            at org.apache.geode.internal.offheap.SlabImpl.<init>(SlabImpl.java:35)
            at org.apache.geode.internal.offheap.SlabImpl.<init>(SlabImpl.java:27)
            at org.apache.geode.internal.offheap.MemoryAllocatorImpl$1.create(MemoryAllocatorImpl.java:93)
            at org.apache.geode.internal.offheap.MemoryAllocatorImpl.create(MemoryAllocatorImpl.java:122)
            at org.apache.geode.internal.offheap.MemoryAllocatorImpl.create(MemoryAllocatorImpl.java:89)
            at org.apache.geode.internal.offheap.OffHeapStorage.basicCreateOffHeapStorage(OffHeapStorage.java:219)
            at org.apache.geode.internal.offheap.OffHeapStorage.createOffHeapStorage(OffHeapStorage.java:207)
            at org.apache.geode.distributed.internal.InternalDistributedSystem.initialize(InternalDistributedSystem.java:657)
            at org.apache.geode.distributed.internal.InternalDistributedSystem.newInstance(InternalDistributedSystem.java:305)
            at org.apache.geode.distributed.DistributedSystem.connect(DistributedSystem.java:205)
            at org.apache.geode.test.dunit.internal.JUnit4DistributedTestCase.getSystem(JUnit4DistributedTestCase.java:198)
            at org.apache.geode.internal.cache.wan.WANTestBase.createFirstLocatorWithDSId(WANTestBase.java:283)
            at org.apache.geode.internal.cache.wan.parallel.ParallelWANPropagationDUnitTest.lambda$testParallelPropagationWithLocalCacheClosedAndRebuilt$a2e85a4$1(ParallelWANPropagationDUnitTest.java:291)
Process 'Gradle Test Executor 1729' finished with non-zero exit value 137
org.gradle.process.internal.ExecException: Process 'Gradle Test Executor 1729' finished with
non-zero exit value 137
	at org.gradle.process.internal.DefaultExecHandle$ExecResultImpl.assertNormalExitValue(DefaultExecHandle.java:367)
	at org.gradle.process.internal.worker.DefaultWorkerProcess.waitForStop(DefaultWorkerProcess.java:165)
	at org.gradle.api.internal.tasks.testing.worker.ForkingTestClassProcessor.stop(ForkingTestClassProcessor.java:114)
	at org.gradle.api.internal.tasks.testing.processors.RestartEveryNTestClassProcessor.endBatch(RestartEveryNTestClassProcessor.java:63)
	at org.gradle.api.internal.tasks.testing.processors.RestartEveryNTestClassProcessor.processTestClass(RestartEveryNTestClassProcessor.java:50)
	at sun.reflect.GeneratedMethodAccessor464.invoke(Unknown Source)
	at sun.reflect.DelegatingMethodAccessorImpl.invoke(DelegatingMethodAccessorImpl.java:43)
	at java.lang.reflect.Method.invoke(Method.java:498)
	at org.gradle.internal.dispatch.ReflectionDispatch.dispatch(ReflectionDispatch.java:35)
	at org.gradle.internal.dispatch.ReflectionDispatch.dispatch(ReflectionDispatch.java:24)
	at org.gradle.internal.dispatch.FailureHandlingDispatch.dispatch(FailureHandlingDispatch.java:29)
	at org.gradle.internal.dispatch.AsyncDispatch.dispatchMessages(AsyncDispatch.java:132)
	at org.gradle.internal.dispatch.AsyncDispatch.access$000(AsyncDispatch.java:33)
	at org.gradle.internal.dispatch.AsyncDispatch$1.run(AsyncDispatch.java:72)
	at org.gradle.internal.concurrent.ExecutorPolicy$CatchAndRecordFailures.onExecute(ExecutorPolicy.java:54)
	at org.gradle.internal.concurrent.StoppableExecutorImpl$1.run(StoppableExecutorImpl.java:40)
	at java.util.concurrent.ThreadPoolExecutor.runWorker(ThreadPoolExecutor.java:1142)
	at java.util.concurrent.ThreadPoolExecutor$Worker.run(ThreadPoolExecutor.java:617)
	at java.lang.Thread.run(Thread.java:748)

org.apache.geode.internal.cache.wan.parallel.ParallelWANPropagationDUnitTest > testParallelPropagationWithOverflow
FAILED
    org.apache.geode.test.dunit.RMIException: While invoking org.apache.geode.internal.cache.wan.parallel.ParallelWANPropagationDUnitTest$$Lambda$27/1835065816.call
in VM 0 running on Host jenkins-ubuntu2.apache.org with 8 VMs
        at org.apache.geode.test.dunit.VM.invoke(VM.java:377)
        at org.apache.geode.test.dunit.VM.invoke(VM.java:347)
        at org.apache.geode.test.dunit.VM.invoke(VM.java:315)
        at org.apache.geode.internal.cache.wan.parallel.ParallelWANPropagationDUnitTest.testParallelPropagationWithOverflow(ParallelWANPropagationDUnitTest.java:466)

        Caused by:
        java.lang.OutOfMemoryError: Failed creating 314572800 bytes of off-heap memory during
cache creation.
            at org.apache.geode.internal.offheap.AddressableMemoryManager.allocate(AddressableMemoryManager.java:64)
            at org.apache.geode.internal.offheap.SlabImpl.<init>(SlabImpl.java:35)
            at org.apache.geode.internal.offheap.SlabImpl.<init>(SlabImpl.java:27)
            at org.apache.geode.internal.offheap.MemoryAllocatorImpl$1.create(MemoryAllocatorImpl.java:93)
            at org.apache.geode.internal.offheap.MemoryAllocatorImpl.create(MemoryAllocatorImpl.java:122)
            at org.apache.geode.internal.offheap.MemoryAllocatorImpl.create(MemoryAllocatorImpl.java:89)
            at org.apache.geode.internal.offheap.OffHeapStorage.basicCreateOffHeapStorage(OffHeapStorage.java:219)
            at org.apache.geode.internal.offheap.OffHeapStorage.createOffHeapStorage(OffHeapStorage.java:207)
            at org.apache.geode.distributed.internal.InternalDistributedSystem.initialize(InternalDistributedSystem.java:657)
            at org.apache.geode.distributed.internal.InternalDistributedSystem.newInstance(InternalDistributedSystem.java:305)
            at org.apache.geode.distributed.DistributedSystem.connect(DistributedSystem.java:205)
            at org.apache.geode.test.dunit.internal.JUnit4DistributedTestCase.getSystem(JUnit4DistributedTestCase.java:198)
            at org.apache.geode.internal.cache.wan.WANTestBase.createFirstLocatorWithDSId(WANTestBase.java:283)
            at org.apache.geode.internal.cache.wan.parallel.ParallelWANPropagationDUnitTest.lambda$testParallelPropagationWithOverflow$a2e85a4$1(ParallelWANPropagationDUnitTest.java:466)
Process 'Gradle Test Executor 1731' finished with non-zero exit value 137
org.gradle.process.internal.ExecException: Process 'Gradle Test Executor 1731' finished with
non-zero exit value 137
	at org.gradle.process.internal.DefaultExecHandle$ExecResultImpl.assertNormalExitValue(DefaultExecHandle.java:367)
	at org.gradle.process.internal.worker.DefaultWorkerProcess.waitForStop(DefaultWorkerProcess.java:165)
	at org.gradle.api.internal.tasks.testing.worker.ForkingTestClassProcessor.stop(ForkingTestClassProcessor.java:114)
	at org.gradle.api.internal.tasks.testing.processors.RestartEveryNTestClassProcessor.endBatch(RestartEveryNTestClassProcessor.java:63)
	at org.gradle.api.internal.tasks.testing.processors.RestartEveryNTestClassProcessor.processTestClass(RestartEveryNTestClassProcessor.java:50)
	at sun.reflect.GeneratedMethodAccessor464.invoke(Unknown Source)
	at sun.reflect.DelegatingMethodAccessorImpl.invoke(DelegatingMethodAccessorImpl.java:43)
	at java.lang.reflect.Method.invoke(Method.java:498)
	at org.gradle.internal.dispatch.ReflectionDispatch.dispatch(ReflectionDispatch.java:35)
	at org.gradle.internal.dispatch.ReflectionDispatch.dispatch(ReflectionDispatch.java:24)
	at org.gradle.internal.dispatch.FailureHandlingDispatch.dispatch(FailureHandlingDispatch.java:29)
	at org.gradle.internal.dispatch.AsyncDispatch.dispatchMessages(AsyncDispatch.java:132)
	at org.gradle.internal.dispatch.AsyncDispatch.access$000(AsyncDispatch.java:33)
	at org.gradle.internal.dispatch.AsyncDispatch$1.run(AsyncDispatch.java:72)
	at org.gradle.internal.concurrent.ExecutorPolicy$CatchAndRecordFailures.onExecute(ExecutorPolicy.java:54)
	at org.gradle.internal.concurrent.StoppableExecutorImpl$1.run(StoppableExecutorImpl.java:40)
	at java.util.concurrent.ThreadPoolExecutor.runWorker(ThreadPoolExecutor.java:1142)
	at java.util.concurrent.ThreadPoolExecutor$Worker.run(ThreadPoolExecutor.java:617)
	at java.lang.Thread.run(Thread.java:748)

19 tests completed, 2 failed
:geode-wan:flakyTest FAILED
:geode-web:compileTestJavaNote: Some input files use or override a deprecated API.
Note: Recompile with -Xlint:deprecation for details.
Note: Some input files use unchecked or unsafe operations.
Note: Recompile with -Xlint:unchecked for details.

:geode-web:processTestResources UP-TO-DATE
:geode-web:testClasses
:geode-web:flakyTest
:geode-web-api:compileTestJava
:geode-web-api:processTestResources UP-TO-DATE
:geode-web-api:testClasses
:geode-web-api:flakyTest
:combineReports
All test reports at <https://builds.apache.org/job/Geode-release-flaky/ws/build/reports/combined>

FAILURE: Build completed with 3 failures.

1: Task failed with an exception.
-----------
* What went wrong:
Execution failed for task ':geode-assembly:flakyTest'.
> There were failing tests. See the report at: file://<https://builds.apache.org/job/Geode-release-flaky/ws/geode-assembly/build/reports/flakyTest/index.html>

* Try:
Run with --stacktrace option to get the stack trace. Run with --info or --debug option to
get more log output.
==============================================================================

2: Task failed with an exception.
-----------
* What went wrong:
Execution failed for task ':geode-core:flakyTest'.
> There were failing tests. See the report at: file://<https://builds.apache.org/job/Geode-release-flaky/ws/geode-core/build/reports/flakyTest/index.html>

* Try:
Run with --stacktrace option to get the stack trace. Run with --info or --debug option to
get more log output.
==============================================================================

3: Task failed with an exception.
-----------
* What went wrong:
Execution failed for task ':geode-wan:flakyTest'.
> Process 'Gradle Test Executor 1726' finished with non-zero exit value 137

* Try:
Run with --stacktrace option to get the stack trace. Run with --info or --debug option to
get more log output.
==============================================================================

BUILD FAILED

Total time: 1 hrs 50 mins 7.151 secs
Build step 'Invoke Gradle script' changed build result to FAILURE
Build step 'Invoke Gradle script' marked build as failure
Archiving artifacts
Recording test results

Mime
View raw message