geode-dev mailing list archives

Site index · List index
Message view « Date » · « Thread »
Top « Date » · « Thread »
From Apache Jenkins Server <jenk...@builds.apache.org>
Subject Build failed in Jenkins: Geode-release #56
Date Wed, 07 Jun 2017 16:49:59 GMT
See <https://builds.apache.org/job/Geode-release/56/display/redirect?page=changes>

Changes:

[jiliao] GEODE-2981: Fix the line feed code of the test expected value

[jiliao] GEODE-3033: Fixing NPE when jarFileNames is null in

[dbarnes] GEODE-3044: User Manual: Update Swagger example and screen shots This

------------------------------------------
[...truncated 98.42 KB...]
:geode-benchmarks:check
:geode-benchmarks:build
:geode-benchmarks:distributedTest UP-TO-DATE
:geode-benchmarks:integrationTest UP-TO-DATE
:geode-common:assemble
:geode-common:compileTestJava
:geode-common:processTestResources UP-TO-DATE
:geode-common:testClasses
:geode-common:checkMissedTests
:geode-common:spotlessJavaCheck
:geode-common:spotlessCheck
:geode-common:test
:geode-common:check
:geode-common:build
:geode-common:distributedTest
:geode-common:integrationTest
:geode-core:assemble
:geode-core:checkMissedTests
:geode-core:spotlessJavaCheck
:geode-core:spotlessCheck
:geode-core:test
:geode-core:check
:geode-core:build
:geode-core:distributedTest
:geode-core:integrationTest

org.apache.geode.redis.RedisServerTest > initializeRedisCreatesRegionsUsingSystemProperty
FAILED
    java.lang.RuntimeException: Could not start Server
        at org.apache.geode.redis.GeodeRedisServer.start(GeodeRedisServer.java:387)
        at org.apache.geode.redis.RedisServerTest.initializeRedisCreatesRegionsUsingSystemProperty(RedisServerTest.java:78)

        Caused by:
        java.net.BindException: Address already in use

    java.lang.NullPointerException
        at org.apache.geode.redis.GeodeRedisServer.shutdown(GeodeRedisServer.java:629)
        at org.apache.geode.redis.RedisServerTest.teardown(RedisServerTest.java:46)

org.apache.geode.redis.RedisServerTest > initializeRedisCreatesThreeRegions FAILED
    java.lang.AssertionError
        at org.apache.geode.redis.RedisServerTest.initializeRedisCreatesThreeRegions(RedisServerTest.java:54)

org.apache.geode.redis.RedisServerTest > initializeRedisCreatesPartitionedRegionByDefault
FAILED
    java.lang.AssertionError
        at org.apache.geode.redis.RedisServerTest.initializeRedisCreatesPartitionedRegionByDefault(RedisServerTest.java:64)

3567 tests completed, 3 failed, 163 skipped
:geode-core:integrationTest FAILED
:geode-cq:assemble
:geode-cq:compileTestJavaNote: Some input files use or override a deprecated API.
Note: Recompile with -Xlint:deprecation for details.
Note: Some input files use unchecked or unsafe operations.
Note: Recompile with -Xlint:unchecked for details.

:geode-cq:processTestResources
:geode-cq:testClasses
:geode-cq:checkMissedTests
:geode-cq:spotlessJavaCheck
:geode-cq:spotlessCheck
:geode-cq:test
:geode-cq:check
:geode-cq:build
:geode-cq:distributedTest
:geode-cq:integrationTest
:geode-json:assemble
:geode-json:compileTestJava UP-TO-DATE
:geode-json:processTestResources
:geode-json:testClasses
:geode-json:checkMissedTests UP-TO-DATE
:geode-json:spotlessJavaCheck
:geode-json:spotlessCheck
:geode-json:test UP-TO-DATE
:geode-json:check
:geode-json:build
:geode-json:distributedTest UP-TO-DATE
:geode-json:integrationTest UP-TO-DATE
:geode-junit:javadoc
:geode-junit:javadocJar
:geode-junit:sourcesJar
:geode-junit:signArchives SKIPPED
:geode-junit:assemble
:geode-junit:compileTestJava
:geode-junit:processTestResources UP-TO-DATE
:geode-junit:testClasses
:geode-junit:checkMissedTests
:geode-junit:spotlessJavaCheck
:geode-junit:spotlessCheck
:geode-junit:test
:geode-junit:check
:geode-junit:build
:geode-junit:distributedTest
:geode-junit:integrationTest
:geode-lucene:assemble
:geode-lucene:compileTestJavaNote: Some input files use or override a deprecated API.
Note: Recompile with -Xlint:deprecation for details.
Note: Some input files use unchecked or unsafe operations.
Note: Recompile with -Xlint:unchecked for details.

:geode-lucene:processTestResources
:geode-lucene:testClasses
:geode-lucene:checkMissedTests
:geode-lucene:spotlessJavaCheck
:geode-lucene:spotlessCheck
:geode-lucene:test
:geode-lucene:check
:geode-lucene:build
:geode-lucene:distributedTest
:geode-lucene:integrationTest
:geode-old-client-support:assemble
:geode-old-client-support:compileTestJavaNote: <https://builds.apache.org/job/Geode-release/ws/geode-old-client-support/src/test/java/com/gemstone/gemfire/cache/execute/FunctionExceptionTest.java>
uses or overrides a deprecated API.
Note: Recompile with -Xlint:deprecation for details.

:geode-old-client-support:processTestResources UP-TO-DATE
:geode-old-client-support:testClasses
:geode-old-client-support:checkMissedTests
:geode-old-client-support:spotlessJavaCheck
:geode-old-client-support:spotlessCheck
:geode-old-client-support:test
:geode-old-client-support:check
:geode-old-client-support:build
:geode-old-client-support:distributedTest
:geode-old-client-support:integrationTest
:geode-old-versions:javadoc UP-TO-DATE
:geode-old-versions:javadocJar
:geode-old-versions:sourcesJar
:geode-old-versions:signArchives SKIPPED
:geode-old-versions:assemble
:geode-old-versions:compileTestJava UP-TO-DATE
:geode-old-versions:processTestResources UP-TO-DATE
:geode-old-versions:testClasses UP-TO-DATE
:geode-old-versions:checkMissedTests UP-TO-DATE
:geode-old-versions:spotlessJavaCheck
:geode-old-versions:spotlessCheck
:geode-old-versions:test UP-TO-DATE
:geode-old-versions:check
:geode-old-versions:build
:geode-old-versions:distributedTest UP-TO-DATE
:geode-old-versions:integrationTest UP-TO-DATE
:geode-pulse:assemble
:geode-pulse:compileTestJavaNote: <https://builds.apache.org/job/Geode-release/ws/geode-pulse/src/test/java/org/apache/geode/tools/pulse/tests/ui/PulseBase.java>
uses or overrides a deprecated API.
Note: Recompile with -Xlint:deprecation for details.
Note: <https://builds.apache.org/job/Geode-release/ws/geode-pulse/src/test/java/org/apache/geode/tools/pulse/controllers/PulseControllerJUnitTest.java>
uses unchecked or unsafe operations.
Note: Recompile with -Xlint:unchecked for details.

:geode-pulse:processTestResources
:geode-pulse:testClasses
:geode-pulse:checkMissedTests
:geode-pulse:spotlessJavaCheck
:geode-pulse:spotlessCheck
:geode-pulse:test
:geode-pulse:check
:geode-pulse:build
:geode-pulse:distributedTest
:geode-pulse:integrationTest
:geode-rebalancer:assemble
:geode-rebalancer:compileTestJava
:geode-rebalancer:processTestResources UP-TO-DATE
:geode-rebalancer:testClasses
:geode-rebalancer:checkMissedTests
:geode-rebalancer:spotlessJavaCheck
:geode-rebalancer:spotlessCheck
:geode-rebalancer:test
:geode-rebalancer:check
:geode-rebalancer:build
:geode-rebalancer:distributedTest
:geode-rebalancer:integrationTest
:geode-wan:assemble
:geode-wan:compileTestJavaNote: Some input files use or override a deprecated API.
Note: Recompile with -Xlint:deprecation for details.
Note: Some input files use unchecked or unsafe operations.
Note: Recompile with -Xlint:unchecked for details.

:geode-wan:processTestResources
:geode-wan:testClasses
:geode-wan:checkMissedTests
:geode-wan:spotlessJavaCheck
:geode-wan:spotlessCheck
:geode-wan:test
:geode-wan:check
:geode-wan:build
:geode-wan:distributedTest
:geode-wan:integrationTest
:geode-web:assemble
:geode-web:compileTestJavaNote: Some input files use or override a deprecated API.
Note: Recompile with -Xlint:deprecation for details.
Note: Some input files use unchecked or unsafe operations.
Note: Recompile with -Xlint:unchecked for details.

:geode-web:processTestResources UP-TO-DATE
:geode-web:testClasses
:geode-web:checkMissedTests
:geode-web:spotlessJavaCheck
:geode-web:spotlessCheck
:geode-web:test
:geode-web:check
:geode-web:build
:geode-web:distributedTest
:geode-web:integrationTest
:geode-web-api:assemble
:geode-web-api:compileTestJava
:geode-web-api:processTestResources UP-TO-DATE
:geode-web-api:testClasses
:geode-web-api:checkMissedTests
:geode-web-api:spotlessJavaCheck
:geode-web-api:spotlessCheck
:geode-web-api:test
:geode-web-api:check
:geode-web-api:build
:geode-web-api:distributedTest
:geode-web-api:integrationTest
:combineReports
All test reports at <https://builds.apache.org/job/Geode-release/ws/build/reports/combined>
:extensions/geode-modules:precheckin
:extensions/geode-modules-assembly:precheckin
:extensions/geode-modules-session:precheckin
:extensions/geode-modules-session-internal:precheckin
:extensions/geode-modules-tomcat7:precheckin
:extensions/geode-modules-tomcat8:precheckin
:geode-assembly:precheckin
:geode-benchmarks:precheckin
:geode-common:precheckin
:geode-cq:precheckin
:geode-json:precheckin
:geode-junit:precheckin
:geode-lucene:precheckin
:geode-old-client-support:precheckin
:geode-old-versions:precheckin
:geode-pulse:precheckin
:geode-rebalancer:precheckin
:geode-wan:precheckin
:geode-web:precheckin
:geode-web-api:precheckin

FAILURE: Build failed with an exception.

* What went wrong:
Execution failed for task ':geode-core:integrationTest'.
> There were failing tests. See the report at: file://<https://builds.apache.org/job/Geode-release/ws/geode-core/build/reports/integrationTest/index.html>

* Try:
Run with --stacktrace option to get the stack trace. Run with --info or --debug option to
get more log output.

BUILD FAILED

Total time: 11 hrs 42 mins 0.291 secs
Build step 'Invoke Gradle script' changed build result to FAILURE
Build step 'Invoke Gradle script' marked build as failure
Archiving artifacts
Recording test results

Mime
View raw message