geode-dev mailing list archives

Site index · List index
Message view « Date » · « Thread »
Top « Date » · « Thread »
From "Kirk Lund (JIRA)" <j...@apache.org>
Subject [jira] [Updated] (GEODE-2959) LocatorLauncherTest fails with AssertionError: expected null, but was:<>
Date Fri, 19 May 2017 22:22:04 GMT

     [ https://issues.apache.org/jira/browse/GEODE-2959?page=com.atlassian.jira.plugin.system.issuetabpanels:all-tabpanel
]

Kirk Lund updated GEODE-2959:
-----------------------------
    Description: 
{noformat}
:geode-core:test

org.apache.geode.distributed.LocatorLauncherTest > testBuildWithMemberNameSetInApiPropertiesOnStart
FAILED
    java.lang.AssertionError: expected null, but was:<>
        at org.junit.Assert.fail(Assert.java:88)
        at org.junit.Assert.failNotNull(Assert.java:755)
        at org.junit.Assert.assertNull(Assert.java:737)
        at org.junit.Assert.assertNull(Assert.java:747)
        at org.apache.geode.distributed.LocatorLauncherTest.testBuildWithMemberNameSetInApiPropertiesOnStart(LocatorLauncherTest.java:361)

org.apache.geode.distributed.LocatorLauncherTest > testBuildWithMemberNameSetInSystemPropertiesOnStart
FAILED
    java.lang.AssertionError: expected null, but was:<>
        at org.junit.Assert.fail(Assert.java:88)
        at org.junit.Assert.failNotNull(Assert.java:755)
        at org.junit.Assert.assertNull(Assert.java:737)
        at org.junit.Assert.assertNull(Assert.java:747)
        at org.apache.geode.distributed.LocatorLauncherTest.testBuildWithMemberNameSetInSystemPropertiesOnStart(LocatorLauncherTest.java:373)

3072 tests completed, 2 failed, 13 skipped
:geode-core:test FAILED
{noformat}

  was:
<noformat>
:geode-core:test

org.apache.geode.distributed.LocatorLauncherTest > testBuildWithMemberNameSetInApiPropertiesOnStart
FAILED
    java.lang.AssertionError: expected null, but was:<>
        at org.junit.Assert.fail(Assert.java:88)
        at org.junit.Assert.failNotNull(Assert.java:755)
        at org.junit.Assert.assertNull(Assert.java:737)
        at org.junit.Assert.assertNull(Assert.java:747)
        at org.apache.geode.distributed.LocatorLauncherTest.testBuildWithMemberNameSetInApiPropertiesOnStart(LocatorLauncherTest.java:361)

org.apache.geode.distributed.LocatorLauncherTest > testBuildWithMemberNameSetInSystemPropertiesOnStart
FAILED
    java.lang.AssertionError: expected null, but was:<>
        at org.junit.Assert.fail(Assert.java:88)
        at org.junit.Assert.failNotNull(Assert.java:755)
        at org.junit.Assert.assertNull(Assert.java:737)
        at org.junit.Assert.assertNull(Assert.java:747)
        at org.apache.geode.distributed.LocatorLauncherTest.testBuildWithMemberNameSetInSystemPropertiesOnStart(LocatorLauncherTest.java:373)

3072 tests completed, 2 failed, 13 skipped
:geode-core:test FAILED
<noformat>


> LocatorLauncherTest fails with AssertionError: expected null, but was:<>
> ------------------------------------------------------------------------
>
>                 Key: GEODE-2959
>                 URL: https://issues.apache.org/jira/browse/GEODE-2959
>             Project: Geode
>          Issue Type: Bug
>          Components: gfsh, tests
>            Reporter: Kirk Lund
>            Assignee: Kirk Lund
>
> {noformat}
> :geode-core:test
> org.apache.geode.distributed.LocatorLauncherTest > testBuildWithMemberNameSetInApiPropertiesOnStart
FAILED
>     java.lang.AssertionError: expected null, but was:<>
>         at org.junit.Assert.fail(Assert.java:88)
>         at org.junit.Assert.failNotNull(Assert.java:755)
>         at org.junit.Assert.assertNull(Assert.java:737)
>         at org.junit.Assert.assertNull(Assert.java:747)
>         at org.apache.geode.distributed.LocatorLauncherTest.testBuildWithMemberNameSetInApiPropertiesOnStart(LocatorLauncherTest.java:361)
> org.apache.geode.distributed.LocatorLauncherTest > testBuildWithMemberNameSetInSystemPropertiesOnStart
FAILED
>     java.lang.AssertionError: expected null, but was:<>
>         at org.junit.Assert.fail(Assert.java:88)
>         at org.junit.Assert.failNotNull(Assert.java:755)
>         at org.junit.Assert.assertNull(Assert.java:737)
>         at org.junit.Assert.assertNull(Assert.java:747)
>         at org.apache.geode.distributed.LocatorLauncherTest.testBuildWithMemberNameSetInSystemPropertiesOnStart(LocatorLauncherTest.java:373)
> 3072 tests completed, 2 failed, 13 skipped
> :geode-core:test FAILED
> {noformat}



--
This message was sent by Atlassian JIRA
(v6.3.15#6346)

Mime
View raw message