geode-dev mailing list archives

Site index · List index
Message view « Date » · « Thread »
Top « Date » · « Thread »
From Apache Jenkins Server <jenk...@builds.apache.org>
Subject Build failed in Jenkins: Geode-nightly #826
Date Sat, 06 May 2017 03:44:41 GMT
See <https://builds.apache.org/job/Geode-nightly/826/display/redirect?page=changes>

Changes:

[lhughesgodfrey] GEODE-2852: Enforce lucene waitUntilFlushed timeout for all buckets

[huynhja] GEODE-2870: Local node function execution failure correctly returns

[mbretl] GEODE-2708: Update Gradle Wrapper To 3.4.1

[mbretl] GEODE-2708: Update Minimum Gradle Version To 3.4.1

[nnag] GEODE-2879: LonerDistributionManager shutdown called from close

------------------------------------------
[...truncated 82.57 KB...]
:geode-benchmarks:processResources NO-SOURCE
:geode-benchmarks:classes UP-TO-DATE
:geode-cq:compileJavaNote: Some input files use or override a deprecated API.
Note: Recompile with -Xlint:deprecation for details.
Note: Some input files use unchecked or unsafe operations.
Note: Recompile with -Xlint:unchecked for details.

:geode-cq:processResources
:geode-cq:classes
:geode-lucene:compileJavaNote: Some input files use or override a deprecated API.
Note: Recompile with -Xlint:deprecation for details.
Note: Some input files use unchecked or unsafe operations.
Note: Recompile with -Xlint:unchecked for details.

:geode-lucene:processResources
:geode-lucene:classes
:geode-old-client-support:compileJavaNote: Some input files use or override a deprecated API.
Note: Recompile with -Xlint:deprecation for details.

:geode-old-client-support:processResources
:geode-old-client-support:classes
:geode-pulse:compileJavaNote: Some input files use or override a deprecated API.
Note: Recompile with -Xlint:deprecation for details.
Note: Some input files use unchecked or unsafe operations.
Note: Recompile with -Xlint:unchecked for details.

:geode-pulse:copyGemFireVersionFile
:geode-pulse:processResources
:geode-pulse:classes
:geode-rebalancer:compileJava
:geode-rebalancer:processResources NO-SOURCE
:geode-rebalancer:classes
:geode-wan:compileJava
:geode-wan:processResources
:geode-wan:classes
:geode-web:compileJava NO-SOURCE
:geode-web:processResources NO-SOURCE
:geode-web:classes UP-TO-DATE
:geode-web-api:compileJavaNote: Some input files use unchecked or unsafe operations.
Note: Recompile with -Xlint:unchecked for details.

:geode-web-api:processResources
:geode-web-api:classes
:geode-assembly:docs
:geode-assembly:gfshDepsJar
:geode-common:javadocJar
:geode-common:sourcesJar
:geode-common:signArchives SKIPPED
:geode-core:javadocJar
:geode-core:raJar
:geode-core:jcaJar
:geode-core:sourcesJar
:geode-core:signArchives SKIPPED
:geode-core:webJar
:geode-cq:jar
:geode-cq:javadoc
:geode-cq:javadocJar
:geode-cq:sourcesJar
:geode-cq:signArchives SKIPPED
:geode-json:javadocJar
:geode-json:sourcesJar
:geode-json:signArchives SKIPPED
:geode-lucene:jar
:geode-lucene:javadoc
:geode-lucene:javadocJar
:geode-lucene:sourcesJar
:geode-lucene:signArchives SKIPPED
:geode-old-client-support:jar
:geode-old-client-support:javadoc
:geode-old-client-support:javadocJar
:geode-old-client-support:sourcesJar
:geode-old-client-support:signArchives SKIPPED
:geode-pulse:javadoc
:geode-pulse:javadocJar
:geode-pulse:sourcesJar
:geode-pulse:war
:geode-pulse:signArchives SKIPPED
:geode-rebalancer:jar
:geode-rebalancer:javadoc
:geode-rebalancer:javadocJar
:geode-rebalancer:sourcesJar
:geode-rebalancer:signArchives SKIPPED
:geode-wan:jar
:geode-wan:javadoc
:geode-wan:javadocJar
:geode-wan:sourcesJar
:geode-wan:signArchives SKIPPED
:geode-web:javadoc NO-SOURCE
:geode-web:javadocJar
:geode-web:sourcesJar
:geode-web:war
:geode-web:signArchives SKIPPED
:geode-web-api:javadoc
:geode-web-api:javadocJar
:geode-web-api:sourcesJar
:geode-web-api:war
:geode-web-api:signArchives SKIPPED
:geode-assembly:distTar
:geode-assembly:distZip
:geode-assembly:writeBuildInfo
:geode-assembly:srcDistTar
:geode-assembly:srcDistZip
:geode-assembly:signArchives SKIPPED
:geode-assembly:assemble
:geode-pulse:jar
:geode-assembly:compileTestJavaNote: Some input files use or override a deprecated API.
Note: Recompile with -Xlint:deprecation for details.
Note: Some input files use unchecked or unsafe operations.
Note: Recompile with -Xlint:unchecked for details.

:geode-assembly:processTestResources
:geode-assembly:testClasses
:geode-assembly:checkMissedTests
:geode-assembly:spotlessJavaCheck
:geode-assembly:spotlessCheck
:geode-assembly:installDist
:geode-assembly:test
:geode-assembly:check
:geode-assembly:build
:geode-assembly:distributedTest
:geode-assembly:flakyTest
:geode-assembly:integrationTest
:geode-benchmarks:jar
:geode-benchmarks:javadoc NO-SOURCE
:geode-benchmarks:javadocJar
:geode-benchmarks:sourcesJar
:geode-benchmarks:signArchives SKIPPED
:geode-benchmarks:assemble
:geode-benchmarks:compileTestJava NO-SOURCE
:geode-benchmarks:processTestResources NO-SOURCE
:geode-benchmarks:testClasses UP-TO-DATE
:geode-benchmarks:checkMissedTests NO-SOURCE
:geode-benchmarks:spotlessJavaCheck
:geode-benchmarks:spotlessCheck
:geode-benchmarks:test NO-SOURCE
:geode-benchmarks:check
:geode-benchmarks:build
:geode-benchmarks:distributedTest NO-SOURCE
:geode-benchmarks:flakyTest NO-SOURCE
:geode-benchmarks:integrationTest NO-SOURCE
:geode-common:assemble
:geode-common:compileTestJava
:geode-common:processTestResources NO-SOURCE
:geode-common:testClasses
:geode-common:checkMissedTests
:geode-common:spotlessJavaCheck
:geode-common:spotlessCheck
:geode-common:test
:geode-common:check
:geode-common:build
:geode-common:distributedTest
:geode-common:flakyTest
:geode-common:integrationTest
:geode-core:assemble
:geode-core:checkMissedTests
:geode-core:spotlessJavaCheck
:geode-core:spotlessCheck
:geode-core:test
:geode-core:check
:geode-core:build
:geode-core:distributedTest

org.apache.geode.internal.cache.tier.sockets.AcceptorImplDUnitTest > testAcceptorImplCloseCleansUpWithHangingConnection
FAILED
    org.awaitility.core.ConditionTimeoutException: Condition with alias 'Cache writer starts'
didn't complete within 10 seconds because condition with lambda expression in org.apache.geode.internal.cache.tier.sockets.AcceptorImplDUnitTest
that uses org.apache.geode.internal.cache.tier.sockets.AcceptorImplDUnitTest$SleepyCacheWriter
was not fulfilled.
        at org.awaitility.core.ConditionAwaiter.await(ConditionAwaiter.java:104)
        at org.awaitility.core.CallableCondition.await(CallableCondition.java:79)
        at org.awaitility.core.CallableCondition.await(CallableCondition.java:27)
        at org.awaitility.core.ConditionFactory.until(ConditionFactory.java:809)
        at org.awaitility.core.ConditionFactory.until(ConditionFactory.java:785)
        at org.apache.geode.internal.cache.tier.sockets.AcceptorImplDUnitTest.testAcceptorImplCloseCleansUpWithHangingConnection(AcceptorImplDUnitTest.java:182)

org.apache.geode.internal.cache.execute.PRFunctionExecutionDUnitTest > testFunctionExecution
FAILED
    org.apache.geode.test.dunit.RMIException: While invoking org.apache.geode.internal.cache.execute.PRFunctionExecutionDUnitTest$1.call
in VM 3 running on Host asf902.gq1.ygridcore.net with 4 VMs
        at org.apache.geode.test.dunit.VM.invoke(VM.java:377)
        at org.apache.geode.test.dunit.VM.invoke(VM.java:347)
        at org.apache.geode.test.dunit.VM.invoke(VM.java:315)
        at org.apache.geode.internal.cache.execute.PRFunctionExecutionDUnitTest.testFunctionExecution(PRFunctionExecutionDUnitTest.java:110)

        Caused by:
        java.util.concurrent.RejectedExecutionException: Task org.apache.geode.internal.cache.BucketAdvisor$VolunteeringDelegate$2@37b8c6de
rejected from java.util.concurrent.ThreadPoolExecutor@310d5812[Terminated, pool size = 0,
active threads = 0, queued tasks = 0, completed tasks = 0]

org.apache.geode.management.internal.cli.commands.ConcurrentDeployDUnitTest > testMultipleGfshClientToOneServer
FAILED
    java.lang.AssertionError: An exception occurred during asynchronous invocation.
        at org.apache.geode.test.dunit.AsyncInvocation.checkException(AsyncInvocation.java:148)
        at org.apache.geode.test.dunit.AsyncInvocation.await(AsyncInvocation.java:341)
        at org.apache.geode.test.dunit.AsyncInvocation.await(AsyncInvocation.java:364)
        at org.apache.geode.management.internal.cli.commands.ConcurrentDeployDUnitTest.testMultipleGfshClientToOneServer(ConcurrentDeployDUnitTest.java:67)

        Caused by:
        org.junit.ComparisonFailure: expected:<[OK]> but was:<[ERROR]>
            at sun.reflect.NativeConstructorAccessorImpl.newInstance0(Native Method)
            at sun.reflect.NativeConstructorAccessorImpl.newInstance(NativeConstructorAccessorImpl.java:62)
            at sun.reflect.DelegatingConstructorAccessorImpl.newInstance(DelegatingConstructorAccessorImpl.java:45)
            at org.apache.geode.test.dunit.rules.GfshShellConnectionRule.executeAndVerifyCommand(GfshShellConnectionRule.java:231)
            at org.apache.geode.management.internal.cli.commands.ConcurrentDeployDUnitTest.loopThroughDeployAndUndeploys(ConcurrentDeployDUnitTest.java:90)
            at org.apache.geode.management.internal.cli.commands.ConcurrentDeployDUnitTest.lambda$testMultipleGfshClientToOneServer$6cbf4f0f$1(ConcurrentDeployDUnitTest.java:63)

org.apache.geode.management.internal.cli.commands.ShowDeadlockDUnitTest > testDistributedDeadlockWithFunction
FAILED
    java.lang.AssertionError
        at org.junit.Assert.fail(Assert.java:86)
        at org.junit.Assert.assertTrue(Assert.java:41)
        at org.junit.Assert.assertTrue(Assert.java:52)
        at org.apache.geode.management.internal.cli.commands.ShowDeadlockDUnitTest.testDistributedDeadlockWithFunction(ShowDeadlockDUnitTest.java:156)

org.apache.geode.management.internal.cli.commands.ShowDeadlockDUnitTest > testNoDeadlock
FAILED
    java.lang.AssertionError
        at org.junit.Assert.fail(Assert.java:86)
        at org.junit.Assert.assertTrue(Assert.java:41)
        at org.junit.Assert.assertTrue(Assert.java:52)
        at org.apache.geode.management.internal.cli.commands.ShowDeadlockDUnitTest.testNoDeadlock(ShowDeadlockDUnitTest.java:119)

6857 tests completed, 5 failed, 604 skipped
:geode-core:distributedTest FAILED
:geode-core:flakyTest

org.apache.geode.distributed.internal.ConsoleDistributionManagerDUnitTest > testApplications
FAILED
    java.lang.UnsupportedOperationException
        at org.apache.geode.internal.admin.remote.AdminRegion.keySet(AdminRegion.java:526)
        at org.apache.geode.distributed.internal.ConsoleDistributionManagerDUnitTest.testApplications(ConsoleDistributionManagerDUnitTest.java:269)
Unexpected exception thrown.
org.gradle.internal.remote.internal.MessageIOException: Could not read message from '/127.0.0.1:44340'.
	at org.gradle.internal.remote.internal.inet.SocketConnection.receive(SocketConnection.java:90)
	at org.gradle.internal.remote.internal.hub.MessageHub$ConnectionReceive.run(MessageHub.java:263)
	at org.gradle.internal.concurrent.ExecutorPolicy$CatchAndRecordFailures.onExecute(ExecutorPolicy.java:63)
	at org.gradle.internal.concurrent.StoppableExecutorImpl$1.run(StoppableExecutorImpl.java:46)
	at java.util.concurrent.ThreadPoolExecutor.runWorker(ThreadPoolExecutor.java:1142)
	at java.util.concurrent.ThreadPoolExecutor$Worker.run(ThreadPoolExecutor.java:617)
	at java.lang.Thread.run(Thread.java:745)
Caused by: java.lang.IllegalArgumentException
	at org.gradle.internal.remote.internal.hub.InterHubMessageSerializer$MessageReader.read(InterHubMessageSerializer.java:71)
	at org.gradle.internal.remote.internal.hub.InterHubMessageSerializer$MessageReader.read(InterHubMessageSerializer.java:52)
	at org.gradle.internal.remote.internal.inet.SocketConnection.receive(SocketConnection.java:79)
	... 6 more

279 tests completed, 1 failed, 6 skipped
:geode-core:flakyTest FAILED
Build timed out (after 1,440 minutes). Marking the build as failed.
:geode-core:integrationTestBuild was aborted
Archiving artifacts
Compressed 326.49 MB of artifacts by 41.5% relative to #808
Recording test results
ERROR: Step ?Publish JUnit test result report? failed: No test report files were found. Configuration
error?
Not sending mail to unregistered user eshu@pivotal.io
Not sending mail to unregistered user lhughesgodfrey@pivotal.io
Not sending mail to unregistered user nag@cs.wisc.edu
Not sending mail to unregistered user jiliao@pivotal.io
Not sending mail to unregistered user gzhou@pivotal.io
Not sending mail to unregistered user huynhja@gmail.com
Not sending mail to unregistered user ukohlmeyer@pivotal.io

Mime
View raw message