geode-dev mailing list archives

Site index · List index
Message view « Date » · « Thread »
Top « Date » · « Thread »
From Apache Jenkins Server <jenk...@builds.apache.org>
Subject Build failed in Jenkins: Geode-nightly #834
Date Sat, 13 May 2017 17:45:21 GMT
See <https://builds.apache.org/job/Geode-nightly/834/display/redirect?page=changes>

Changes:

[nag] GEODE-2637: Refactored LuceneQueryFactory.setResultLimit()

[bschuchardt] GEODE-2875 shutdown is taking as long as 20 seconds

[huynhja] GEODE-2914: Tidy up LuceneService javadoc

------------------------------------------
[...truncated 109.06 KB...]
:geode-core:distributedTest FAILED
:geode-core:flakyTest
:geode-core:integrationTest
:geode-cq:assemble
:geode-cq:compileTestJavaNote: Some input files use or override a deprecated API.
Note: Recompile with -Xlint:deprecation for details.
Note: Some input files use unchecked or unsafe operations.
Note: Recompile with -Xlint:unchecked for details.

:geode-cq:processTestResources
:geode-cq:testClasses
:geode-cq:checkMissedTests
:geode-cq:spotlessJavaCheck
:geode-cq:spotlessCheck
:geode-cq:test
:geode-cq:check
:geode-cq:build
:geode-cq:distributedTest
:geode-cq:flakyTest
:geode-cq:integrationTest
:geode-json:assemble
:geode-json:compileTestJava UP-TO-DATE
:geode-json:processTestResources
:geode-json:testClasses
:geode-json:checkMissedTests UP-TO-DATE
:geode-json:spotlessJavaCheck
:geode-json:spotlessCheck
:geode-json:test UP-TO-DATE
:geode-json:check
:geode-json:build
:geode-json:distributedTest UP-TO-DATE
:geode-json:flakyTest UP-TO-DATE
:geode-json:integrationTest UP-TO-DATE
:geode-junit:javadoc
:geode-junit:javadocJar
:geode-junit:sourcesJar
:geode-junit:signArchives SKIPPED
:geode-junit:assemble
:geode-junit:compileTestJava
:geode-junit:processTestResources UP-TO-DATE
:geode-junit:testClasses
:geode-junit:checkMissedTests
:geode-junit:spotlessJavaCheck
:geode-junit:spotlessCheck
:geode-junit:test
:geode-junit:check
:geode-junit:build
:geode-junit:distributedTest
:geode-junit:flakyTest
:geode-junit:integrationTest
:geode-lucene:assemble
:geode-lucene:compileTestJava
Download https://repo1.maven.org/maven2/org/apache/lucene/lucene-analyzers-phonetic/6.4.1/lucene-analyzers-phonetic-6.4.1.pom
Download https://repo1.maven.org/maven2/org/apache/lucene/lucene-analyzers-phonetic/6.4.1/lucene-analyzers-phonetic-6.4.1.jar
Note: Some input files use or override a deprecated API.
Note: Recompile with -Xlint:deprecation for details.
Note: Some input files use unchecked or unsafe operations.
Note: Recompile with -Xlint:unchecked for details.
:geode-lucene:processTestResources
:geode-lucene:testClasses
:geode-lucene:checkMissedTests
:geode-lucene:spotlessJavaCheck
:geode-lucene:spotlessCheck
:geode-lucene:test
:geode-lucene:check
:geode-lucene:build
:geode-lucene:distributedTest
:geode-lucene:flakyTest
:geode-lucene:integrationTest
:geode-old-client-support:assemble
:geode-old-client-support:compileTestJava
:geode-old-client-support:processTestResources UP-TO-DATE
:geode-old-client-support:testClasses
:geode-old-client-support:checkMissedTests
:geode-old-client-support:spotlessJavaCheck
:geode-old-client-support:spotlessCheck
:geode-old-client-support:test
:geode-old-client-support:check
:geode-old-client-support:build
:geode-old-client-support:distributedTest
:geode-old-client-support:flakyTest
:geode-old-client-support:integrationTest
:geode-old-versions:javadoc UP-TO-DATE
:geode-old-versions:javadocJar
:geode-old-versions:sourcesJar
:geode-old-versions:signArchives SKIPPED
:geode-old-versions:assemble
:geode-old-versions:compileTestJava UP-TO-DATE
:geode-old-versions:processTestResources UP-TO-DATE
:geode-old-versions:testClasses UP-TO-DATE
:geode-old-versions:checkMissedTests UP-TO-DATE
:geode-old-versions:spotlessJavaCheck
:geode-old-versions:spotlessCheck
:geode-old-versions:test UP-TO-DATE
:geode-old-versions:check
:geode-old-versions:build
:geode-old-versions:distributedTest UP-TO-DATE
:geode-old-versions:flakyTest UP-TO-DATE
:geode-old-versions:integrationTest UP-TO-DATE
:geode-pulse:assemble
:geode-pulse:compileTestJavaNote: <https://builds.apache.org/job/Geode-nightly/ws/geode-pulse/src/test/java/org/apache/geode/tools/pulse/tests/ui/PulseBase.java>
uses or overrides a deprecated API.
Note: Recompile with -Xlint:deprecation for details.
Note: <https://builds.apache.org/job/Geode-nightly/ws/geode-pulse/src/test/java/org/apache/geode/tools/pulse/controllers/PulseControllerJUnitTest.java>
uses unchecked or unsafe operations.
Note: Recompile with -Xlint:unchecked for details.

:geode-pulse:processTestResources
:geode-pulse:testClasses
:geode-pulse:checkMissedTests
:geode-pulse:spotlessJavaCheck
:geode-pulse:spotlessCheck
:geode-pulse:test
:geode-pulse:check
:geode-pulse:build
:geode-pulse:distributedTest
:geode-pulse:flakyTest
:geode-pulse:integrationTest
:geode-rebalancer:assemble
:geode-rebalancer:compileTestJava
:geode-rebalancer:processTestResources UP-TO-DATE
:geode-rebalancer:testClasses
:geode-rebalancer:checkMissedTests
:geode-rebalancer:spotlessJavaCheck
:geode-rebalancer:spotlessCheck
:geode-rebalancer:test
:geode-rebalancer:check
:geode-rebalancer:build
:geode-rebalancer:distributedTest
:geode-rebalancer:flakyTest
:geode-rebalancer:integrationTest
:geode-wan:assemble
:geode-wan:compileTestJavaNote: Some input files use or override a deprecated API.
Note: Recompile with -Xlint:deprecation for details.
Note: Some input files use unchecked or unsafe operations.
Note: Recompile with -Xlint:unchecked for details.

:geode-wan:processTestResources
:geode-wan:testClasses
:geode-wan:checkMissedTests
:geode-wan:spotlessJavaCheck
:geode-wan:spotlessCheck
:geode-wan:test
:geode-wan:check
:geode-wan:build
:geode-wan:distributedTest
:geode-wan:flakyTest
:geode-wan:integrationTest
:geode-web:assemble
:geode-web:compileTestJavaNote: Some input files use or override a deprecated API.
Note: Recompile with -Xlint:deprecation for details.
Note: Some input files use unchecked or unsafe operations.
Note: Recompile with -Xlint:unchecked for details.

:geode-web:processTestResources UP-TO-DATE
:geode-web:testClasses
:geode-web:checkMissedTests
:geode-web:spotlessJavaCheck
:geode-web:spotlessCheck
:geode-web:test
:geode-web:check
:geode-web:build
:geode-web:distributedTest
:geode-web:flakyTest
:geode-web:integrationTest
:geode-web-api:assemble
:geode-web-api:compileTestJava
:geode-web-api:processTestResources UP-TO-DATE
:geode-web-api:testClasses
:geode-web-api:checkMissedTests
:geode-web-api:spotlessJavaCheck
:geode-web-api:spotlessCheck
:geode-web-api:test
:geode-web-api:check
:geode-web-api:build
:geode-web-api:distributedTest
:geode-web-api:flakyTest
:geode-web-api:integrationTest
:combineReports
All test reports at <https://builds.apache.org/job/Geode-nightly/ws/build/reports/combined>
:extensions/geode-modules:precheckin
:extensions/geode-modules-assembly:precheckin
:extensions/geode-modules-session:precheckin
:extensions/geode-modules-session-internal:precheckin
:extensions/geode-modules-tomcat7:precheckin
:extensions/geode-modules-tomcat8:precheckin
:geode-assembly:precheckin
:geode-benchmarks:precheckin
:geode-common:precheckin
:geode-cq:precheckin
:geode-json:precheckin
:geode-junit:precheckin
:geode-lucene:precheckin
:geode-old-client-support:precheckin
:geode-old-versions:precheckin
:geode-pulse:precheckin
:geode-rebalancer:precheckin
:geode-wan:precheckin
:geode-web:precheckin
:geode-web-api:precheckin
:compileJava UP-TO-DATE
:processResources UP-TO-DATE
:classes UP-TO-DATE
:jar
:uploadArchives
:extensions/geode-modules:uploadArchives
:extensions/geode-modules-assembly:uploadArchives SKIPPED
:extensions/geode-modules-session:uploadArchives
:extensions/geode-modules-session-internal:uploadArchives
:extensions/geode-modules-tomcat7:uploadArchives
:extensions/geode-modules-tomcat8:uploadArchives
:geode-assembly:uploadArchives SKIPPED
:geode-benchmarks:uploadArchives SKIPPED
:geode-common:uploadArchives
:geode-core:uploadArchives
:geode-cq:uploadArchives
:geode-json:uploadArchives
:geode-junit:uploadArchives
:geode-lucene:uploadArchives
:geode-old-client-support:uploadArchives
:geode-old-versions:uploadArchives SKIPPED
:geode-pulse:uploadArchives
:geode-rebalancer:uploadArchives
:geode-wan:uploadArchives
:geode-web:uploadArchives
:geode-web-api:uploadArchives

FAILURE: Build failed with an exception.

* What went wrong:
Execution failed for task ':geode-core:distributedTest'.
> There were failing tests. See the report at: file://<https://builds.apache.org/job/Geode-nightly/ws/geode-core/build/reports/distributedTest/index.html>

* Try:
Run with --stacktrace option to get the stack trace. Run with --info or --debug option to
get more log output.

BUILD FAILED

Total time: 14 hrs 0 mins 0.205 secs
Build step 'Invoke Gradle script' changed build result to FAILURE
Build step 'Invoke Gradle script' marked build as failure
Archiving artifacts
Compressed 328.08 MB of artifacts by 36.9% relative to #808
Recording test results
Not sending mail to unregistered user eshu@pivotal.io
Not sending mail to unregistered user lhughesgodfrey@pivotal.io
Not sending mail to unregistered user nag@cs.wisc.edu
Not sending mail to unregistered user jiliao@pivotal.io
Not sending mail to unregistered user gzhou@pivotal.io
Not sending mail to unregistered user huynhja@gmail.com
Not sending mail to unregistered user ukohlmeyer@pivotal.io

Mime
View raw message