geode-dev mailing list archives

Site index · List index
Message view « Date » · « Thread »
Top « Date » · « Thread »
From "Jared Stewart (JIRA)" <j...@apache.org>
Subject [jira] [Created] (GEODE-2795) Nightly build failure: CreateAlterDestroyRegionCommandsDUnitTest
Date Tue, 18 Apr 2017 17:19:42 GMT
Jared Stewart created GEODE-2795:
------------------------------------

             Summary: Nightly build failure: CreateAlterDestroyRegionCommandsDUnitTest
                 Key: GEODE-2795
                 URL: https://issues.apache.org/jira/browse/GEODE-2795
             Project: Geode
          Issue Type: Bug
            Reporter: Jared Stewart


It looks like the nightly build is failing due to polluted DUnit vms.  (FastClassPathScanner
uses the Path api instead of the File api, and while File accepts modified values of System.getProperty("user.dir"),
Path does not).

{noformat}
:geode-core:distributedTest

org.apache.geode.management.internal.cli.commands.CreateAlterDestroyRegionCommandsDUnitTest
> testAlterRegionResetCacheListeners FAILED
    java.lang.AssertionError: Suspicious strings were written to the log during this run.
    Fix the strings or use IgnoredException.addIgnoredException to ignore.
    -----------------------------------------------------------------------
    Found suspect string in log4j at line 908

    [error 2017/04/18 10:12:26.647 UTC <Function Execution Processor1> tid=0x5d9] Could
not deploy JAR file java.lang.RuntimeException: java.nio.file.NoSuchFileException: /tmp/junit3985345267510453893/server-1
    java.lang.RuntimeException: java.lang.RuntimeException: java.nio.file.NoSuchFileException:
/tmp/junit3985345267510453893/server-1
    	at io.github.lukehutch.fastclasspathscanner.FastClasspathScanner.scan(FastClasspathScanner.java:1115)
    	at io.github.lukehutch.fastclasspathscanner.FastClasspathScanner.scan(FastClasspathScanner.java:1143)
    	at io.github.lukehutch.fastclasspathscanner.FastClasspathScanner.scan(FastClasspathScanner.java:1166)
    	at org.apache.geode.internal.DeployedJar.findFunctionsInThisJar(DeployedJar.java:328)
    	at org.apache.geode.internal.DeployedJar.loadClassesAndRegisterFunctions(DeployedJar.java:175)
    	at org.apache.geode.internal.JarDeployer.registerNewVersions(JarDeployer.java:477)
    	at org.apache.geode.internal.JarDeployer.deploy(JarDeployer.java:516)
    	at org.apache.geode.management.internal.cli.functions.DeployFunction.execute(DeployFunction.java:68)
    	at org.apache.geode.internal.cache.MemberFunctionStreamingMessage.process(MemberFunctionStreamingMessage.java:191)
    	at org.apache.geode.distributed.internal.DistributionMessage.scheduleAction(DistributionMessage.java:376)
    	at org.apache.geode.distributed.internal.DistributionMessage$1.run(DistributionMessage.java:442)
    	at java.util.concurrent.ThreadPoolExecutor.runWorker(ThreadPoolExecutor.java:1142)
    	at java.util.concurrent.ThreadPoolExecutor$Worker.run(ThreadPoolExecutor.java:617)
    	at org.apache.geode.distributed.internal.DistributionManager.runUntilShutdown(DistributionManager.java:621)
    	at org.apache.geode.distributed.internal.DistributionManager$9$1.run(DistributionManager.java:1067)
    	at java.lang.Thread.run(Thread.java:745)
    Caused by: java.lang.RuntimeException: java.nio.file.NoSuchFileException: /tmp/junit3985345267510453893/server-1
    	at io.github.lukehutch.fastclasspathscanner.scanner.Scanner.call(Scanner.java:217)
    	at io.github.lukehutch.fastclasspathscanner.scanner.Scanner.call(Scanner.java:61)
    	at java.util.concurrent.FutureTask.run(FutureTask.java:266)
    	at java.util.concurrent.ThreadPoolExecutor.runWorker(ThreadPoolExecutor.java:1142)
    	at java.util.concurrent.ThreadPoolExecutor$Worker.run(ThreadPoolExecutor.java:617)
    	... 1 more
    Caused by: java.nio.file.NoSuchFileException: /tmp/junit3985345267510453893/server-1
    	at sun.nio.fs.UnixException.translateToIOException(UnixException.java:86)
    	at sun.nio.fs.UnixException.rethrowAsIOException(UnixException.java:102)
    	at sun.nio.fs.UnixException.rethrowAsIOException(UnixException.java:107)
    	at sun.nio.fs.UnixPath.toRealPath(UnixPath.java:876)
    	at io.github.lukehutch.fastclasspathscanner.scanner.Scanner.call(Scanner.java:215)
    	... 5 more

    -----------------------------------------------------------------------
    Found suspect string in log4j at line 945

    [error 2017/04/18 10:12:26.671 UTC <Function Execution Processor1> tid=0x5b1] Could
not deploy JAR file java.lang.RuntimeException: java.nio.file.NoSuchFileException: /tmp/junit3985345267510453893/locator-0
    java.lang.RuntimeException: java.lang.RuntimeException: java.nio.file.NoSuchFileException:
/tmp/junit3985345267510453893/locator-0
    	at io.github.lukehutch.fastclasspathscanner.FastClasspathScanner.scan(FastClasspathScanner.java:1115)
    	at io.github.lukehutch.fastclasspathscanner.FastClasspathScanner.scan(FastClasspathScanner.java:1143)
    	at io.github.lukehutch.fastclasspathscanner.FastClasspathScanner.scan(FastClasspathScanner.java:1166)
    	at org.apache.geode.internal.DeployedJar.findFunctionsInThisJar(DeployedJar.java:328)
    	at org.apache.geode.internal.DeployedJar.loadClassesAndRegisterFunctions(DeployedJar.java:175)
    	at org.apache.geode.internal.JarDeployer.registerNewVersions(JarDeployer.java:477)
    	at org.apache.geode.internal.JarDeployer.deploy(JarDeployer.java:516)
    	at org.apache.geode.management.internal.cli.functions.DeployFunction.execute(DeployFunction.java:68)
    	at org.apache.geode.internal.cache.execute.AbstractExecution.executeFunctionLocally(AbstractExecution.java:333)
    	at org.apache.geode.internal.cache.execute.AbstractExecution$2.run(AbstractExecution.java:303)
    	at java.util.concurrent.ThreadPoolExecutor.runWorker(ThreadPoolExecutor.java:1142)
    	at java.util.concurrent.ThreadPoolExecutor$Worker.run(ThreadPoolExecutor.java:617)
    	at org.apache.geode.distributed.internal.DistributionManager.runUntilShutdown(DistributionManager.java:621)
    	at org.apache.geode.distributed.internal.DistributionManager$9$1.run(DistributionManager.java:1067)
    	at java.lang.Thread.run(Thread.java:745)
    Caused by: java.lang.RuntimeException: java.nio.file.NoSuchFileException: /tmp/junit3985345267510453893/locator-0
    	at io.github.lukehutch.fastclasspathscanner.scanner.Scanner.call(Scanner.java:217)
    	at io.github.lukehutch.fastclasspathscanner.scanner.Scanner.call(Scanner.java:61)
    	at java.util.concurrent.FutureTask.run(FutureTask.java:266)
    	at java.util.concurrent.ThreadPoolExecutor.runWorker(ThreadPoolExecutor.java:1142)
    	at java.util.concurrent.ThreadPoolExecutor$Worker.run(ThreadPoolExecutor.java:617)
    	... 1 more
    Caused by: java.nio.file.NoSuchFileException: /tmp/junit3985345267510453893/locator-0
    	at sun.nio.fs.UnixException.translateToIOException(UnixException.java:86)
    	at sun.nio.fs.UnixException.rethrowAsIOException(UnixException.java:102)
    	at sun.nio.fs.UnixException.rethrowAsIOException(UnixException.java:107)
    	at sun.nio.fs.UnixPath.toRealPath(UnixPath.java:876)
    	at io.github.lukehutch.fastclasspathscanner.scanner.Scanner.call(Scanner.java:215)
    	... 5 more

    -----------------------------------------------------------------------
    Found suspect string in log4j at line 989

    [error 2017/04/18 10:12:26.865 UTC <Function Execution Processor1> tid=0x5d9] Could
not deploy JAR file java.lang.RuntimeException: java.nio.file.NoSuchFileException: /tmp/junit3985345267510453893/server-1
    java.lang.RuntimeException: java.lang.RuntimeException: java.nio.file.NoSuchFileException:
/tmp/junit3985345267510453893/server-1
    	at io.github.lukehutch.fastclasspathscanner.FastClasspathScanner.scan(FastClasspathScanner.java:1115)
    	at io.github.lukehutch.fastclasspathscanner.FastClasspathScanner.scan(FastClasspathScanner.java:1143)
    	at io.github.lukehutch.fastclasspathscanner.FastClasspathScanner.scan(FastClasspathScanner.java:1166)
    	at org.apache.geode.internal.DeployedJar.findFunctionsInThisJar(DeployedJar.java:328)
    	at org.apache.geode.internal.DeployedJar.loadClassesAndRegisterFunctions(DeployedJar.java:175)
    	at org.apache.geode.internal.JarDeployer.registerNewVersions(JarDeployer.java:477)
    	at org.apache.geode.internal.JarDeployer.deploy(JarDeployer.java:516)
    	at org.apache.geode.management.internal.cli.functions.DeployFunction.execute(DeployFunction.java:68)
    	at org.apache.geode.internal.cache.MemberFunctionStreamingMessage.process(MemberFunctionStreamingMessage.java:191)
    	at org.apache.geode.distributed.internal.DistributionMessage.scheduleAction(DistributionMessage.java:376)
    	at org.apache.geode.distributed.internal.DistributionMessage$1.run(DistributionMessage.java:442)
    	at java.util.concurrent.ThreadPoolExecutor.runWorker(ThreadPoolExecutor.java:1142)
    	at java.util.concurrent.ThreadPoolExecutor$Worker.run(ThreadPoolExecutor.java:617)
    	at org.apache.geode.distributed.internal.DistributionManager.runUntilShutdown(DistributionManager.java:621)
    	at org.apache.geode.distributed.internal.DistributionManager$9$1.run(DistributionManager.java:1067)
    	at java.lang.Thread.run(Thread.java:745)
    Caused by: java.lang.RuntimeException: java.nio.file.NoSuchFileException: /tmp/junit3985345267510453893/server-1
    	at io.github.lukehutch.fastclasspathscanner.scanner.Scanner.call(Scanner.java:217)
    	at io.github.lukehutch.fastclasspathscanner.scanner.Scanner.call(Scanner.java:61)
    	at java.util.concurrent.FutureTask.run(FutureTask.java:266)
    	at java.util.concurrent.ThreadPoolExecutor.runWorker(ThreadPoolExecutor.java:1142)
    	at java.util.concurrent.ThreadPoolExecutor$Worker.run(ThreadPoolExecutor.java:617)
    	... 1 more
    Caused by: java.nio.file.NoSuchFileException: /tmp/junit3985345267510453893/server-1
    	at sun.nio.fs.UnixException.translateToIOException(UnixException.java:86)
    	at sun.nio.fs.UnixException.rethrowAsIOException(UnixException.java:102)
    	at sun.nio.fs.UnixException.rethrowAsIOException(UnixException.java:107)
    	at sun.nio.fs.UnixPath.toRealPath(UnixPath.java:876)
    	at io.github.lukehutch.fastclasspathscanner.scanner.Scanner.call(Scanner.java:215)
    	... 5 more

    -----------------------------------------------------------------------
    Found suspect string in log4j at line 1022

    [error 2017/04/18 10:12:26.866 UTC <Function Execution Processor1> tid=0x5b1] Could
not deploy JAR file java.lang.RuntimeException: java.nio.file.NoSuchFileException: /tmp/junit3985345267510453893/locator-0
    java.lang.RuntimeException: java.lang.RuntimeException: java.nio.file.NoSuchFileException:
/tmp/junit3985345267510453893/locator-0
    	at io.github.lukehutch.fastclasspathscanner.FastClasspathScanner.scan(FastClasspathScanner.java:1115)
    	at io.github.lukehutch.fastclasspathscanner.FastClasspathScanner.scan(FastClasspathScanner.java:1143)
    	at io.github.lukehutch.fastclasspathscanner.FastClasspathScanner.scan(FastClasspathScanner.java:1166)
    	at org.apache.geode.internal.DeployedJar.findFunctionsInThisJar(DeployedJar.java:328)
    	at org.apache.geode.internal.DeployedJar.loadClassesAndRegisterFunctions(DeployedJar.java:175)
    	at org.apache.geode.internal.JarDeployer.registerNewVersions(JarDeployer.java:477)
    	at org.apache.geode.internal.JarDeployer.deploy(JarDeployer.java:516)
    	at org.apache.geode.management.internal.cli.functions.DeployFunction.execute(DeployFunction.java:68)
    	at org.apache.geode.internal.cache.execute.AbstractExecution.executeFunctionLocally(AbstractExecution.java:333)
    	at org.apache.geode.internal.cache.execute.AbstractExecution$2.run(AbstractExecution.java:303)
    	at java.util.concurrent.ThreadPoolExecutor.runWorker(ThreadPoolExecutor.java:1142)
    	at java.util.concurrent.ThreadPoolExecutor$Worker.run(ThreadPoolExecutor.java:617)
    	at org.apache.geode.distributed.internal.DistributionManager.runUntilShutdown(DistributionManager.java:621)
    	at org.apache.geode.distributed.internal.DistributionManager$9$1.run(DistributionManager.java:1067)
    	at java.lang.Thread.run(Thread.java:745)
    Caused by: java.lang.RuntimeException: java.nio.file.NoSuchFileException: /tmp/junit3985345267510453893/locator-0
    	at io.github.lukehutch.fastclasspathscanner.scanner.Scanner.call(Scanner.java:217)
    	at io.github.lukehutch.fastclasspathscanner.scanner.Scanner.call(Scanner.java:61)
    	at java.util.concurrent.FutureTask.run(FutureTask.java:266)
    	at java.util.concurrent.ThreadPoolExecutor.runWorker(ThreadPoolExecutor.java:1142)
    	at java.util.concurrent.ThreadPoolExecutor$Worker.run(ThreadPoolExecutor.java:617)
    	... 1 more
    Caused by: java.nio.file.NoSuchFileException: /tmp/junit3985345267510453893/locator-0
    	at sun.nio.fs.UnixException.translateToIOException(UnixException.java:86)
    	at sun.nio.fs.UnixException.rethrowAsIOException(UnixException.java:102)
    	at sun.nio.fs.UnixException.rethrowAsIOException(UnixException.java:107)
    	at sun.nio.fs.UnixPath.toRealPath(UnixPath.java:876)
    	at io.github.lukehutch.fastclasspathscanner.scanner.Scanner.call(Scanner.java:215)
    	... 5 more

    -----------------------------------------------------------------------
    Found suspect string in log4j at line 1066

    [error 2017/04/18 10:12:26.973 UTC <Function Execution Processor1> tid=0x5b1] Could
not deploy JAR file java.lang.RuntimeException: java.nio.file.NoSuchFileException: /tmp/junit3985345267510453893/locator-0
    java.lang.RuntimeException: java.lang.RuntimeException: java.nio.file.NoSuchFileException:
/tmp/junit3985345267510453893/locator-0
    	at io.github.lukehutch.fastclasspathscanner.FastClasspathScanner.scan(FastClasspathScanner.java:1115)
    	at io.github.lukehutch.fastclasspathscanner.FastClasspathScanner.scan(FastClasspathScanner.java:1143)
    	at io.github.lukehutch.fastclasspathscanner.FastClasspathScanner.scan(FastClasspathScanner.java:1166)
    	at org.apache.geode.internal.DeployedJar.findFunctionsInThisJar(DeployedJar.java:328)
    	at org.apache.geode.internal.DeployedJar.loadClassesAndRegisterFunctions(DeployedJar.java:175)
    	at org.apache.geode.internal.JarDeployer.registerNewVersions(JarDeployer.java:477)
    	at org.apache.geode.internal.JarDeployer.deploy(JarDeployer.java:516)
    	at org.apache.geode.management.internal.cli.functions.DeployFunction.execute(DeployFunction.java:68)
    	at org.apache.geode.internal.cache.execute.AbstractExecution.executeFunctionLocally(AbstractExecution.java:333)
    	at org.apache.geode.internal.cache.execute.AbstractExecution$2.run(AbstractExecution.java:303)
    	at java.util.concurrent.ThreadPoolExecutor.runWorker(ThreadPoolExecutor.java:1142)
    	at java.util.concurrent.ThreadPoolExecutor$Worker.run(ThreadPoolExecutor.java:617)
    	at org.apache.geode.distributed.internal.DistributionManager.runUntilShutdown(DistributionManager.java:621)
    	at org.apache.geode.distributed.internal.DistributionManager$9$1.run(DistributionManager.java:1067)
    	at java.lang.Thread.run(Thread.java:745)
    Caused by: java.lang.RuntimeException: java.nio.file.NoSuchFileException: /tmp/junit3985345267510453893/locator-0
    	at io.github.lukehutch.fastclasspathscanner.scanner.Scanner.call(Scanner.java:217)
    	at io.github.lukehutch.fastclasspathscanner.scanner.Scanner.call(Scanner.java:61)
    	at java.util.concurrent.FutureTask.run(FutureTask.java:266)
    	at java.util.concurrent.ThreadPoolExecutor.runWorker(ThreadPoolExecutor.java:1142)
    	at java.util.concurrent.ThreadPoolExecutor$Worker.run(ThreadPoolExecutor.java:617)
    	... 1 more
    Caused by: java.nio.file.NoSuchFileException: /tmp/junit3985345267510453893/locator-0
    	at sun.nio.fs.UnixException.translateToIOException(UnixException.java:86)
    	at sun.nio.fs.UnixException.rethrowAsIOException(UnixException.java:102)
    	at sun.nio.fs.UnixException.rethrowAsIOException(UnixException.java:107)
    	at sun.nio.fs.UnixPath.toRealPath(UnixPath.java:876)
    	at io.github.lukehutch.fastclasspathscanner.scanner.Scanner.call(Scanner.java:215)
    	... 5 more

    -----------------------------------------------------------------------
    Found suspect string in log4j at line 1098

    [error 2017/04/18 10:12:26.975 UTC <Function Execution Processor1> tid=0x5d9] Could
not deploy JAR file java.lang.RuntimeException: java.nio.file.NoSuchFileException: /tmp/junit3985345267510453893/server-1
    java.lang.RuntimeException: java.lang.RuntimeException: java.nio.file.NoSuchFileException:
/tmp/junit3985345267510453893/server-1
    	at io.github.lukehutch.fastclasspathscanner.FastClasspathScanner.scan(FastClasspathScanner.java:1115)
    	at io.github.lukehutch.fastclasspathscanner.FastClasspathScanner.scan(FastClasspathScanner.java:1143)
    	at io.github.lukehutch.fastclasspathscanner.FastClasspathScanner.scan(FastClasspathScanner.java:1166)
    	at org.apache.geode.internal.DeployedJar.findFunctionsInThisJar(DeployedJar.java:328)
    	at org.apache.geode.internal.DeployedJar.loadClassesAndRegisterFunctions(DeployedJar.java:175)
    	at org.apache.geode.internal.JarDeployer.registerNewVersions(JarDeployer.java:477)
    	at org.apache.geode.internal.JarDeployer.deploy(JarDeployer.java:516)
    	at org.apache.geode.management.internal.cli.functions.DeployFunction.execute(DeployFunction.java:68)
    	at org.apache.geode.internal.cache.MemberFunctionStreamingMessage.process(MemberFunctionStreamingMessage.java:191)
    	at org.apache.geode.distributed.internal.DistributionMessage.scheduleAction(DistributionMessage.java:376)
    	at org.apache.geode.distributed.internal.DistributionMessage$1.run(DistributionMessage.java:442)
    	at java.util.concurrent.ThreadPoolExecutor.runWorker(ThreadPoolExecutor.java:1142)
    	at java.util.concurrent.ThreadPoolExecutor$Worker.run(ThreadPoolExecutor.java:617)
    	at org.apache.geode.distributed.internal.DistributionManager.runUntilShutdown(DistributionManager.java:621)
    	at org.apache.geode.distributed.internal.DistributionManager$9$1.run(DistributionManager.java:1067)
    	at java.lang.Thread.run(Thread.java:745)
    Caused by: java.lang.RuntimeException: java.nio.file.NoSuchFileException: /tmp/junit3985345267510453893/server-1
    	at io.github.lukehutch.fastclasspathscanner.scanner.Scanner.call(Scanner.java:217)
    	at io.github.lukehutch.fastclasspathscanner.scanner.Scanner.call(Scanner.java:61)
    	at java.util.concurrent.FutureTask.run(FutureTask.java:266)
    	at java.util.concurrent.ThreadPoolExecutor.runWorker(ThreadPoolExecutor.java:1142)
    	at java.util.concurrent.ThreadPoolExecutor$Worker.run(ThreadPoolExecutor.java:617)
    	... 1 more
    Caused by: java.nio.file.NoSuchFileException: /tmp/junit3985345267510453893/server-1
    	at sun.nio.fs.UnixException.translateToIOException(UnixException.java:86)
    	at sun.nio.fs.UnixException.rethrowAsIOException(UnixException.java:102)
    	at sun.nio.fs.UnixException.rethrowAsIOException(UnixException.java:107)
    	at sun.nio.fs.UnixPath.toRealPath(UnixPath.java:876)
    	at io.github.lukehutch.fastclasspathscanner.scanner.Scanner.call(Scanner.java:215)
    	... 5 more

    -----------------------------------------------------------------------
    Found suspect string in log4j at line 1143

    [error 2017/04/18 10:12:27.076 UTC <Function Execution Processor1> tid=0x5d9] Could
not deploy JAR file java.lang.RuntimeException: java.nio.file.NoSuchFileException: /tmp/junit3985345267510453893/server-1
    java.lang.RuntimeException: java.lang.RuntimeException: java.nio.file.NoSuchFileException:
/tmp/junit3985345267510453893/server-1
    	at io.github.lukehutch.fastclasspathscanner.FastClasspathScanner.scan(FastClasspathScanner.java:1115)
    	at io.github.lukehutch.fastclasspathscanner.FastClasspathScanner.scan(FastClasspathScanner.java:1143)
    	at io.github.lukehutch.fastclasspathscanner.FastClasspathScanner.scan(FastClasspathScanner.java:1166)
    	at org.apache.geode.internal.DeployedJar.findFunctionsInThisJar(DeployedJar.java:328)
    	at org.apache.geode.internal.DeployedJar.loadClassesAndRegisterFunctions(DeployedJar.java:175)
    	at org.apache.geode.internal.JarDeployer.registerNewVersions(JarDeployer.java:477)
    	at org.apache.geode.internal.JarDeployer.deploy(JarDeployer.java:516)
    	at org.apache.geode.management.internal.cli.functions.DeployFunction.execute(DeployFunction.java:68)
    	at org.apache.geode.internal.cache.MemberFunctionStreamingMessage.process(MemberFunctionStreamingMessage.java:191)
    	at org.apache.geode.distributed.internal.DistributionMessage.scheduleAction(DistributionMessage.java:376)
    	at org.apache.geode.distributed.internal.DistributionMessage$1.run(DistributionMessage.java:442)
    	at java.util.concurrent.ThreadPoolExecutor.runWorker(ThreadPoolExecutor.java:1142)
    	at java.util.concurrent.ThreadPoolExecutor$Worker.run(ThreadPoolExecutor.java:617)
    	at org.apache.geode.distributed.internal.DistributionManager.runUntilShutdown(DistributionManager.java:621)
    	at org.apache.geode.distributed.internal.DistributionManager$9$1.run(DistributionManager.java:1067)
    	at java.lang.Thread.run(Thread.java:745)
    Caused by: java.lang.RuntimeException: java.nio.file.NoSuchFileException: /tmp/junit3985345267510453893/server-1
    	at io.github.lukehutch.fastclasspathscanner.scanner.Scanner.call(Scanner.java:217)
    	at io.github.lukehutch.fastclasspathscanner.scanner.Scanner.call(Scanner.java:61)
    	at java.util.concurrent.FutureTask.run(FutureTask.java:266)
    	at java.util.concurrent.ThreadPoolExecutor.runWorker(ThreadPoolExecutor.java:1142)
    	at java.util.concurrent.ThreadPoolExecutor$Worker.run(ThreadPoolExecutor.java:617)
    	... 1 more
    Caused by: java.nio.file.NoSuchFileException: /tmp/junit3985345267510453893/server-1
    	at sun.nio.fs.UnixException.translateToIOException(UnixException.java:86)
    	at sun.nio.fs.UnixException.rethrowAsIOException(UnixException.java:102)
    	at sun.nio.fs.UnixException.rethrowAsIOException(UnixException.java:107)
    	at sun.nio.fs.UnixPath.toRealPath(UnixPath.java:876)
    	at io.github.lukehutch.fastclasspathscanner.scanner.Scanner.call(Scanner.java:215)
    	... 5 more

    -----------------------------------------------------------------------
    Found suspect string in log4j at line 1176

    [error 2017/04/18 10:12:27.076 UTC <Function Execution Processor1> tid=0x5b1] Could
not deploy JAR file java.lang.RuntimeException: java.nio.file.NoSuchFileException: /tmp/junit3985345267510453893/locator-0
    java.lang.RuntimeException: java.lang.RuntimeException: java.nio.file.NoSuchFileException:
/tmp/junit3985345267510453893/locator-0
    	at io.github.lukehutch.fastclasspathscanner.FastClasspathScanner.scan(FastClasspathScanner.java:1115)
    	at io.github.lukehutch.fastclasspathscanner.FastClasspathScanner.scan(FastClasspathScanner.java:1143)
    	at io.github.lukehutch.fastclasspathscanner.FastClasspathScanner.scan(FastClasspathScanner.java:1166)
    	at org.apache.geode.internal.DeployedJar.findFunctionsInThisJar(DeployedJar.java:328)
    	at org.apache.geode.internal.DeployedJar.loadClassesAndRegisterFunctions(DeployedJar.java:175)
    	at org.apache.geode.internal.JarDeployer.registerNewVersions(JarDeployer.java:477)
    	at org.apache.geode.internal.JarDeployer.deploy(JarDeployer.java:516)
    	at org.apache.geode.management.internal.cli.functions.DeployFunction.execute(DeployFunction.java:68)
    	at org.apache.geode.internal.cache.execute.AbstractExecution.executeFunctionLocally(AbstractExecution.java:333)
    	at org.apache.geode.internal.cache.execute.AbstractExecution$2.run(AbstractExecution.java:303)
    	at java.util.concurrent.ThreadPoolExecutor.runWorker(ThreadPoolExecutor.java:1142)
    	at java.util.concurrent.ThreadPoolExecutor$Worker.run(ThreadPoolExecutor.java:617)
    	at org.apache.geode.distributed.internal.DistributionManager.runUntilShutdown(DistributionManager.java:621)
    	at org.apache.geode.distributed.internal.DistributionManager$9$1.run(DistributionManager.java:1067)
    	at java.lang.Thread.run(Thread.java:745)
    Caused by: java.lang.RuntimeException: java.nio.file.NoSuchFileException: /tmp/junit3985345267510453893/locator-0
    	at io.github.lukehutch.fastclasspathscanner.scanner.Scanner.call(Scanner.java:217)
    	at io.github.lukehutch.fastclasspathscanner.scanner.Scanner.call(Scanner.java:61)
    	at java.util.concurrent.FutureTask.run(FutureTask.java:266)
    	at java.util.concurrent.ThreadPoolExecutor.runWorker(ThreadPoolExecutor.java:1142)
    	at java.util.concurrent.ThreadPoolExecutor$Worker.run(ThreadPoolExecutor.java:617)
    	... 1 more
    Caused by: java.nio.file.NoSuchFileException: /tmp/junit3985345267510453893/locator-0
    	at sun.nio.fs.UnixException.translateToIOException(UnixException.java:86)
    	at sun.nio.fs.UnixException.rethrowAsIOException(UnixException.java:102)
    	at sun.nio.fs.UnixException.rethrowAsIOException(UnixException.java:107)
    	at sun.nio.fs.UnixPath.toRealPath(UnixPath.java:876)
    	at io.github.lukehutch.fastclasspathscanner.scanner.Scanner.call(Scanner.java:215)
    	... 5 more

    -----------------------------------------------------------------------
    Found suspect string in log4j at line 1220

    [error 2017/04/18 10:12:27.169 UTC <Function Execution Processor1> tid=0x5d9] Could
not deploy JAR file java.lang.RuntimeException: java.nio.file.NoSuchFileException: /tmp/junit3985345267510453893/server-1
    java.lang.RuntimeException: java.lang.RuntimeException: java.nio.file.NoSuchFileException:
/tmp/junit3985345267510453893/server-1
    	at io.github.lukehutch.fastclasspathscanner.FastClasspathScanner.scan(FastClasspathScanner.java:1115)
    	at io.github.lukehutch.fastclasspathscanner.FastClasspathScanner.scan(FastClasspathScanner.java:1143)
    	at io.github.lukehutch.fastclasspathscanner.FastClasspathScanner.scan(FastClasspathScanner.java:1166)
    	at org.apache.geode.internal.DeployedJar.findFunctionsInThisJar(DeployedJar.java:328)
    	at org.apache.geode.internal.DeployedJar.loadClassesAndRegisterFunctions(DeployedJar.java:175)
    	at org.apache.geode.internal.JarDeployer.registerNewVersions(JarDeployer.java:477)
    	at org.apache.geode.internal.JarDeployer.deploy(JarDeployer.java:516)
    	at org.apache.geode.management.internal.cli.functions.DeployFunction.execute(DeployFunction.java:68)
    	at org.apache.geode.internal.cache.MemberFunctionStreamingMessage.process(MemberFunctionStreamingMessage.java:191)
    	at org.apache.geode.distributed.internal.DistributionMessage.scheduleAction(DistributionMessage.java:376)
    	at org.apache.geode.distributed.internal.DistributionMessage$1.run(DistributionMessage.java:442)
    	at java.util.concurrent.ThreadPoolExecutor.runWorker(ThreadPoolExecutor.java:1142)
    	at java.util.concurrent.ThreadPoolExecutor$Worker.run(ThreadPoolExecutor.java:617)
    	at org.apache.geode.distributed.internal.DistributionManager.runUntilShutdown(DistributionManager.java:621)
    	at org.apache.geode.distributed.internal.DistributionManager$9$1.run(DistributionManager.java:1067)
    	at java.lang.Thread.run(Thread.java:745)
    Caused by: java.lang.RuntimeException: java.nio.file.NoSuchFileException: /tmp/junit3985345267510453893/server-1
    	at io.github.lukehutch.fastclasspathscanner.scanner.Scanner.call(Scanner.java:217)
    	at io.github.lukehutch.fastclasspathscanner.scanner.Scanner.call(Scanner.java:61)
    	at java.util.concurrent.FutureTask.run(FutureTask.java:266)
    	at java.util.concurrent.ThreadPoolExecutor.runWorker(ThreadPoolExecutor.java:1142)
    	at java.util.concurrent.ThreadPoolExecutor$Worker.run(ThreadPoolExecutor.java:617)
    	... 1 more
    Caused by: java.nio.file.NoSuchFileException: /tmp/junit3985345267510453893/server-1
    	at sun.nio.fs.UnixException.translateToIOException(UnixException.java:86)
    	at sun.nio.fs.UnixException.rethrowAsIOException(UnixException.java:102)
    	at sun.nio.fs.UnixException.rethrowAsIOException(UnixException.java:107)
    	at sun.nio.fs.UnixPath.toRealPath(UnixPath.java:876)
    	at io.github.lukehutch.fastclasspathscanner.scanner.Scanner.call(Scanner.java:215)
    	... 5 more

    -----------------------------------------------------------------------
    Found suspect string in log4j at line 1253

    [error 2017/04/18 10:12:27.169 UTC <Function Execution Processor1> tid=0x5b1] Could
not deploy JAR file java.lang.RuntimeException: java.nio.file.NoSuchFileException: /tmp/junit3985345267510453893/locator-0
    java.lang.RuntimeException: java.lang.RuntimeException: java.nio.file.NoSuchFileException:
/tmp/junit3985345267510453893/locator-0
    	at io.github.lukehutch.fastclasspathscanner.FastClasspathScanner.scan(FastClasspathScanner.java:1115)
    	at io.github.lukehutch.fastclasspathscanner.FastClasspathScanner.scan(FastClasspathScanner.java:1143)
    	at io.github.lukehutch.fastclasspathscanner.FastClasspathScanner.scan(FastClasspathScanner.java:1166)
    	at org.apache.geode.internal.DeployedJar.findFunctionsInThisJar(DeployedJar.java:328)
    	at org.apache.geode.internal.DeployedJar.loadClassesAndRegisterFunctions(DeployedJar.java:175)
    	at org.apache.geode.internal.JarDeployer.registerNewVersions(JarDeployer.java:477)
    	at org.apache.geode.internal.JarDeployer.deploy(JarDeployer.java:516)
    	at org.apache.geode.management.internal.cli.functions.DeployFunction.execute(DeployFunction.java:68)
    	at org.apache.geode.internal.cache.execute.AbstractExecution.executeFunctionLocally(AbstractExecution.java:333)
    	at org.apache.geode.internal.cache.execute.AbstractExecution$2.run(AbstractExecution.java:303)
    	at java.util.concurrent.ThreadPoolExecutor.runWorker(ThreadPoolExecutor.java:1142)
    	at java.util.concurrent.ThreadPoolExecutor$Worker.run(ThreadPoolExecutor.java:617)
    	at org.apache.geode.distributed.internal.DistributionManager.runUntilShutdown(DistributionManager.java:621)
    	at org.apache.geode.distributed.internal.DistributionManager$9$1.run(DistributionManager.java:1067)
    	at java.lang.Thread.run(Thread.java:745)
    Caused by: java.lang.RuntimeException: java.nio.file.NoSuchFileException: /tmp/junit3985345267510453893/locator-0
    	at io.github.lukehutch.fastclasspathscanner.scanner.Scanner.call(Scanner.java:217)
    	at io.github.lukehutch.fastclasspathscanner.scanner.Scanner.call(Scanner.java:61)
    	at java.util.concurrent.FutureTask.run(FutureTask.java:266)
    	at java.util.concurrent.ThreadPoolExecutor.runWorker(ThreadPoolExecutor.java:1142)
    	at java.util.concurrent.ThreadPoolExecutor$Worker.run(ThreadPoolExecutor.java:617)
    	... 1 more
    Caused by: java.nio.file.NoSuchFileException: /tmp/junit3985345267510453893/locator-0
    	at sun.nio.fs.UnixException.translateToIOException(UnixException.java:86)
    	at sun.nio.fs.UnixException.rethrowAsIOException(UnixException.java:102)
    	at sun.nio.fs.UnixException.rethrowAsIOException(UnixException.java:107)
    	at sun.nio.fs.UnixPath.toRealPath(UnixPath.java:876)
    	at io.github.lukehutch.fastclasspathscanner.scanner.Scanner.call(Scanner.java:215)
    	... 5 more

org.apache.geode.management.internal.cli.commands.CreateAlterDestroyRegionCommandsDUnitTest
> testCreateRegionWithPartitionResolver FAILED
    java.lang.AssertionError: Suspicious strings were written to the log during this run.
    Fix the strings or use IgnoredException.addIgnoredException to ignore.
    -----------------------------------------------------------------------
    Found suspect string in log4j at line 606

    [error 2017/04/18 10:12:45.568 UTC <Function Execution Processor1> tid=0x811] Could
not deploy JAR file java.lang.RuntimeException: java.nio.file.NoSuchFileException: /tmp/junit3985345267510453893/server-1
    java.lang.RuntimeException: java.lang.RuntimeException: java.nio.file.NoSuchFileException:
/tmp/junit3985345267510453893/server-1
    	at io.github.lukehutch.fastclasspathscanner.FastClasspathScanner.scan(FastClasspathScanner.java:1115)
    	at io.github.lukehutch.fastclasspathscanner.FastClasspathScanner.scan(FastClasspathScanner.java:1143)
    	at io.github.lukehutch.fastclasspathscanner.FastClasspathScanner.scan(FastClasspathScanner.java:1166)
    	at org.apache.geode.internal.DeployedJar.findFunctionsInThisJar(DeployedJar.java:328)
    	at org.apache.geode.internal.DeployedJar.loadClassesAndRegisterFunctions(DeployedJar.java:175)
    	at org.apache.geode.internal.JarDeployer.registerNewVersions(JarDeployer.java:477)
    	at org.apache.geode.internal.JarDeployer.deploy(JarDeployer.java:516)
    	at org.apache.geode.management.internal.cli.functions.DeployFunction.execute(DeployFunction.java:68)
    	at org.apache.geode.internal.cache.MemberFunctionStreamingMessage.process(MemberFunctionStreamingMessage.java:191)
    	at org.apache.geode.distributed.internal.DistributionMessage.scheduleAction(DistributionMessage.java:376)
    	at org.apache.geode.distributed.internal.DistributionMessage$1.run(DistributionMessage.java:442)
    	at java.util.concurrent.ThreadPoolExecutor.runWorker(ThreadPoolExecutor.java:1142)
    	at java.util.concurrent.ThreadPoolExecutor$Worker.run(ThreadPoolExecutor.java:617)
    	at org.apache.geode.distributed.internal.DistributionManager.runUntilShutdown(DistributionManager.java:621)
    	at org.apache.geode.distributed.internal.DistributionManager$9$1.run(DistributionManager.java:1067)
    	at java.lang.Thread.run(Thread.java:745)
    Caused by: java.lang.RuntimeException: java.nio.file.NoSuchFileException: /tmp/junit3985345267510453893/server-1
    	at io.github.lukehutch.fastclasspathscanner.scanner.Scanner.call(Scanner.java:217)
    	at io.github.lukehutch.fastclasspathscanner.scanner.Scanner.call(Scanner.java:61)
    	at java.util.concurrent.FutureTask.run(FutureTask.java:266)
    	at java.util.concurrent.ThreadPoolExecutor.runWorker(ThreadPoolExecutor.java:1142)
    	at java.util.concurrent.ThreadPoolExecutor$Worker.run(ThreadPoolExecutor.java:617)
    	... 1 more
    Caused by: java.nio.file.NoSuchFileException: /tmp/junit3985345267510453893/server-1
    	at sun.nio.fs.UnixException.translateToIOException(UnixException.java:86)
    	at sun.nio.fs.UnixException.rethrowAsIOException(UnixException.java:102)
    	at sun.nio.fs.UnixException.rethrowAsIOException(UnixException.java:107)
    	at sun.nio.fs.UnixPath.toRealPath(UnixPath.java:876)
    	at io.github.lukehutch.fastclasspathscanner.scanner.Scanner.call(Scanner.java:215)
    	... 5 more

    -----------------------------------------------------------------------
    Found suspect string in log4j at line 639

    [error 2017/04/18 10:12:45.569 UTC <Function Execution Processor1> tid=0x7f8] Could
not deploy JAR file java.lang.RuntimeException: java.nio.file.NoSuchFileException: /tmp/junit3985345267510453893/locator-0
    java.lang.RuntimeException: java.lang.RuntimeException: java.nio.file.NoSuchFileException:
/tmp/junit3985345267510453893/locator-0
    	at io.github.lukehutch.fastclasspathscanner.FastClasspathScanner.scan(FastClasspathScanner.java:1115)
    	at io.github.lukehutch.fastclasspathscanner.FastClasspathScanner.scan(FastClasspathScanner.java:1143)
    	at io.github.lukehutch.fastclasspathscanner.FastClasspathScanner.scan(FastClasspathScanner.java:1166)
    	at org.apache.geode.internal.DeployedJar.findFunctionsInThisJar(DeployedJar.java:328)
    	at org.apache.geode.internal.DeployedJar.loadClassesAndRegisterFunctions(DeployedJar.java:175)
    	at org.apache.geode.internal.JarDeployer.registerNewVersions(JarDeployer.java:477)
    	at org.apache.geode.internal.JarDeployer.deploy(JarDeployer.java:516)
    	at org.apache.geode.management.internal.cli.functions.DeployFunction.execute(DeployFunction.java:68)
    	at org.apache.geode.internal.cache.execute.AbstractExecution.executeFunctionLocally(AbstractExecution.java:333)
    	at org.apache.geode.internal.cache.execute.AbstractExecution$2.run(AbstractExecution.java:303)
    	at java.util.concurrent.ThreadPoolExecutor.runWorker(ThreadPoolExecutor.java:1142)
    	at java.util.concurrent.ThreadPoolExecutor$Worker.run(ThreadPoolExecutor.java:617)
    	at org.apache.geode.distributed.internal.DistributionManager.runUntilShutdown(DistributionManager.java:621)
    	at org.apache.geode.distributed.internal.DistributionManager$9$1.run(DistributionManager.java:1067)
    	at java.lang.Thread.run(Thread.java:745)
    Caused by: java.lang.RuntimeException: java.nio.file.NoSuchFileException: /tmp/junit3985345267510453893/locator-0
    	at io.github.lukehutch.fastclasspathscanner.scanner.Scanner.call(Scanner.java:217)
    	at io.github.lukehutch.fastclasspathscanner.scanner.Scanner.call(Scanner.java:61)
    	at java.util.concurrent.FutureTask.run(FutureTask.java:266)
    	at java.util.concurrent.ThreadPoolExecutor.runWorker(ThreadPoolExecutor.java:1142)
    	at java.util.concurrent.ThreadPoolExecutor$Worker.run(ThreadPoolExecutor.java:617)
    	... 1 more
    Caused by: java.nio.file.NoSuchFileException: /tmp/junit3985345267510453893/locator-0
    	at sun.nio.fs.UnixException.translateToIOException(UnixException.java:86)
    	at sun.nio.fs.UnixException.rethrowAsIOException(UnixException.java:102)
    	at sun.nio.fs.UnixException.rethrowAsIOException(UnixException.java:107)
    	at sun.nio.fs.UnixPath.toRealPath(UnixPath.java:876)
    	at io.github.lukehutch.fastclasspathscanner.scanner.Scanner.call(Scanner.java:215)
    	... 5 more
{noformat}



--
This message was sent by Atlassian JIRA
(v6.3.15#6346)

Mime
View raw message