geode-dev mailing list archives

Site index · List index
Message view « Date » · « Thread »
Top « Date » · « Thread »
From Mark Bretl <mbr...@apache.org>
Subject Re: Build failed in Jenkins: Geode-nightly #817
Date Thu, 27 Apr 2017 20:37:44 GMT
I have added an exclude for any machines with the 'couchdb' label and
restarted the nightly build.

--Mark

On Thu, Apr 27, 2017 at 1:05 PM, Apache Jenkins Server <
jenkins@builds.apache.org> wrote:

> See <https://builds.apache.org/job/Geode-nightly/817/display/redirect>
>
> ------------------------------------------
> Started by timer
> [EnvInject] - Loading node environment variables.
> Building remotely on couchdb-macos1 (couchdb) in workspace <
> https://builds.apache.org/job/Geode-nightly/ws/>
> java.io.IOException: Failed to mkdirs: <https://builds.apache.org/
> job/Geode-nightly/ws/>
>         at hudson.FilePath.mkdirs(FilePath.java:1169)
>         at hudson.model.AbstractProject.checkout(AbstractProject.java:
> 1276)
>         at hudson.model.AbstractBuild$AbstractBuildExecution.
> defaultCheckout(AbstractBuild.java:604)
>         at jenkins.scm.SCMCheckoutStrategy.checkout(
> SCMCheckoutStrategy.java:86)
>         at hudson.model.AbstractBuild$AbstractBuildExecution.run(
> AbstractBuild.java:529)
>         at hudson.model.Run.execute(Run.java:1728)
>         at hudson.model.FreeStyleBuild.run(FreeStyleBuild.java:43)
>         at hudson.model.ResourceController.execute(
> ResourceController.java:98)
>         at hudson.model.Executor.run(Executor.java:404)
> Retrying after 10 seconds
> java.io.IOException: Failed to mkdirs: <https://builds.apache.org/
> job/Geode-nightly/ws/>
>         at hudson.FilePath.mkdirs(FilePath.java:1169)
>         at hudson.model.AbstractProject.checkout(AbstractProject.java:
> 1276)
>         at hudson.model.AbstractBuild$AbstractBuildExecution.
> defaultCheckout(AbstractBuild.java:604)
>         at jenkins.scm.SCMCheckoutStrategy.checkout(
> SCMCheckoutStrategy.java:86)
>         at hudson.model.AbstractBuild$AbstractBuildExecution.run(
> AbstractBuild.java:529)
>         at hudson.model.Run.execute(Run.java:1728)
>         at hudson.model.FreeStyleBuild.run(FreeStyleBuild.java:43)
>         at hudson.model.ResourceController.execute(
> ResourceController.java:98)
>         at hudson.model.Executor.run(Executor.java:404)
> Retrying after 10 seconds
> java.io.IOException: Failed to mkdirs: <https://builds.apache.org/
> job/Geode-nightly/ws/>
>         at hudson.FilePath.mkdirs(FilePath.java:1169)
>         at hudson.model.AbstractProject.checkout(AbstractProject.java:
> 1276)
>         at hudson.model.AbstractBuild$AbstractBuildExecution.
> defaultCheckout(AbstractBuild.java:604)
>         at jenkins.scm.SCMCheckoutStrategy.checkout(
> SCMCheckoutStrategy.java:86)
>         at hudson.model.AbstractBuild$AbstractBuildExecution.run(
> AbstractBuild.java:529)
>         at hudson.model.Run.execute(Run.java:1728)
>         at hudson.model.FreeStyleBuild.run(FreeStyleBuild.java:43)
>         at hudson.model.ResourceController.execute(
> ResourceController.java:98)
>         at hudson.model.Executor.run(Executor.java:404)
> Archiving artifacts
> ERROR: Build step failed with exception
> <https://builds.apache.org/job/Geode-nightly/ws/> does not exist.
>         at org.apache.tools.ant.types.AbstractFileSet.getDirectoryScanner(
> AbstractFileSet.java:483)
>         at org.apache.tools.ant.types.AbstractFileSet.getDirectoryScanner(
> AbstractFileSet.java:460)
>         at hudson.tasks.ArtifactArchiver$ListFiles.invoke(
> ArtifactArchiver.java:292)
>         at hudson.tasks.ArtifactArchiver$ListFiles.invoke(
> ArtifactArchiver.java:272)
>         at hudson.FilePath$FileCallableWrapper.call(FilePath.java:2731)
>         at hudson.remoting.UserRequest.perform(UserRequest.java:153)
>         at hudson.remoting.UserRequest.perform(UserRequest.java:50)
>         at hudson.remoting.Request$2.run(Request.java:336)
>         at hudson.remoting.InterceptingExecutorService$1.call(
> InterceptingExecutorService.java:68)
>         at java.util.concurrent.FutureTask.run(FutureTask.java:266)
>         at java.util.concurrent.ThreadPoolExecutor.runWorker(
> ThreadPoolExecutor.java:1142)
>         at java.util.concurrent.ThreadPoolExecutor$Worker.run(
> ThreadPoolExecutor.java:617)
>         at hudson.remoting.Engine$1$1.run(Engine.java:94)
>         at java.lang.Thread.run(Thread.java:745)
>         at ......remote call to Channel to /91.65.50.62(Native Method)
>         at hudson.remoting.Channel.attachCallSiteStackTrace(
> Channel.java:1537)
>         at hudson.remoting.UserResponse.retrieve(UserRequest.java:253)
>         at hudson.remoting.Channel.call(Channel.java:822)
>         at hudson.FilePath.act(FilePath.java:985)
>         at hudson.FilePath.act(FilePath.java:974)
>         at hudson.tasks.ArtifactArchiver.perform(ArtifactArchiver.java:
> 237)
>         at hudson.tasks.BuildStepCompatibilityLayer.perform(
> BuildStepCompatibilityLayer.java:78)
>         at hudson.tasks.BuildStepMonitor$1.perform(BuildStepMonitor.
> java:20)
>         at hudson.model.AbstractBuild$AbstractBuildExecution.
> perform(AbstractBuild.java:779)
>         at hudson.model.AbstractBuild$AbstractBuildExecution.
> performAllBuildSteps(AbstractBuild.java:720)
>         at hudson.model.Build$BuildExecution.post2(Build.java:185)
>         at hudson.model.AbstractBuild$AbstractBuildExecution.post(
> AbstractBuild.java:665)
>         at hudson.model.Run.execute(Run.java:1753)
>         at hudson.model.FreeStyleBuild.run(FreeStyleBuild.java:43)
>         at hudson.model.ResourceController.execute(
> ResourceController.java:98)
>         at hudson.model.Executor.run(Executor.java:404)
> Build step 'Archive the artifacts' marked build as failure
> Recording test results
> ERROR: Build step failed with exception
> <https://builds.apache.org/job/Geode-nightly/ws/> does not exist.
>         at org.apache.tools.ant.types.AbstractFileSet.getDirectoryScanner(
> AbstractFileSet.java:483)
>         at org.apache.tools.ant.types.AbstractFileSet.getDirectoryScanner(
> AbstractFileSet.java:460)
>         at hudson.tasks.junit.JUnitParser$ParseResultCallable.invoke(
> JUnitParser.java:127)
>         at hudson.tasks.junit.JUnitParser$ParseResultCallable.invoke(
> JUnitParser.java:107)
>         at hudson.FilePath$FileCallableWrapper.call(FilePath.java:2731)
>         at hudson.remoting.UserRequest.perform(UserRequest.java:153)
>         at hudson.remoting.UserRequest.perform(UserRequest.java:50)
>         at hudson.remoting.Request$2.run(Request.java:336)
>         at hudson.remoting.InterceptingExecutorService$1.call(
> InterceptingExecutorService.java:68)
>         at java.util.concurrent.FutureTask.run(FutureTask.java:266)
>         at java.util.concurrent.ThreadPoolExecutor.runWorker(
> ThreadPoolExecutor.java:1142)
>         at java.util.concurrent.ThreadPoolExecutor$Worker.run(
> ThreadPoolExecutor.java:617)
>         at hudson.remoting.Engine$1$1.run(Engine.java:94)
>         at java.lang.Thread.run(Thread.java:745)
>         at ......remote call to Channel to /91.65.50.62(Native Method)
>         at hudson.remoting.Channel.attachCallSiteStackTrace(
> Channel.java:1537)
>         at hudson.remoting.UserResponse.retrieve(UserRequest.java:253)
>         at hudson.remoting.Channel.call(Channel.java:822)
>         at hudson.FilePath.act(FilePath.java:985)
>         at hudson.FilePath.act(FilePath.java:974)
>         at hudson.tasks.junit.JUnitParser.parseResult(
> JUnitParser.java:103)
>         at hudson.tasks.junit.JUnitResultArchiver.parse(
> JUnitResultArchiver.java:128)
>         at hudson.tasks.junit.JUnitResultArchiver.perform(
> JUnitResultArchiver.java:149)
>         at hudson.tasks.BuildStepCompatibilityLayer.perform(
> BuildStepCompatibilityLayer.java:78)
>         at hudson.tasks.BuildStepMonitor$1.perform(BuildStepMonitor.
> java:20)
>         at hudson.model.AbstractBuild$AbstractBuildExecution.
> perform(AbstractBuild.java:779)
>         at hudson.model.AbstractBuild$AbstractBuildExecution.
> performAllBuildSteps(AbstractBuild.java:720)
>         at hudson.model.Build$BuildExecution.post2(Build.java:185)
>         at hudson.model.AbstractBuild$AbstractBuildExecution.post(
> AbstractBuild.java:665)
>         at hudson.model.Run.execute(Run.java:1753)
>         at hudson.model.FreeStyleBuild.run(FreeStyleBuild.java:43)
>         at hudson.model.ResourceController.execute(
> ResourceController.java:98)
>         at hudson.model.Executor.run(Executor.java:404)
> Build step 'Publish JUnit test result report' marked build as failure
> Not sending mail to unregistered user ukohlmeyer@pivotal.io
> Not sending mail to unregistered user eshu@pivotal.io
> Not sending mail to unregistered user gzhou@pivotal.io
> Not sending mail to unregistered user jiliao@pivotal.io
> Not sending mail to unregistered user huynhja@gmail.com
>

Mime
  • Unnamed multipart/alternative (inline, None, 0 bytes)
View raw message