geode-dev mailing list archives

Site index · List index
Message view « Date » · « Thread »
Top « Date » · « Thread »
From Apache Jenkins Server <jenk...@builds.apache.org>
Subject Build failed in Jenkins: Geode-nightly #810
Date Mon, 17 Apr 2017 16:57:47 GMT
See <https://builds.apache.org/job/Geode-nightly/810/display/redirect?page=changes>

Changes:

[jstewart] GEODE-2686: Remove JarClassLoader

[jstewart] GEODE-2705: Jars undeployed from cluster configuration will not be

[jstewart] GEODE-2686: Add more logging to JarDeployer

[jstewart] GEODE-2290: Limit scanning of deployed jars

------------------------------------------
[...truncated 110.98 KB...]
    	at org.apache.geode.internal.DeployedJar.loadClassesAndRegisterFunctions(DeployedJar.java:175)
    	at org.apache.geode.internal.JarDeployer.registerNewVersions(JarDeployer.java:477)
    	at org.apache.geode.internal.JarDeployer.deploy(JarDeployer.java:516)
    	at org.apache.geode.management.internal.cli.functions.DeployFunction.execute(DeployFunction.java:68)
    	at org.apache.geode.internal.cache.MemberFunctionStreamingMessage.process(MemberFunctionStreamingMessage.java:191)
    	at org.apache.geode.distributed.internal.DistributionMessage.scheduleAction(DistributionMessage.java:376)
    	at org.apache.geode.distributed.internal.DistributionMessage$1.run(DistributionMessage.java:442)
    	at java.util.concurrent.ThreadPoolExecutor.runWorker(ThreadPoolExecutor.java:1142)
    	at java.util.concurrent.ThreadPoolExecutor$Worker.run(ThreadPoolExecutor.java:617)
    	at org.apache.geode.distributed.internal.DistributionManager.runUntilShutdown(DistributionManager.java:621)
    	at org.apache.geode.distributed.internal.DistributionManager$9$1.run(DistributionManager.java:1067)
    	at java.lang.Thread.run(Thread.java:745)
    Caused by: java.lang.RuntimeException: java.nio.file.NoSuchFileException: /tmp/junit82542385908112464/server-1
    	at io.github.lukehutch.fastclasspathscanner.scanner.Scanner.call(Scanner.java:217)
    	at io.github.lukehutch.fastclasspathscanner.scanner.Scanner.call(Scanner.java:61)
    	at java.util.concurrent.FutureTask.run(FutureTask.java:266)
    	at java.util.concurrent.ThreadPoolExecutor.runWorker(ThreadPoolExecutor.java:1142)
    	at java.util.concurrent.ThreadPoolExecutor$Worker.run(ThreadPoolExecutor.java:617)
    	... 1 more
    Caused by: java.nio.file.NoSuchFileException: /tmp/junit82542385908112464/server-1
    	at sun.nio.fs.UnixException.translateToIOException(UnixException.java:86)
    	at sun.nio.fs.UnixException.rethrowAsIOException(UnixException.java:102)
    	at sun.nio.fs.UnixException.rethrowAsIOException(UnixException.java:107)
    	at sun.nio.fs.UnixPath.toRealPath(UnixPath.java:876)
    	at io.github.lukehutch.fastclasspathscanner.scanner.Scanner.call(Scanner.java:215)
    	... 5 more

org.apache.geode.management.internal.cli.commands.DeployCommandRedeployDUnitTest > redeployJarsWithNewVersionsOfFunctions
FAILED
    java.io.IOException: Compilation error: Line 7 - class FUNCTION_A is public, should be
declared in a file named FUNCTION_A.java
    Compilation error: Line -1 - /jddunit/function/DeployCommandRedeployDUnitFunctionB.java
uses unchecked or unsafe operations.
    Compilation error: Line -1 - Recompile with -Xlint:unchecked for details.
        at org.apache.geode.internal.ClassBuilder.compileClass(ClassBuilder.java:210)
        at org.apache.geode.internal.ClassBuilder.writeJarFromContent(ClassBuilder.java:157)
        at org.apache.geode.internal.ClassBuilder.writeJarFromContent(ClassBuilder.java:74)
        at org.apache.geode.management.internal.cli.commands.DeployCommandRedeployDUnitTest.createJarWithFunctionB(DeployCommandRedeployDUnitTest.java:136)
        at org.apache.geode.management.internal.cli.commands.DeployCommandRedeployDUnitTest.setup(DeployCommandRedeployDUnitTest.java:71)

6852 tests completed, 3 failed, 603 skipped
:geode-core:distributedTest FAILED
:geode-core:flakyTest
:geode-core:integrationTest
:geode-cq:assemble
:geode-cq:compileTestJavaNote: Some input files use or override a deprecated API.
Note: Recompile with -Xlint:deprecation for details.
Note: Some input files use unchecked or unsafe operations.
Note: Recompile with -Xlint:unchecked for details.

:geode-cq:processTestResources
:geode-cq:testClasses
:geode-cq:checkMissedTests
:geode-cq:spotlessJavaCheck
:geode-cq:spotlessCheck
:geode-cq:test
:geode-cq:distributedTest
:geode-cq:flakyTest
:geode-cq:integrationTest
:geode-json:assemble
:geode-json:compileTestJava UP-TO-DATE
:geode-json:processTestResources
:geode-json:testClasses
:geode-json:checkMissedTests UP-TO-DATE
:geode-json:spotlessJavaCheck
:geode-json:spotlessCheck
:geode-json:test UP-TO-DATE
:geode-json:distributedTest UP-TO-DATE
:geode-json:flakyTest UP-TO-DATE
:geode-json:integrationTest UP-TO-DATE
:geode-junit:javadoc
:geode-junit:javadocJar
:geode-junit:sourcesJar
:geode-junit:signArchives SKIPPED
:geode-junit:assemble
:geode-junit:compileTestJava
:geode-junit:processTestResources UP-TO-DATE
:geode-junit:testClasses
:geode-junit:checkMissedTests
:geode-junit:spotlessJavaCheck
:geode-junit:spotlessCheck
:geode-junit:test
:geode-junit:distributedTest
:geode-junit:flakyTest
:geode-junit:integrationTest
:geode-lucene:assemble
:geode-lucene:compileTestJavaNote: Some input files use or override a deprecated API.
Note: Recompile with -Xlint:deprecation for details.
Note: Some input files use unchecked or unsafe operations.
Note: Recompile with -Xlint:unchecked for details.

:geode-lucene:processTestResources
:geode-lucene:testClasses
:geode-lucene:checkMissedTests
:geode-lucene:spotlessJavaCheck
:geode-lucene:spotlessCheck
:geode-lucene:test
:geode-lucene:distributedTest
:geode-lucene:flakyTest
:geode-lucene:integrationTest
:geode-old-client-support:assemble
:geode-old-client-support:compileTestJava
:geode-old-client-support:processTestResources UP-TO-DATE
:geode-old-client-support:testClasses
:geode-old-client-support:checkMissedTests
:geode-old-client-support:spotlessJavaCheck
:geode-old-client-support:spotlessCheck
:geode-old-client-support:test
:geode-old-client-support:distributedTest
:geode-old-client-support:flakyTest
:geode-old-client-support:integrationTest
:geode-old-versions:javadoc UP-TO-DATE
:geode-old-versions:javadocJar
:geode-old-versions:sourcesJar
:geode-old-versions:signArchives SKIPPED
:geode-old-versions:assemble
:geode-old-versions:compileTestJava UP-TO-DATE
:geode-old-versions:processTestResources UP-TO-DATE
:geode-old-versions:testClasses UP-TO-DATE
:geode-old-versions:checkMissedTests UP-TO-DATE
:geode-old-versions:spotlessJavaCheck
:geode-old-versions:spotlessCheck
:geode-old-versions:test UP-TO-DATE
:geode-old-versions:distributedTest UP-TO-DATE
:geode-old-versions:flakyTest UP-TO-DATE
:geode-old-versions:integrationTest UP-TO-DATE
:geode-pulse:assemble
:geode-pulse:compileTestJavaNote: <https://builds.apache.org/job/Geode-nightly/ws/geode-pulse/src/test/java/org/apache/geode/tools/pulse/tests/ui/PulseBase.java>
uses or overrides a deprecated API.
Note: Recompile with -Xlint:deprecation for details.
Note: <https://builds.apache.org/job/Geode-nightly/ws/geode-pulse/src/test/java/org/apache/geode/tools/pulse/controllers/PulseControllerJUnitTest.java>
uses unchecked or unsafe operations.
Note: Recompile with -Xlint:unchecked for details.

:geode-pulse:processTestResources
:geode-pulse:testClasses
:geode-pulse:checkMissedTests
:geode-pulse:spotlessJavaCheck
:geode-pulse:spotlessCheck
:geode-pulse:test
:geode-pulse:distributedTest
:geode-pulse:flakyTest
:geode-pulse:integrationTest
:geode-rebalancer:assemble
:geode-rebalancer:compileTestJava
:geode-rebalancer:processTestResources UP-TO-DATE
:geode-rebalancer:testClasses
:geode-rebalancer:checkMissedTests
:geode-rebalancer:spotlessJavaCheck
:geode-rebalancer:spotlessCheck
:geode-rebalancer:test
:geode-rebalancer:distributedTest
:geode-rebalancer:flakyTest
:geode-rebalancer:integrationTest
:geode-wan:assemble
:geode-wan:compileTestJavaNote: Some input files use or override a deprecated API.
Note: Recompile with -Xlint:deprecation for details.
Note: Some input files use unchecked or unsafe operations.
Note: Recompile with -Xlint:unchecked for details.

:geode-wan:processTestResources
:geode-wan:testClasses
:geode-wan:checkMissedTests
:geode-wan:spotlessJavaCheck
:geode-wan:spotlessCheck
:geode-wan:test
:geode-wan:distributedTest
:geode-wan:flakyTest
:geode-wan:integrationTest
:geode-web:assemble
:geode-web:compileTestJavaNote: Some input files use or override a deprecated API.
Note: Recompile with -Xlint:deprecation for details.
Note: Some input files use unchecked or unsafe operations.
Note: Recompile with -Xlint:unchecked for details.

:geode-web:processTestResources UP-TO-DATE
:geode-web:testClasses
:geode-web:checkMissedTests
:geode-web:spotlessJavaCheck
:geode-web:spotlessCheck
:geode-web:test
:geode-web:distributedTest
:geode-web:flakyTest
:geode-web:integrationTest
:geode-web-api:assemble
:geode-web-api:compileTestJava
:geode-web-api:processTestResources UP-TO-DATE
:geode-web-api:testClasses
:geode-web-api:checkMissedTests
:geode-web-api:spotlessJavaCheck
:geode-web-api:spotlessCheck
:geode-web-api:test
:geode-web-api:distributedTest
:geode-web-api:flakyTest
:geode-web-api:integrationTest
:combineReports
All test reports at <https://builds.apache.org/job/Geode-nightly/ws/build/reports/combined>
:compileJava UP-TO-DATE
:processResources UP-TO-DATE
:classes UP-TO-DATE
:jar
:uploadArchives
:extensions/geode-modules:uploadArchives
:extensions/geode-modules-assembly:uploadArchives SKIPPED
:extensions/geode-modules-session:uploadArchives
:extensions/geode-modules-session-internal:uploadArchives
:extensions/geode-modules-tomcat7:uploadArchives
:extensions/geode-modules-tomcat8:uploadArchives
:geode-assembly:uploadArchives SKIPPED
:geode-benchmarks:uploadArchives SKIPPED
:geode-common:uploadArchives
:geode-core:uploadArchives
:geode-cq:uploadArchives
:geode-json:uploadArchives
:geode-junit:uploadArchives
:geode-lucene:uploadArchives
:geode-old-client-support:uploadArchives
:geode-old-versions:uploadArchives SKIPPED
:geode-pulse:uploadArchives
:geode-rebalancer:uploadArchives
:geode-wan:uploadArchives
:geode-web:uploadArchives
:geode-web-api:uploadArchives

FAILURE: Build completed with 2 failures.

1: Task failed with an exception.
-----------
* What went wrong:
Execution failed for task ':rat'.
> Found 2 files with unapproved/unknown licenses. See <https://builds.apache.org/job/Geode-nightly/810/artifact/build/reports/rat/rat-report.txt>

* Try:
Run with --stacktrace option to get the stack trace. Run with --info or --debug option to
get more log output.
==============================================================================

2: Task failed with an exception.
-----------
* What went wrong:
Execution failed for task ':geode-core:distributedTest'.
> There were failing tests. See the report at: file://<https://builds.apache.org/job/Geode-nightly/ws/geode-core/build/reports/distributedTest/index.html>

* Try:
Run with --stacktrace option to get the stack trace. Run with --info or --debug option to
get more log output.
==============================================================================

BUILD FAILED

Total time: 13 hrs 10 mins 25.915 secs
Build step 'Invoke Gradle script' changed build result to FAILURE
Build step 'Invoke Gradle script' marked build as failure
Archiving artifacts
Compressed 328.38 MB of artifacts by 50.8% relative to #808
Recording test results

Mime
View raw message