geode-dev mailing list archives

Site index · List index
Message view « Date » · « Thread »
Top « Date » · « Thread »
From Kenneth Howe <kh...@pivotal.io>
Subject Re: Build failed in Jenkins: Geode-nightly #805
Date Wed, 12 Apr 2017 17:25:51 GMT
See discussion in https://issues.apache.org/jira/browse/GEODE-2647 <https://issues.apache.org/jira/browse/GEODE-2647>

> On Apr 12, 2017, at 9:31 AM, Apache Jenkins Server <jenkins@builds.apache.org>
wrote:
> 
> See <https://builds.apache.org/job/Geode-nightly/805/display/redirect?page=changes>
> 
> Changes:
> 
> [gosullivan] Fix a repetition in the README.
> 
> [jiliao] GEODE-1274: Migration from PulseLogWriter to Log4j standard and removal
> 
> [jiliao] GEODE-2767: Added DUnitTests to validate export log options --group and
> 
> [dschneider] Revert "GEODE-2485: fix leak in tx suspend/resume"
> 
> [klund] GEODE-2765: change gfsh help to consistently use log4j levels
> 
> [dschneider] GEODE-2485: fix leak in tx suspend/resume
> 
> ------------------------------------------
> [...truncated 101.04 KB...]
>        at org.apache.geode.test.dunit.VM.invoke(VM.java:292)
>        at org.apache.geode.management.ClientHealthStatsDUnitTest.testClientHealthStats_SubscriptionEnabled(ClientHealthStatsDUnitTest.java:128)
> 
>        Caused by:
>        java.lang.NullPointerException
>            at org.apache.geode.management.ClientHealthStatsDUnitTest.put(ClientHealthStatsDUnitTest.java:377)
>            at org.apache.geode.management.ClientHealthStatsDUnitTest.lambda$testClientHealthStats_SubscriptionEnabled$bb17a952$2(ClientHealthStatsDUnitTest.java:128)
> 
> 6854 tests completed, 2 failed, 603 skipped
> :geode-core:distributedTest FAILED
> :geode-core:flakyTest
> :geode-core:integrationTest
> :geode-cq:assemble
> :geode-cq:compileTestJavaNote: Some input files use or override a deprecated API.
> Note: Recompile with -Xlint:deprecation for details.
> Note: Some input files use unchecked or unsafe operations.
> Note: Recompile with -Xlint:unchecked for details.
> 
> :geode-cq:processTestResources
> :geode-cq:testClasses
> :geode-cq:checkMissedTests
> :geode-cq:spotlessJavaCheck
> :geode-cq:spotlessCheck
> :geode-cq:test
> :geode-cq:check
> :geode-cq:build
> :geode-cq:distributedTest
> :geode-cq:flakyTest
> :geode-cq:integrationTest
> :geode-json:assemble
> :geode-json:compileTestJava UP-TO-DATE
> :geode-json:processTestResources
> :geode-json:testClasses
> :geode-json:checkMissedTests UP-TO-DATE
> :geode-json:spotlessJavaCheck
> :geode-json:spotlessCheck
> :geode-json:test UP-TO-DATE
> :geode-json:check
> :geode-json:build
> :geode-json:distributedTest UP-TO-DATE
> :geode-json:flakyTest UP-TO-DATE
> :geode-json:integrationTest UP-TO-DATE
> :geode-junit:javadoc
> :geode-junit:javadocJar
> :geode-junit:sourcesJar
> :geode-junit:signArchives SKIPPED
> :geode-junit:assemble
> :geode-junit:compileTestJava
> :geode-junit:processTestResources UP-TO-DATE
> :geode-junit:testClasses
> :geode-junit:checkMissedTests
> :geode-junit:spotlessJavaCheck
> :geode-junit:spotlessCheck
> :geode-junit:test
> :geode-junit:check
> :geode-junit:build
> :geode-junit:distributedTest
> :geode-junit:flakyTest
> :geode-junit:integrationTest
> :geode-lucene:assemble
> :geode-lucene:compileTestJavaNote: Some input files use or override a deprecated API.
> Note: Recompile with -Xlint:deprecation for details.
> Note: Some input files use unchecked or unsafe operations.
> Note: Recompile with -Xlint:unchecked for details.
> 
> :geode-lucene:processTestResources
> :geode-lucene:testClasses
> :geode-lucene:checkMissedTests
> :geode-lucene:spotlessJavaCheck
> :geode-lucene:spotlessCheck
> :geode-lucene:test
> :geode-lucene:check
> :geode-lucene:build
> :geode-lucene:distributedTest
> :geode-lucene:flakyTest
> :geode-lucene:integrationTest
> :geode-old-client-support:assemble
> :geode-old-client-support:compileTestJava
> :geode-old-client-support:processTestResources UP-TO-DATE
> :geode-old-client-support:testClasses
> :geode-old-client-support:checkMissedTests
> :geode-old-client-support:spotlessJavaCheck
> :geode-old-client-support:spotlessCheck
> :geode-old-client-support:test
> :geode-old-client-support:check
> :geode-old-client-support:build
> :geode-old-client-support:distributedTest
> :geode-old-client-support:flakyTest
> :geode-old-client-support:integrationTest
> :geode-old-versions:javadoc UP-TO-DATE
> :geode-old-versions:javadocJar
> :geode-old-versions:sourcesJar
> :geode-old-versions:signArchives SKIPPED
> :geode-old-versions:assemble
> :geode-old-versions:compileTestJava UP-TO-DATE
> :geode-old-versions:processTestResources UP-TO-DATE
> :geode-old-versions:testClasses UP-TO-DATE
> :geode-old-versions:checkMissedTests UP-TO-DATE
> :geode-old-versions:spotlessJavaCheck
> :geode-old-versions:spotlessCheck
> :geode-old-versions:test UP-TO-DATE
> :geode-old-versions:check
> :geode-old-versions:build
> :geode-old-versions:distributedTest UP-TO-DATE
> :geode-old-versions:flakyTest UP-TO-DATE
> :geode-old-versions:integrationTest UP-TO-DATE
> :geode-pulse:assemble
> :geode-pulse:compileTestJavaNote: <https://builds.apache.org/job/Geode-nightly/ws/geode-pulse/src/test/java/org/apache/geode/tools/pulse/tests/ui/PulseBase.java>
uses or overrides a deprecated API.
> Note: Recompile with -Xlint:deprecation for details.
> Note: <https://builds.apache.org/job/Geode-nightly/ws/geode-pulse/src/test/java/org/apache/geode/tools/pulse/controllers/PulseControllerJUnitTest.java>
uses unchecked or unsafe operations.
> Note: Recompile with -Xlint:unchecked for details.
> 
> :geode-pulse:processTestResources
> :geode-pulse:testClasses
> :geode-pulse:checkMissedTests
> :geode-pulse:spotlessJavaCheck
> :geode-pulse:spotlessCheck
> :geode-pulse:test
> :geode-pulse:check
> :geode-pulse:build
> :geode-pulse:distributedTest
> :geode-pulse:flakyTest
> :geode-pulse:integrationTest
> :geode-rebalancer:assemble
> :geode-rebalancer:compileTestJava
> :geode-rebalancer:processTestResources UP-TO-DATE
> :geode-rebalancer:testClasses
> :geode-rebalancer:checkMissedTests
> :geode-rebalancer:spotlessJavaCheck
> :geode-rebalancer:spotlessCheck
> :geode-rebalancer:test
> :geode-rebalancer:check
> :geode-rebalancer:build
> :geode-rebalancer:distributedTest
> :geode-rebalancer:flakyTest
> :geode-rebalancer:integrationTest
> :geode-wan:assemble
> :geode-wan:compileTestJavaNote: Some input files use or override a deprecated API.
> Note: Recompile with -Xlint:deprecation for details.
> Note: Some input files use unchecked or unsafe operations.
> Note: Recompile with -Xlint:unchecked for details.
> 
> :geode-wan:processTestResources
> :geode-wan:testClasses
> :geode-wan:checkMissedTests
> :geode-wan:spotlessJavaCheck
> :geode-wan:spotlessCheck
> :geode-wan:test
> :geode-wan:check
> :geode-wan:build
> :geode-wan:distributedTest
> :geode-wan:flakyTest
> :geode-wan:integrationTest
> :geode-web:assemble
> :geode-web:compileTestJavaNote: Some input files use or override a deprecated API.
> Note: Recompile with -Xlint:deprecation for details.
> Note: Some input files use unchecked or unsafe operations.
> Note: Recompile with -Xlint:unchecked for details.
> 
> :geode-web:processTestResources UP-TO-DATE
> :geode-web:testClasses
> :geode-web:checkMissedTests
> :geode-web:spotlessJavaCheck
> :geode-web:spotlessCheck
> :geode-web:test
> :geode-web:check
> :geode-web:build
> :geode-web:distributedTest
> :geode-web:flakyTest
> :geode-web:integrationTest
> :geode-web-api:assemble
> :geode-web-api:compileTestJava
> :geode-web-api:processTestResources UP-TO-DATE
> :geode-web-api:testClasses
> :geode-web-api:checkMissedTests
> :geode-web-api:spotlessJavaCheck
> :geode-web-api:spotlessCheck
> :geode-web-api:test
> :geode-web-api:check
> :geode-web-api:build
> :geode-web-api:distributedTest
> :geode-web-api:flakyTest
> :geode-web-api:integrationTest
> :combineReports
> All test reports at <https://builds.apache.org/job/Geode-nightly/ws/build/reports/combined>
> :extensions/geode-modules:precheckin
> :extensions/geode-modules-assembly:precheckin
> :extensions/geode-modules-session:precheckin
> :extensions/geode-modules-session-internal:precheckin
> :extensions/geode-modules-tomcat7:precheckin
> :extensions/geode-modules-tomcat8:precheckin
> :geode-assembly:precheckin
> :geode-benchmarks:precheckin
> :geode-common:precheckin
> :geode-cq:precheckin
> :geode-json:precheckin
> :geode-junit:precheckin
> :geode-lucene:precheckin
> :geode-old-client-support:precheckin
> :geode-old-versions:precheckin
> :geode-pulse:precheckin
> :geode-rebalancer:precheckin
> :geode-wan:precheckin
> :geode-web:precheckin
> :geode-web-api:precheckin
> :compileJava UP-TO-DATE
> :processResources UP-TO-DATE
> :classes UP-TO-DATE
> :jar
> :uploadArchives
> :extensions/geode-modules:uploadArchives
> :extensions/geode-modules-assembly:uploadArchives SKIPPED
> :extensions/geode-modules-session:uploadArchives
> :extensions/geode-modules-session-internal:uploadArchives
> :extensions/geode-modules-tomcat7:uploadArchives
> :extensions/geode-modules-tomcat8:uploadArchives
> :geode-assembly:uploadArchives SKIPPED
> :geode-benchmarks:uploadArchives SKIPPED
> :geode-common:uploadArchives
> :geode-core:uploadArchives
> :geode-cq:uploadArchives
> :geode-json:uploadArchives
> :geode-junit:uploadArchives
> :geode-lucene:uploadArchives
> :geode-old-client-support:uploadArchives
> :geode-old-versions:uploadArchives SKIPPED
> :geode-pulse:uploadArchives
> :geode-rebalancer:uploadArchives
> :geode-wan:uploadArchives
> :geode-web:uploadArchives
> :geode-web-api:uploadArchives
> 
> FAILURE: Build failed with an exception.
> 
> * What went wrong:
> Execution failed for task ':geode-core:distributedTest'.
>> There were failing tests. See the report at: file://<https://builds.apache.org/job/Geode-nightly/ws/geode-core/build/reports/distributedTest/index.html>
> 
> * Try:
> Run with --stacktrace option to get the stack trace. Run with --info or --debug option
to get more log output.
> 
> BUILD FAILED
> 
> Total time: 12 hrs 39 mins 50.267 secs
> Build step 'Invoke Gradle script' changed build result to FAILURE
> Build step 'Invoke Gradle script' marked build as failure
> Archiving artifacts
> Compressed 327.93 MB of artifacts by 44.2% relative to #803
> Recording test results


Mime
  • Unnamed multipart/alternative (inline, None, 0 bytes)
View raw message