geode-dev mailing list archives

Site index · List index
Message view « Date » · « Thread »
Top « Date » · « Thread »
From Apache Jenkins Server <jenk...@builds.apache.org>
Subject Build failed in Jenkins: Geode-nightly #518
Date Sun, 03 Jul 2016 14:30:21 GMT
See <https://builds.apache.org/job/Geode-nightly/518/>

------------------------------------------
[...truncated 689 lines...]
:geode-rebalancer:integrationTest
:geode-wan:assemble
:geode-wan:compileTestJavaNote: Some input files use or override a deprecated API.
Note: Recompile with -Xlint:deprecation for details.
Note: Some input files use unchecked or unsafe operations.
Note: Recompile with -Xlint:unchecked for details.

:geode-wan:processTestResources
:geode-wan:testClasses
:geode-wan:checkMissedTests
:geode-wan:test
:geode-wan:check
:geode-wan:build
:geode-wan:distributedTest

com.gemstone.gemfire.internal.cache.wan.serial.SerialWANStatsDUnitTest > testReplicatedSerialPropagationWithMultipleDispatchers
FAILED
    com.gemstone.gemfire.test.dunit.RMIException: While invoking com.gemstone.gemfire.internal.cache.wan.serial.SerialWANStatsDUnitTest$$Lambda$1118/898548188.run
in VM 4 running on Host asf902.gq1.ygridcore.net with 8 VMs
        at com.gemstone.gemfire.test.dunit.VM.invoke(VM.java:389)
        at com.gemstone.gemfire.test.dunit.VM.invoke(VM.java:355)
        at com.gemstone.gemfire.test.dunit.VM.invoke(VM.java:293)
        at com.gemstone.gemfire.internal.cache.wan.serial.SerialWANStatsDUnitTest.testReplicatedSerialPropagationWithMultipleDispatchers(SerialWANStatsDUnitTest.java:149)

        Caused by:
        java.lang.AssertionError: expected:<0> but was:<1>
            at org.junit.Assert.fail(Assert.java:88)
            at org.junit.Assert.failNotEquals(Assert.java:834)
            at org.junit.Assert.assertEquals(Assert.java:645)
            at org.junit.Assert.assertEquals(Assert.java:631)
            at com.gemstone.gemfire.internal.cache.wan.WANTestBase.checkBatchStats(WANTestBase.java:1303)
            at com.gemstone.gemfire.internal.cache.wan.serial.SerialWANStatsDUnitTest.lambda$testReplicatedSerialPropagationWithMultipleDispatchers$84651174$12(SerialWANStatsDUnitTest.java:149)

com.gemstone.gemfire.internal.cache.wan.serial.SerialGatewaySenderOperationsDUnitTest >
testStopOneSender_StartAnotherSender FAILED
    java.lang.AssertionError: An exception occurred during asynchronous invocation.

        Caused by:
        com.gemstone.gemfire.cache.client.internal.pooling.ConnectionDestroyedException

com.gemstone.gemfire.internal.cache.wan.serial.SerialGatewaySenderOperationsDUnitTest >
testStopOneSerialGatewaySenderBothPrimary FAILED
    com.gemstone.gemfire.test.dunit.RMIException: While invoking com.gemstone.gemfire.internal.cache.wan.serial.SerialGatewaySenderOperationsDUnitTest$$Lambda$194/420688668.run
in VM 2 running on Host asf902.gq1.ygridcore.net with 8 VMs
        at com.gemstone.gemfire.test.dunit.VM.invoke(VM.java:389)
        at com.gemstone.gemfire.test.dunit.VM.invoke(VM.java:355)
        at com.gemstone.gemfire.test.dunit.VM.invoke(VM.java:293)
        at com.gemstone.gemfire.internal.cache.wan.serial.SerialGatewaySenderOperationsDUnitTest.testStopOneSerialGatewaySenderBothPrimary(SerialGatewaySenderOperationsDUnitTest.java:310)

        Caused by:
        com.jayway.awaitility.core.ConditionTimeoutException: Condition defined as a lambda
expression in com.gemstone.gemfire.internal.cache.wan.WANTestBase that uses int, intcom.gemstone.gemfire.cache.Region
Expected region entries: 200 but actual entries: 0 present region keyset [] expected:<200>
but was:<0> within 30000 milliseconds.
            at com.jayway.awaitility.core.ConditionAwaiter.await(ConditionAwaiter.java:122)
            at com.jayway.awaitility.core.AssertionCondition.await(AssertionCondition.java:117)
            at com.jayway.awaitility.core.AssertionCondition.await(AssertionCondition.java:32)
            at com.jayway.awaitility.core.ConditionFactory.until(ConditionFactory.java:764)
            at com.jayway.awaitility.core.ConditionFactory.until(ConditionFactory.java:603)
            at com.gemstone.gemfire.internal.cache.wan.WANTestBase.validateRegionSize(WANTestBase.java:2764)
            at com.gemstone.gemfire.internal.cache.wan.WANTestBase.validateRegionSize(WANTestBase.java:2751)
            at com.gemstone.gemfire.internal.cache.wan.serial.SerialGatewaySenderOperationsDUnitTest.lambda$testStopOneSerialGatewaySenderBothPrimary$84651174$5(SerialGatewaySenderOperationsDUnitTest.java:310)

    java.lang.AssertionError: Suspicious strings were written to the log during this run.
    Fix the strings or use IgnoredException.addIgnoredException to ignore.
    -----------------------------------------------------------------------
    Found suspect string in log4j at line 5735

    [fatal 2016/07/03 12:54:07.611 UTC <Event Processor for GatewaySender_ln> tid=0x3821]
Stopping the processor because the following exception occurred while processing a batch:
    java.lang.IllegalStateException: A pool named "ln" already exists
    	at com.gemstone.gemfire.internal.cache.PoolManagerImpl.register(PoolManagerImpl.java:152)
    	at com.gemstone.gemfire.cache.client.internal.PoolImpl.finishCreate(PoolImpl.java:145)
    	at com.gemstone.gemfire.cache.client.internal.PoolImpl.create(PoolImpl.java:133)
    	at com.gemstone.gemfire.internal.cache.PoolFactoryImpl.create(PoolFactoryImpl.java:319)
    	at com.gemstone.gemfire.internal.cache.wan.AbstractRemoteGatewaySender.initProxy(AbstractRemoteGatewaySender.java:142)
    	at com.gemstone.gemfire.internal.cache.wan.GatewaySenderEventRemoteDispatcher.initializeConnection(GatewaySenderEventRemoteDispatcher.java:378)
    	at com.gemstone.gemfire.internal.cache.wan.GatewaySenderEventRemoteDispatcher.getConnection(GatewaySenderEventRemoteDispatcher.java:319)
    	at com.gemstone.gemfire.internal.cache.wan.GatewaySenderEventRemoteDispatcher._dispatchBatch(GatewaySenderEventRemoteDispatcher.java:202)
    	at com.gemstone.gemfire.internal.cache.wan.GatewaySenderEventRemoteDispatcher.dispatchBatch(GatewaySenderEventRemoteDispatcher.java:152)
    	at com.gemstone.gemfire.internal.cache.wan.AbstractGatewaySenderEventProcessor.processQueue(AbstractGatewaySenderEventProcessor.java:613)
    	at com.gemstone.gemfire.internal.cache.wan.serial.SerialGatewaySenderEventProcessor.run(SerialGatewaySenderEventProcessor.java:227)

com.gemstone.gemfire.internal.cache.wan.misc.WANSSLDUnitTest > testSenderNoSSLReceiverSSL
FAILED
    java.lang.AssertionError
        at org.junit.Assert.fail(Assert.java:86)
        at org.junit.Assert.assertTrue(Assert.java:41)
        at org.junit.Assert.assertTrue(Assert.java:52)
        at com.gemstone.gemfire.internal.cache.wan.misc.WANSSLDUnitTest.testSenderNoSSLReceiverSSL(WANSSLDUnitTest.java:104)

com.gemstone.gemfire.internal.cache.wan.misc.NewWanAuthenticationDUnitTest > testWanAuthInvalidCredentials
FAILED
    java.lang.AssertionError: Authentication Failed: While starting the sender, an exception
should have been thrown
        at org.junit.Assert.fail(Assert.java:88)
        at com.gemstone.gemfire.internal.cache.wan.misc.NewWanAuthenticationDUnitTest.testWanAuthInvalidCredentials(NewWanAuthenticationDUnitTest.java:177)

com.gemstone.gemfire.internal.cache.wan.misc.NewWanAuthenticationDUnitTest > testWanAuthValidCredentialsWithServer
FAILED
    com.gemstone.gemfire.test.dunit.RMIException: While invoking com.gemstone.gemfire.internal.cache.wan.misc.NewWanAuthenticationDUnitTest$$Lambda$2283/644308093.run
in VM 2 running on Host asf902.gq1.ygridcore.net with 8 VMs
        at com.gemstone.gemfire.test.dunit.VM.invoke(VM.java:389)
        at com.gemstone.gemfire.test.dunit.VM.invoke(VM.java:355)
        at com.gemstone.gemfire.test.dunit.VM.invoke(VM.java:293)
        at com.gemstone.gemfire.internal.cache.wan.misc.NewWanAuthenticationDUnitTest.testWanAuthValidCredentialsWithServer(NewWanAuthenticationDUnitTest.java:305)

        Caused by:
        com.gemstone.gemfire.InternalGemFireError: verifyDifferentServerInGetCredentialCall:
Server should be different
            at com.gemstone.gemfire.internal.Assert.throwError(Assert.java:92)
            at com.gemstone.gemfire.internal.Assert.assertTrue(Assert.java:116)
            at com.gemstone.gemfire.internal.cache.wan.misc.NewWanAuthenticationDUnitTest.verifyDifferentServerInGetCredentialCall(NewWanAuthenticationDUnitTest.java:249)
            at com.gemstone.gemfire.internal.cache.wan.misc.NewWanAuthenticationDUnitTest.lambda$testWanAuthValidCredentialsWithServer$84651174$4(NewWanAuthenticationDUnitTest.java:305)

com.gemstone.gemfire.management.internal.pulse.TestRemoteClusterDUnitTest > testMBeanCallback
FAILED
    com.gemstone.gemfire.test.dunit.RMIException: While invoking com.gemstone.gemfire.management.internal.pulse.TestRemoteClusterDUnitTest$5.run
in VM 3 running on Host asf902.gq1.ygridcore.net with 8 VMs
        at com.gemstone.gemfire.test.dunit.VM.invoke(VM.java:389)
        at com.gemstone.gemfire.test.dunit.VM.invoke(VM.java:355)
        at com.gemstone.gemfire.test.dunit.VM.invoke(VM.java:293)
        at com.gemstone.gemfire.management.internal.pulse.TestRemoteClusterDUnitTest.checkSenderMBean(TestRemoteClusterDUnitTest.java:270)
        at com.gemstone.gemfire.management.internal.pulse.TestRemoteClusterDUnitTest.testMBeanCallback(TestRemoteClusterDUnitTest.java:107)

        Caused by:
        java.lang.AssertionError

com.gemstone.gemfire.management.WANManagementDUnitTest > testMBeanCallback FAILED
    com.gemstone.gemfire.test.dunit.RMIException: While invoking com.gemstone.gemfire.management.WANManagementDUnitTest$8.run
in VM 3 running on Host asf902.gq1.ygridcore.net with 8 VMs
        at com.gemstone.gemfire.test.dunit.VM.invoke(VM.java:389)
        at com.gemstone.gemfire.test.dunit.VM.invoke(VM.java:355)
        at com.gemstone.gemfire.test.dunit.VM.invoke(VM.java:293)
        at com.gemstone.gemfire.management.WANManagementDUnitTest.checkSenderMBean(WANManagementDUnitTest.java:453)
        at com.gemstone.gemfire.management.WANManagementDUnitTest.testMBeanCallback(WANManagementDUnitTest.java:106)

        Caused by:
        java.lang.AssertionError

com.gemstone.gemfire.management.WANManagementDUnitTest > testReceiverMBean FAILED
    com.gemstone.gemfire.test.dunit.RMIException: While invoking com.gemstone.gemfire.management.WANManagementDUnitTest$8.run
in VM 3 running on Host asf902.gq1.ygridcore.net with 8 VMs
        at com.gemstone.gemfire.test.dunit.VM.invoke(VM.java:389)
        at com.gemstone.gemfire.test.dunit.VM.invoke(VM.java:355)
        at com.gemstone.gemfire.test.dunit.VM.invoke(VM.java:293)
        at com.gemstone.gemfire.management.WANManagementDUnitTest.checkSenderMBean(WANManagementDUnitTest.java:453)
        at com.gemstone.gemfire.management.WANManagementDUnitTest.testReceiverMBean(WANManagementDUnitTest.java:156)

        Caused by:
        java.lang.AssertionError

515 tests completed, 9 failed, 25 skipped
:geode-wan:distributedTest FAILED
:geode-wan:flakyTest

com.gemstone.gemfire.internal.cache.wan.misc.WANSSLDUnitTest > testSenderSSLReceiverSSL
FAILED
    java.lang.AssertionError: An exception occurred during asynchronous invocation.

        Caused by:
        java.lang.UnsupportedOperationException: The method shutdownInput() is not supported
in SSLSocket

17 tests completed, 1 failed
:geode-wan:flakyTest FAILED
:geode-wan:integrationTest
:geode-web:assemble
:geode-web:compileTestJavaNote: <https://builds.apache.org/job/Geode-nightly/ws/geode-web/src/test/java/com/gemstone/gemfire/management/internal/cli/commands/DataCommandsOverHttpDistributedTest.java>
uses or overrides a deprecated API.
Note: Recompile with -Xlint:deprecation for details.
Note: Some input files use unchecked or unsafe operations.
Note: Recompile with -Xlint:unchecked for details.

:geode-web:processTestResources UP-TO-DATE
:geode-web:testClasses
:geode-web:checkMissedTests
:geode-web:test
:geode-web:check
:geode-web:build
:geode-web:distributedTest
:geode-web:flakyTest
:geode-web:integrationTest
:geode-web-api:assemble
:geode-web-api:compileTestJava UP-TO-DATE
:geode-web-api:processTestResources UP-TO-DATE
:geode-web-api:testClasses UP-TO-DATE
:geode-web-api:checkMissedTests UP-TO-DATE
:geode-web-api:test UP-TO-DATE
:geode-web-api:check
:geode-web-api:build
:geode-web-api:distributedTest UP-TO-DATE
:geode-web-api:flakyTest UP-TO-DATE
:geode-web-api:integrationTest UP-TO-DATE
:combineReports
All test reports at <https://builds.apache.org/job/Geode-nightly/ws/build/reports/combined>
:extensions/geode-modules:precheckin
:extensions/geode-modules-assembly:precheckin
:extensions/geode-modules-hibernate:precheckin
:extensions/geode-modules-session:precheckin
:extensions/geode-modules-session-internal:precheckin
:extensions/geode-modules-tomcat7:precheckin
:geode-assembly:precheckin
:geode-common:precheckin
:geode-cq:precheckin
:geode-json:precheckin
:geode-junit:precheckin
:geode-lucene:precheckin
:geode-pulse:precheckin
:geode-rebalancer:precheckin
:geode-web:precheckin
:geode-web-api:precheckin
:extensions/geode-modules:uploadArchives
:extensions/geode-modules-assembly:uploadArchives SKIPPED
:extensions/geode-modules-hibernate:uploadArchives
:extensions/geode-modules-session:uploadArchives
:extensions/geode-modules-session-internal:uploadArchives
:extensions/geode-modules-tomcat7:uploadArchives
:geode-assembly:uploadArchives SKIPPED
:geode-common:uploadArchives
:geode-core:uploadArchives
:geode-cq:uploadArchives
:geode-json:uploadArchives
:geode-junit:uploadArchives
:geode-lucene:uploadArchives
:geode-pulse:uploadArchives
:geode-rebalancer:uploadArchives
:geode-wan:uploadArchives
:geode-web:uploadArchives
:geode-web-api:uploadArchives

FAILURE: Build completed with 3 failures.

1: Task failed with an exception.
-----------
* What went wrong:
Execution failed for task ':geode-core:integrationTest'.
> There were failing tests. See the report at: file://<https://builds.apache.org/job/Geode-nightly/ws/geode-core/build/reports/integrationTest/index.html>

* Try:
Run with --stacktrace option to get the stack trace. Run with --info or --debug option to
get more log output.
==============================================================================

2: Task failed with an exception.
-----------
* What went wrong:
Execution failed for task ':geode-wan:distributedTest'.
> There were failing tests. See the report at: file://<https://builds.apache.org/job/Geode-nightly/ws/geode-wan/build/reports/distributedTest/index.html>

* Try:
Run with --stacktrace option to get the stack trace. Run with --info or --debug option to
get more log output.
==============================================================================

3: Task failed with an exception.
-----------
* What went wrong:
Execution failed for task ':geode-wan:flakyTest'.
> There were failing tests. See the report at: file://<https://builds.apache.org/job/Geode-nightly/ws/geode-wan/build/reports/flakyTest/index.html>

* Try:
Run with --stacktrace option to get the stack trace. Run with --info or --debug option to
get more log output.
==============================================================================

BUILD FAILED

Total time: 10 hrs 44 mins 26.266 secs
Build step 'Invoke Gradle script' changed build result to FAILURE
Build step 'Invoke Gradle script' marked build as failure
Archiving artifacts
Compressed 255.94 MB of artifacts by 37.7% relative to #514
Recording test results

Mime
View raw message