geode-dev mailing list archives

Site index · List index
Message view « Date » · « Thread »
Top « Date » · « Thread »
From Apache Jenkins Server <jenk...@builds.apache.org>
Subject Build failed in Jenkins: Geode-nightly #337
Date Wed, 06 Jan 2016 11:11:05 GMT
See <https://builds.apache.org/job/Geode-nightly/337/changes>

Changes:

[sbawaskar] GEODE-719: Add error logs while cache.xml processing

[jdeppe] GEODE-718 GEODE-725: Ensure that test resources are cleaned up from

[bschuchardt] GEODE-430 CI failure

------------------------------------------
[...truncated 260 lines...]
:gemfire-web-api:processResources UP-TO-DATE
:gemfire-web-api:classes
:gemfire-web-api:jar
:gemfire-web-api:war
:gemfire-assembly:distTar
:gemfire-assembly:distZip
:gemfire-assembly:jar SKIPPED
:gemfire-assembly:srcDistTar
:gemfire-assembly:srcDistZip
:gemfire-assembly:assemble
:rat
:gemfire-core:compileTestJava<https://builds.apache.org/job/Geode-nightly/ws/gemfire-core/src/test/java/com/gemstone/gemfire/cache30/MemLRUEvictionControllerDUnitTest.java>:22:
warning: Unsafe is internal proprietary API and may be removed in a future release
import sun.misc.Unsafe;
               ^
<https://builds.apache.org/job/Geode-nightly/ws/gemfire-core/src/test/java/com/gemstone/gemfire/cache30/MemLRUEvictionControllerDUnitTest.java>:22:
warning: Unsafe is internal proprietary API and may be removed in a future release
import sun.misc.Unsafe;
               ^
<https://builds.apache.org/job/Geode-nightly/ws/gemfire-core/src/test/java/com/gemstone/gemfire/cache30/MemLRUEvictionControllerDUnitTest.java>:22:
warning: Unsafe is internal proprietary API and may be removed in a future release
import sun.misc.Unsafe;
               ^
Note: Some input files use or override a deprecated API.
Note: Recompile with -Xlint:deprecation for details.
Note: Some input files use unchecked or unsafe operations.
Note: Recompile with -Xlint:unchecked for details.
3 warnings

:gemfire-core:processTestResources
:gemfire-core:testClasses
:gemfire-core:jarTest
:gemfire-assembly:compileTestJavaNote: <https://builds.apache.org/job/Geode-nightly/ws/gemfire-assembly/src/test/java/com/gemstone/gemfire/management/internal/configuration/SharedConfigurationEndToEndDUnitTest.java>
uses or overrides a deprecated API.
Note: Recompile with -Xlint:deprecation for details.

:gemfire-assembly:processTestResources UP-TO-DATE
:gemfire-assembly:testClasses
:gemfire-assembly:checkMissedTests
:gemfire-assembly:installDist
:gemfire-assembly:test
Build file '<https://builds.apache.org/job/Geode-nightly/ws/build.gradle'>: line 89
AvailablePortFinder has been deprecated and is scheduled to be removed in Gradle 3.0
:gemfire-assembly:check
:gemfire-assembly:build
:gemfire-assembly:distributedTest
:gemfire-assembly:integrationTest
:gemfire-common:assemble
:gemfire-common:compileTestJava
:gemfire-common:processTestResources UP-TO-DATE
:gemfire-common:testClasses
:gemfire-common:checkMissedTests
:gemfire-common:test
:gemfire-common:check
:gemfire-common:build
:gemfire-common:distributedTest UP-TO-DATE
:gemfire-common:integrationTest
:gemfire-core:assemble
:gemfire-core:checkMissedTests
:gemfire-core:test
:gemfire-core:check
:gemfire-core:build
:gemfire-core:distributedTest

com.gemstone.gemfire.internal.compression.CompressionCacheConfigDUnitTest > testCreateCacheWithBadCompressor
FAILED
    java.lang.AssertionError: Suspicious strings were written to the log during this run.
    Fix the strings or use DistributedTestCase.addExpectedException to ignore.
    -----------------------------------------------------------------------
    Found suspect string in log4j at line 449

    [error 2016/01/06 05:00:24.953 UTC <RMI TCP Connection(8)-67.195.81.146> tid=0x7eb]
While reading Cache XML file:/tmp/cache7531638683730639078xml. Unable to load class BAD_COMPRESSOR

6951 tests completed, 1 failed
:gemfire-core:distributedTest FAILED
:gemfire-core:integrationTest
:gemfire-joptsimple:assemble
:gemfire-joptsimple:compileTestJava UP-TO-DATE
:gemfire-joptsimple:processTestResources UP-TO-DATE
:gemfire-joptsimple:testClasses UP-TO-DATE
:gemfire-joptsimple:checkMissedTests UP-TO-DATE
:gemfire-joptsimple:test UP-TO-DATE
:gemfire-joptsimple:check
:gemfire-joptsimple:build
:gemfire-joptsimple:distributedTest UP-TO-DATE
:gemfire-joptsimple:integrationTest UP-TO-DATE
:gemfire-json:assemble
:gemfire-json:compileTestJava UP-TO-DATE
:gemfire-json:processTestResources UP-TO-DATE
:gemfire-json:testClasses UP-TO-DATE
:gemfire-json:checkMissedTests UP-TO-DATE
:gemfire-json:test UP-TO-DATE
:gemfire-json:check
:gemfire-json:build
:gemfire-json:distributedTest UP-TO-DATE
:gemfire-json:integrationTest UP-TO-DATE
:gemfire-junit:jar
:gemfire-junit:assemble
:gemfire-junit:checkMissedTests
:gemfire-junit:test
:gemfire-junit:check
:gemfire-junit:build
:gemfire-junit:distributedTest UP-TO-DATE
:gemfire-junit:integrationTest
:gemfire-lucene:assemble
:gemfire-lucene:compileTestJavaNote: <https://builds.apache.org/job/Geode-nightly/ws/gemfire-lucene/src/test/java/com/gemstone/gemfire/cache/lucene/internal/distributed/LuceneFunctionJUnitTest.java>
uses or overrides a deprecated API.
Note: Recompile with -Xlint:deprecation for details.
Note: Some input files use unchecked or unsafe operations.
Note: Recompile with -Xlint:unchecked for details.

:gemfire-lucene:processTestResources
:gemfire-lucene:testClasses
:gemfire-lucene:checkMissedTests
:gemfire-lucene:test
:gemfire-lucene:check
:gemfire-lucene:build
:gemfire-lucene:distributedTest
:gemfire-lucene:integrationTest
:gemfire-rebalancer:compileJava
:gemfire-rebalancer:processResources UP-TO-DATE
:gemfire-rebalancer:classes
:gemfire-rebalancer:jar
:gemfire-rebalancer:assemble
:gemfire-rebalancer:compileTestJava
:gemfire-rebalancer:processTestResources UP-TO-DATE
:gemfire-rebalancer:testClasses
:gemfire-rebalancer:checkMissedTests
:gemfire-rebalancer:test
:gemfire-rebalancer:check
:gemfire-rebalancer:build
:gemfire-rebalancer:distributedTest UP-TO-DATE
:gemfire-rebalancer:integrationTest
:gemfire-web:assemble
:gemfire-web:compileTestJavaNote: <https://builds.apache.org/job/Geode-nightly/ws/gemfire-web/src/test/java/com/gemstone/gemfire/management/internal/web/AbstractWebTestCase.java>
uses unchecked or unsafe operations.
Note: Recompile with -Xlint:unchecked for details.

:gemfire-web:processTestResources UP-TO-DATE
:gemfire-web:testClasses
:gemfire-web:checkMissedTests
:gemfire-web:test
:gemfire-web:check
:gemfire-web:build
:gemfire-web:distributedTest UP-TO-DATE
:gemfire-web:integrationTest
:gemfire-web-api:assemble
:gemfire-web-api:compileTestJava UP-TO-DATE
:gemfire-web-api:processTestResources UP-TO-DATE
:gemfire-web-api:testClasses UP-TO-DATE
:gemfire-web-api:checkMissedTests UP-TO-DATE
:gemfire-web-api:test UP-TO-DATE
:gemfire-web-api:check
:gemfire-web-api:build
:gemfire-web-api:distributedTest UP-TO-DATE
:gemfire-web-api:integrationTest UP-TO-DATE
:combineReports
All test reports at <https://builds.apache.org/job/Geode-nightly/ws/build/reports/combined>
:gemfire-assembly:precheckin
:gemfire-common:precheckin
:gemfire-joptsimple:precheckin
:gemfire-json:precheckin
:gemfire-junit:precheckin
:gemfire-lucene:precheckin
:gemfire-rebalancer:precheckin
:gemfire-web:precheckin
:gemfire-web-api:precheckin
:gemfire-assembly:generatePomFileForCommonJarPublication
:gemfire-assembly:publishCommonJarPublicationToApache.snapshots.httpsRepository
Upload https://repository.apache.org/content/repositories/snapshots/org/apache/geode/gemfire-common/1.0.0-incubating-SNAPSHOT/gemfire-common-1.0.0-incubating-20160106.110859-59.jar
Upload https://repository.apache.org/content/repositories/snapshots/org/apache/geode/gemfire-common/1.0.0-incubating-SNAPSHOT/gemfire-common-1.0.0-incubating-20160106.110859-59.jar.sha1
Upload https://repository.apache.org/content/repositories/snapshots/org/apache/geode/gemfire-common/1.0.0-incubating-SNAPSHOT/gemfire-common-1.0.0-incubating-20160106.110859-59.jar.md5
Upload https://repository.apache.org/content/repositories/snapshots/org/apache/geode/gemfire-common/1.0.0-incubating-SNAPSHOT/gemfire-common-1.0.0-incubating-20160106.110859-59.pom
Upload https://repository.apache.org/content/repositories/snapshots/org/apache/geode/gemfire-common/1.0.0-incubating-SNAPSHOT/gemfire-common-1.0.0-incubating-20160106.110859-59.pom.sha1
Upload https://repository.apache.org/content/repositories/snapshots/org/apache/geode/gemfire-common/1.0.0-incubating-SNAPSHOT/gemfire-common-1.0.0-incubating-20160106.110859-59.pom.md5
Upload https://repository.apache.org/content/repositories/snapshots/org/apache/geode/gemfire-common/1.0.0-incubating-SNAPSHOT/maven-metadata.xml
Upload https://repository.apache.org/content/repositories/snapshots/org/apache/geode/gemfire-common/1.0.0-incubating-SNAPSHOT/maven-metadata.xml.sha1
Upload https://repository.apache.org/content/repositories/snapshots/org/apache/geode/gemfire-common/1.0.0-incubating-SNAPSHOT/maven-metadata.xml.md5
Upload https://repository.apache.org/content/repositories/snapshots/org/apache/geode/gemfire-common/maven-metadata.xml
Upload https://repository.apache.org/content/repositories/snapshots/org/apache/geode/gemfire-common/maven-metadata.xml.sha1
Upload https://repository.apache.org/content/repositories/snapshots/org/apache/geode/gemfire-common/maven-metadata.xml.md5
:gemfire-assembly:generatePomFileForCoreJarPublication
:gemfire-assembly:publishCoreJarPublicationToApache.snapshots.httpsRepository
Upload https://repository.apache.org/content/repositories/snapshots/org/apache/geode/gemfire-core/1.0.0-incubating-SNAPSHOT/gemfire-core-1.0.0-incubating-20160106.110901-181.jar
Upload https://repository.apache.org/content/repositories/snapshots/org/apache/geode/gemfire-core/1.0.0-incubating-SNAPSHOT/gemfire-core-1.0.0-incubating-20160106.110901-181.jar.sha1
Upload https://repository.apache.org/content/repositories/snapshots/org/apache/geode/gemfire-core/1.0.0-incubating-SNAPSHOT/gemfire-core-1.0.0-incubating-20160106.110901-181.jar.md5
Upload https://repository.apache.org/content/repositories/snapshots/org/apache/geode/gemfire-core/1.0.0-incubating-SNAPSHOT/gemfire-core-1.0.0-incubating-20160106.110901-181.pom
Upload https://repository.apache.org/content/repositories/snapshots/org/apache/geode/gemfire-core/1.0.0-incubating-SNAPSHOT/gemfire-core-1.0.0-incubating-20160106.110901-181.pom.sha1
Upload https://repository.apache.org/content/repositories/snapshots/org/apache/geode/gemfire-core/1.0.0-incubating-SNAPSHOT/gemfire-core-1.0.0-incubating-20160106.110901-181.pom.md5
Upload https://repository.apache.org/content/repositories/snapshots/org/apache/geode/gemfire-core/1.0.0-incubating-SNAPSHOT/maven-metadata.xml
Upload https://repository.apache.org/content/repositories/snapshots/org/apache/geode/gemfire-core/1.0.0-incubating-SNAPSHOT/maven-metadata.xml.sha1
Upload https://repository.apache.org/content/repositories/snapshots/org/apache/geode/gemfire-core/1.0.0-incubating-SNAPSHOT/maven-metadata.xml.md5
Upload https://repository.apache.org/content/repositories/snapshots/org/apache/geode/gemfire-core/maven-metadata.xml
Upload https://repository.apache.org/content/repositories/snapshots/org/apache/geode/gemfire-core/maven-metadata.xml.sha1
Upload https://repository.apache.org/content/repositories/snapshots/org/apache/geode/gemfire-core/maven-metadata.xml.md5
:gemfire-assembly:generatePomFileForJoptsimpleJarPublication
:gemfire-assembly:publishJoptsimpleJarPublicationToApache.snapshots.httpsRepository
Upload https://repository.apache.org/content/repositories/snapshots/org/apache/geode/gemfire-joptsimple/1.0.0-incubating-SNAPSHOT/gemfire-joptsimple-1.0.0-incubating-20160106.110905-180.jar
Upload https://repository.apache.org/content/repositories/snapshots/org/apache/geode/gemfire-joptsimple/1.0.0-incubating-SNAPSHOT/gemfire-joptsimple-1.0.0-incubating-20160106.110905-180.jar.sha1
Upload https://repository.apache.org/content/repositories/snapshots/org/apache/geode/gemfire-joptsimple/1.0.0-incubating-SNAPSHOT/gemfire-joptsimple-1.0.0-incubating-20160106.110905-180.jar.md5
Upload https://repository.apache.org/content/repositories/snapshots/org/apache/geode/gemfire-joptsimple/1.0.0-incubating-SNAPSHOT/gemfire-joptsimple-1.0.0-incubating-20160106.110905-180.pom
Upload https://repository.apache.org/content/repositories/snapshots/org/apache/geode/gemfire-joptsimple/1.0.0-incubating-SNAPSHOT/gemfire-joptsimple-1.0.0-incubating-20160106.110905-180.pom.sha1
Upload https://repository.apache.org/content/repositories/snapshots/org/apache/geode/gemfire-joptsimple/1.0.0-incubating-SNAPSHOT/gemfire-joptsimple-1.0.0-incubating-20160106.110905-180.pom.md5
Upload https://repository.apache.org/content/repositories/snapshots/org/apache/geode/gemfire-joptsimple/1.0.0-incubating-SNAPSHOT/maven-metadata.xml
Upload https://repository.apache.org/content/repositories/snapshots/org/apache/geode/gemfire-joptsimple/1.0.0-incubating-SNAPSHOT/maven-metadata.xml.sha1
Upload https://repository.apache.org/content/repositories/snapshots/org/apache/geode/gemfire-joptsimple/1.0.0-incubating-SNAPSHOT/maven-metadata.xml.md5
Upload https://repository.apache.org/content/repositories/snapshots/org/apache/geode/gemfire-joptsimple/maven-metadata.xml
Upload https://repository.apache.org/content/repositories/snapshots/org/apache/geode/gemfire-joptsimple/maven-metadata.xml.sha1
Upload https://repository.apache.org/content/repositories/snapshots/org/apache/geode/gemfire-joptsimple/maven-metadata.xml.md5
:gemfire-assembly:generatePomFileForJsonJarPublication
:gemfire-assembly:publishJsonJarPublicationToApache.snapshots.httpsRepository
Upload https://repository.apache.org/content/repositories/snapshots/org/apache/geode/gemfire-json/1.0.0-incubating-SNAPSHOT/gemfire-json-1.0.0-incubating-20160106.110906-180.jar
Upload https://repository.apache.org/content/repositories/snapshots/org/apache/geode/gemfire-json/1.0.0-incubating-SNAPSHOT/gemfire-json-1.0.0-incubating-20160106.110906-180.jar.sha1
Upload https://repository.apache.org/content/repositories/snapshots/org/apache/geode/gemfire-json/1.0.0-incubating-SNAPSHOT/gemfire-json-1.0.0-incubating-20160106.110906-180.jar.md5
Upload https://repository.apache.org/content/repositories/snapshots/org/apache/geode/gemfire-json/1.0.0-incubating-SNAPSHOT/gemfire-json-1.0.0-incubating-20160106.110906-180.pom
Upload https://repository.apache.org/content/repositories/snapshots/org/apache/geode/gemfire-json/1.0.0-incubating-SNAPSHOT/gemfire-json-1.0.0-incubating-20160106.110906-180.pom.sha1
Upload https://repository.apache.org/content/repositories/snapshots/org/apache/geode/gemfire-json/1.0.0-incubating-SNAPSHOT/gemfire-json-1.0.0-incubating-20160106.110906-180.pom.md5
Upload https://repository.apache.org/content/repositories/snapshots/org/apache/geode/gemfire-json/1.0.0-incubating-SNAPSHOT/maven-metadata.xml
Upload https://repository.apache.org/content/repositories/snapshots/org/apache/geode/gemfire-json/1.0.0-incubating-SNAPSHOT/maven-metadata.xml.sha1
Upload https://repository.apache.org/content/repositories/snapshots/org/apache/geode/gemfire-json/1.0.0-incubating-SNAPSHOT/maven-metadata.xml.md5
Upload https://repository.apache.org/content/repositories/snapshots/org/apache/geode/gemfire-json/maven-metadata.xml
Upload https://repository.apache.org/content/repositories/snapshots/org/apache/geode/gemfire-json/maven-metadata.xml.sha1
Upload https://repository.apache.org/content/repositories/snapshots/org/apache/geode/gemfire-json/maven-metadata.xml.md5
:gemfire-assembly:generatePomFileForLuceneJarPublication
:gemfire-assembly:publishLuceneJarPublicationToApache.snapshots.httpsRepository
Upload https://repository.apache.org/content/repositories/snapshots/org/apache/geode/gemfire-lucene/1.0.0-incubating-SNAPSHOT/gemfire-lucene-1.0.0-incubating-20160106.110908-44.jar
Upload https://repository.apache.org/content/repositories/snapshots/org/apache/geode/gemfire-lucene/1.0.0-incubating-SNAPSHOT/gemfire-lucene-1.0.0-incubating-20160106.110908-44.jar.sha1
Upload https://repository.apache.org/content/repositories/snapshots/org/apache/geode/gemfire-lucene/1.0.0-incubating-SNAPSHOT/gemfire-lucene-1.0.0-incubating-20160106.110908-44.jar.md5
Upload https://repository.apache.org/content/repositories/snapshots/org/apache/geode/gemfire-lucene/1.0.0-incubating-SNAPSHOT/gemfire-lucene-1.0.0-incubating-20160106.110908-44.pom
Upload https://repository.apache.org/content/repositories/snapshots/org/apache/geode/gemfire-lucene/1.0.0-incubating-SNAPSHOT/gemfire-lucene-1.0.0-incubating-20160106.110908-44.pom.sha1
Upload https://repository.apache.org/content/repositories/snapshots/org/apache/geode/gemfire-lucene/1.0.0-incubating-SNAPSHOT/gemfire-lucene-1.0.0-incubating-20160106.110908-44.pom.md5
Upload https://repository.apache.org/content/repositories/snapshots/org/apache/geode/gemfire-lucene/1.0.0-incubating-SNAPSHOT/maven-metadata.xml
Upload https://repository.apache.org/content/repositories/snapshots/org/apache/geode/gemfire-lucene/1.0.0-incubating-SNAPSHOT/maven-metadata.xml.sha1
Upload https://repository.apache.org/content/repositories/snapshots/org/apache/geode/gemfire-lucene/1.0.0-incubating-SNAPSHOT/maven-metadata.xml.md5
Upload https://repository.apache.org/content/repositories/snapshots/org/apache/geode/gemfire-lucene/maven-metadata.xml
Upload https://repository.apache.org/content/repositories/snapshots/org/apache/geode/gemfire-lucene/maven-metadata.xml.sha1
Upload https://repository.apache.org/content/repositories/snapshots/org/apache/geode/gemfire-lucene/maven-metadata.xml.md5
:gemfire-assembly:publish

FAILURE: Build failed with an exception.

* What went wrong:
Execution failed for task ':gemfire-core:distributedTest'.
> There were failing tests. See the report at: file://<https://builds.apache.org/job/Geode-nightly/ws/gemfire-core/build/reports/distributedTest/index.html>

* Try:
Run with --stacktrace option to get the stack trace. Run with --info or --debug option to
get more log output.

BUILD FAILED

Total time: 7 hrs 26 mins 51.538 secs
Build step 'Invoke Gradle script' changed build result to FAILURE
Build step 'Invoke Gradle script' marked build as failure
Archiving artifacts
Compressed 504.78 MB of artifacts by 47.8% relative to #336
Recording test results

Mime
View raw message