geode-commits mailing list archives

Site index · List index
Message view « Date » · « Thread »
Top « Date » · « Thread »
From bschucha...@apache.org
Subject [geode] 01/01: testing
Date Fri, 19 Jul 2019 18:57:36 GMT
This is an automated email from the ASF dual-hosted git repository.

bschuchardt pushed a commit to branch feature/bschuchardt_wip
in repository https://gitbox.apache.org/repos/asf/geode.git

commit e780bd0b7bf99372642eede39138af89cc48f9e4
Author: Bruce Schuchardt <bschuchardt@pivotal.io>
AuthorDate: Fri Jul 19 11:55:56 2019 -0700

    testing
---
 temp.txt | 1243 ++++++++++++++++++++++++++++++++++++++++++++++++++++++++++++++
 1 file changed, 1243 insertions(+)

diff --git a/temp.txt b/temp.txt
new file mode 100644
index 0000000..b7b43c2
--- /dev/null
+++ b/temp.txt
@@ -0,0 +1,1243 @@
+To honour the JVM settings for this build a new JVM will be forked. Please consider using the daemon: https://docs.gradle.org/5.4/userguide/gradle_daemon.html.
+Daemon will be stopped at the end of the build stopping after processing
+> Task :buildSrc:compileJava NO-SOURCE
+> Task :buildSrc:compileGroovy UP-TO-DATE
+> Task :buildSrc:processResources UP-TO-DATE
+> Task :buildSrc:classes UP-TO-DATE
+> Task :buildSrc:jar UP-TO-DATE
+> Task :buildSrc:assemble UP-TO-DATE
+> Task :buildSrc:compileTestJava UP-TO-DATE
+> Task :buildSrc:compileTestGroovy NO-SOURCE
+> Task :buildSrc:processTestResources NO-SOURCE
+> Task :buildSrc:testClasses UP-TO-DATE
+> Task :buildSrc:test UP-TO-DATE
+> Task :buildSrc:check UP-TO-DATE
+> Task :buildSrc:build UP-TO-DATE
+> Task :geode-assembly:compileJava NO-SOURCE
+> Task :compileJava NO-SOURCE
+> Task :processResources NO-SOURCE
+> Task :geode-assembly:processResources NO-SOURCE
+> Task :geode-assembly:classes UP-TO-DATE
+> Task :extensions:compileJava NO-SOURCE
+> Task :extensions:processResources NO-SOURCE
+> Task :extensions:classes UP-TO-DATE
+> Task :geode-core:generateGrammarSource UP-TO-DATE
+> Task :geode-protobuf-messages:extractIncludeProto UP-TO-DATE
+> Task :extensions:compileAcceptanceTestJava NO-SOURCE
+> Task :extensions:compileDistributedTestJava NO-SOURCE
+> Task :geode-protobuf-messages:extractProto UP-TO-DATE
+> Task :extensions:compileIntegrationTestJava NO-SOURCE
+> Task :extensions:compilePerformanceTestJava NO-SOURCE
+> Task :extensions:compileTestJava NO-SOURCE
+> Task :geode-common:compileJava UP-TO-DATE
+> Task :geode-assembly:compilePerformanceTestJava NO-SOURCE
+> Task :extensions:compileUiTestJava NO-SOURCE
+> Task :extensions:compileUpgradeTestJava NO-SOURCE
+> Task :geode-connectors:processResources UP-TO-DATE
+> Task :writeBuildInfo UP-TO-DATE
+> Task :geode-common:processResources NO-SOURCE
+> Task :geode-protobuf-messages:generateProto UP-TO-DATE
+> Task :extensions:session-testing-war:compileJava UP-TO-DATE
+> Task :geode-concurrency-test:compileJava UP-TO-DATE
+> Task :geode-common:classes UP-TO-DATE
+> Task :geode-common:compileAcceptanceTestJava NO-SOURCE
+> Task :geode-cq:processResources UP-TO-DATE
+> Task :geode-concurrency-test:processResources NO-SOURCE
+> Task :geode-concurrency-test:classes UP-TO-DATE
+> Task :geode-experimental-driver:processResources NO-SOURCE
+> Task :geode-common:compileDistributedTestJava NO-SOURCE
+> Task :geode-concurrency-test:compileAcceptanceTestJava NO-SOURCE
+> Task :geode-concurrency-test:compileDistributedTestJava NO-SOURCE
+> Task :geode-junit:processResources UP-TO-DATE
+> Task :geode-lucene:processResources UP-TO-DATE
+> Task :geode-core:processResources UP-TO-DATE
+> Task :geode-concurrency-test:compileIntegrationTestJava UP-TO-DATE
+> Task :geode-common:compileIntegrationTestJava NO-SOURCE
+> Task :geode-common:compilePerformanceTestJava NO-SOURCE
+> Task :geode-core:createVersionPropertiesFile UP-TO-DATE
+> Task :geode-concurrency-test:compilePerformanceTestJava NO-SOURCE
+> Task :geode-concurrency-test:compileTestJava NO-SOURCE
+> Task :geode-core:generateAcceptanceTestGrammarSource NO-SOURCE
+> Task :geode-core:generateDistributedTestGrammarSource NO-SOURCE
+> Task :geode-core:generateIntegrationTestGrammarSource NO-SOURCE
+> Task :geode-pulse:compileJava UP-TO-DATE
+> Task :geode-memcached:processResources UP-TO-DATE
+> Task :geode-core:generatePerformanceTestGrammarSource NO-SOURCE
+> Task :geode-protobuf-messages:compileJava UP-TO-DATE
+> Task :geode-old-versions:compileJava NO-SOURCE
+> Task :geode-old-versions:1.0.0-incubating:downloadAndUnzipFile SKIPPED
+> Task :geode-old-client-support:processResources UP-TO-DATE
+> Task :geode-old-versions:1.1.0:downloadAndUnzipFile SKIPPED
+> Task :geode-old-versions:1.1.1:downloadAndUnzipFile SKIPPED
+> Task :geode-concurrency-test:compileUiTestJava NO-SOURCE
+> Task :geode-core:generateTestGrammarSource NO-SOURCE
+> Task :geode-dunit:processResources UP-TO-DATE
+> Task :geode-concurrency-test:compileUpgradeTestJava NO-SOURCE
+> Task :geode-common:compileTestJava UP-TO-DATE
+> Task :geode-core:generateUiTestGrammarSource NO-SOURCE
+> Task :geode-common:compileUiTestJava NO-SOURCE
+> Task :geode-common:compileUpgradeTestJava NO-SOURCE
+> Task :geode-management:compileJava UP-TO-DATE
+> Task :geode-management:processResources NO-SOURCE
+> Task :geode-management:classes UP-TO-DATE
+> Task :geode-management:compileAcceptanceTestJava NO-SOURCE
+> Task :geode-management:compileDistributedTestJava NO-SOURCE
+> Task :geode-management:compileIntegrationTestJava NO-SOURCE
+> Task :geode-management:compilePerformanceTestJava NO-SOURCE
+> Task :geode-management:compileUiTestJava NO-SOURCE
+> Task :geode-management:compileUpgradeTestJava NO-SOURCE
+> Task :geode-experimental-driver:compileJava UP-TO-DATE
+> Task :geode-experimental-driver:classes UP-TO-DATE
+> Task :geode-experimental-driver:compileAcceptanceTestJava NO-SOURCE
+> Task :geode-experimental-driver:compileDistributedTestJava NO-SOURCE
+> Task :geode-experimental-driver:compilePerformanceTestJava NO-SOURCE
+> Task :geode-experimental-driver:compileUiTestJava NO-SOURCE
+> Task :geode-experimental-driver:compileUpgradeTestJava NO-SOURCE
+> Task :geode-old-versions:1.2.0:downloadAndUnzipFile UP-TO-DATE
+> Task :geode-old-versions:1.3.0:downloadAndUnzipFile UP-TO-DATE
+> Task :geode-old-versions:1.4.0:downloadAndUnzipFile UP-TO-DATE
+> Task :geode-old-versions:processResources NO-SOURCE
+> Task :geode-protobuf-messages:processResources UP-TO-DATE
+> Task :geode-protobuf-messages:classes UP-TO-DATE
+> Task :geode-old-versions:1.7.0:downloadAndUnzipFile UP-TO-DATE
+> Task :geode-protobuf-messages:extractAcceptanceTestProto UP-TO-DATE
+> Task :geode-pulse:copyGemFireVersionFile UP-TO-DATE
+> Task :geode-protobuf-messages:extractIncludeAcceptanceTestProto UP-TO-DATE
+> Task :geode-protobuf-messages:generateAcceptanceTestProto NO-SOURCE
+> Task :geode-protobuf-messages:compileAcceptanceTestJava NO-SOURCE
+> Task :geode-protobuf-messages:extractDistributedTestProto UP-TO-DATE
+> Task :geode-protobuf-messages:extractIncludeDistributedTestProto UP-TO-DATE
+> Task :geode-protobuf-messages:generateDistributedTestProto NO-SOURCE
+> Task :geode-protobuf-messages:compileDistributedTestJava NO-SOURCE
+> Task :geode-protobuf-messages:extractIncludeIntegrationTestProto UP-TO-DATE
+> Task :geode-protobuf-messages:extractIntegrationTestProto UP-TO-DATE
+> Task :geode-protobuf-messages:generateIntegrationTestProto NO-SOURCE
+> Task :geode-protobuf-messages:compileIntegrationTestJava NO-SOURCE
+> Task :geode-protobuf-messages:extractIncludePerformanceTestProto UP-TO-DATE
+> Task :geode-old-versions:1.8.0:downloadAndUnzipFile UP-TO-DATE
+> Task :geode-rebalancer:processResources NO-SOURCE
+> Task :geode-redis:processResources UP-TO-DATE
+> Task :geode-wan:processResources UP-TO-DATE
+> Task :geode-web:processResources NO-SOURCE
+> Task :geode-core:generateUpgradeTestGrammarSource NO-SOURCE
+> Task :geode-old-versions:1.5.0:downloadAndUnzipFile UP-TO-DATE
+> Task :geode-web-management:processResources UP-TO-DATE
+> Task :geode-old-versions:1.9.0:downloadAndUnzipFile UP-TO-DATE
+> Task :geode-management:jar UP-TO-DATE
+> Task :geode-web-management:processCommonTestResources NO-SOURCE
+> Task :static-analysis:compileJava NO-SOURCE
+> Task :static-analysis:processResources NO-SOURCE
+> Task :static-analysis:classes UP-TO-DATE
+> Task :static-analysis:compileAcceptanceTestJava NO-SOURCE
+> Task :static-analysis:compileDistributedTestJava NO-SOURCE
+> Task :static-analysis:compileIntegrationTestJava NO-SOURCE
+> Task :static-analysis:compilePerformanceTestJava NO-SOURCE
+> Task :static-analysis:compileTestJava NO-SOURCE
+> Task :static-analysis:compileUiTestJava NO-SOURCE
+> Task :static-analysis:compileUpgradeTestJava NO-SOURCE
+> Task :boms:geode-client-bom:compileJava NO-SOURCE
+> Task :boms:geode-client-bom:processResources NO-SOURCE
+> Task :boms:geode-client-bom:classes UP-TO-DATE
+> Task :boms:geode-client-bom:compileAcceptanceTestJava NO-SOURCE
+> Task :boms:geode-client-bom:compileDistributedTestJava NO-SOURCE
+> Task :geode-protobuf:processResources UP-TO-DATE
+> Task :geode-pulse:processResources UP-TO-DATE
+> Task :geode-protobuf-messages:extractPerformanceTestProto UP-TO-DATE
+> Task :geode-web-api:processResources UP-TO-DATE
+> Task :geode-pulse:classes UP-TO-DATE
+> Task :geode-protobuf-messages:generatePerformanceTestProto NO-SOURCE
+> Task :extensions:geode-modules-assembly:compileJava NO-SOURCE
+> Task :geode-old-versions:1.6.0:downloadAndUnzipFile UP-TO-DATE
+> Task :geode-pulse:compileAcceptanceTestJava NO-SOURCE
+> Task :extensions:geode-modules-assembly:processResources NO-SOURCE
+> Task :extensions:geode-modules-assembly:classes UP-TO-DATE
+> Task :geode-protobuf-messages:compilePerformanceTestJava NO-SOURCE
+> Task :geode-pulse:compileDistributedTestJava NO-SOURCE
+> Task :extensions:geode-modules-assembly:compileAcceptanceTestJava NO-SOURCE
+> Task :geode-pulse:compilePerformanceTestJava NO-SOURCE
+> Task :extensions:geode-modules-assembly:compileDistributedTestJava NO-SOURCE
+> Task :geode-pulse:compileUpgradeTestJava NO-SOURCE
+> Task :extensions:geode-modules-assembly:compileIntegrationTestJava NO-SOURCE
+> Task :geode-protobuf-messages:extractIncludeTestProto UP-TO-DATE
+> Task :extensions:geode-modules-session:processResources NO-SOURCE
+> Task :geode-protobuf-messages:extractTestProto UP-TO-DATE
+> Task :extensions:geode-modules-session-internal:processResources NO-SOURCE
+> Task :geode-protobuf-messages:generateTestProto NO-SOURCE
+> Task :extensions:geode-modules-test:processResources NO-SOURCE
+> Task :extensions:geode-modules-tomcat7:processResources NO-SOURCE
+> Task :extensions:geode-modules-tomcat8:processResources NO-SOURCE
+> Task :extensions:geode-modules-tomcat9:processResources NO-SOURCE
+> Task :extensions:session-testing-war:processResources NO-SOURCE
+> Task :extensions:session-testing-war:classes UP-TO-DATE
+> Task :geode-old-versions:createGeodeClasspathsFile UP-TO-DATE
+> Task :geode-old-versions:classes UP-TO-DATE
+> Task :geode-old-versions:compileAcceptanceTestJava NO-SOURCE
+> Task :geode-old-versions:compileDistributedTestJava NO-SOURCE
+> Task :geode-old-versions:compileIntegrationTestJava NO-SOURCE
+> Task :geode-old-versions:compilePerformanceTestJava NO-SOURCE
+> Task :geode-old-versions:compileTestJava NO-SOURCE
+> Task :geode-old-versions:compileUiTestJava NO-SOURCE
+> Task :geode-old-versions:compileUpgradeTestJava NO-SOURCE
+> Task :geode-assembly:geode-assembly-test:processResources NO-SOURCE
+> Task :geode-lucene:geode-lucene-test:processResources NO-SOURCE
+> Task :geode-old-versions:1.0.0-incubating:compileJava NO-SOURCE
+> Task :geode-old-versions:1.0.0-incubating:processResources NO-SOURCE
+> Task :geode-old-versions:1.0.0-incubating:classes UP-TO-DATE
+> Task :geode-old-versions:1.0.0-incubating:compileAcceptanceTestJava NO-SOURCE
+> Task :boms:geode-client-bom:compileIntegrationTestJava NO-SOURCE
+> Task :geode-common:jar UP-TO-DATE
+> Task :extensions:geode-modules:processResources UP-TO-DATE
+> Task :geode-protobuf-messages:compileTestJava NO-SOURCE
+> Task :extensions:geode-modules-assembly:compilePerformanceTestJava NO-SOURCE
+> Task :extensions:session-testing-war:compileAcceptanceTestJava NO-SOURCE
+> Task :geode-old-versions:1.0.0-incubating:compileDistributedTestJava NO-SOURCE
+> Task :boms:geode-client-bom:compilePerformanceTestJava NO-SOURCE
+> Task :boms:geode-client-bom:compileTestJava NO-SOURCE
+> Task :extensions:geode-modules-assembly:compileTestJava NO-SOURCE
+> Task :extensions:session-testing-war:compileDistributedTestJava NO-SOURCE
+> Task :geode-old-versions:1.0.0-incubating:compileIntegrationTestJava NO-SOURCE
+> Task :geode-old-versions:1.1.0:compileJava NO-SOURCE
+> Task :geode-old-versions:1.1.0:processResources NO-SOURCE
+> Task :geode-old-versions:1.1.0:classes UP-TO-DATE
+> Task :extensions:geode-modules-assembly:compileUiTestJava NO-SOURCE
+> Task :geode-old-versions:1.0.0-incubating:compilePerformanceTestJava NO-SOURCE
+> Task :extensions:session-testing-war:compileIntegrationTestJava NO-SOURCE
+> Task :boms:geode-client-bom:compileUiTestJava NO-SOURCE
+> Task :geode-old-versions:1.1.1:compileJava NO-SOURCE
+> Task :geode-old-versions:1.1.0:compileAcceptanceTestJava NO-SOURCE
+> Task :geode-protobuf-messages:extractIncludeUiTestProto UP-TO-DATE
+> Task :boms:geode-client-bom:compileUpgradeTestJava NO-SOURCE
+> Task :geode-old-versions:1.1.1:processResources NO-SOURCE
+> Task :extensions:session-testing-war:compilePerformanceTestJava NO-SOURCE
+> Task :geode-old-versions:1.0.0-incubating:compileTestJava NO-SOURCE
+> Task :geode-old-versions:1.1.0:compileDistributedTestJava NO-SOURCE
+> Task :extensions:geode-modules-assembly:compileUpgradeTestJava NO-SOURCE
+> Task :geode-protobuf-messages:extractUiTestProto UP-TO-DATE
+> Task :geode-old-versions:1.2.0:compileJava NO-SOURCE
+> Task :geode-old-versions:1.1.1:classes UP-TO-DATE
+> Task :geode-old-versions:1.1.0:compileIntegrationTestJava NO-SOURCE
+> Task :geode-old-versions:1.0.0-incubating:compileUiTestJava NO-SOURCE
+> Task :geode-old-versions:1.2.0:processResources NO-SOURCE
+> Task :extensions:session-testing-war:compileTestJava NO-SOURCE
+> Task :geode-old-versions:1.3.0:compileJava NO-SOURCE
+> Task :geode-old-versions:1.1.1:compileAcceptanceTestJava NO-SOURCE
+> Task :geode-protobuf-messages:generateUiTestProto NO-SOURCE
+> Task :geode-old-versions:1.1.0:compilePerformanceTestJava NO-SOURCE
+> Task :geode-old-versions:1.0.0-incubating:compileUpgradeTestJava NO-SOURCE
+> Task :geode-old-versions:1.2.0:classes UP-TO-DATE
+> Task :geode-old-versions:1.3.0:processResources NO-SOURCE
+> Task :extensions:session-testing-war:compileUiTestJava NO-SOURCE
+> Task :geode-old-versions:1.1.0:compileTestJava NO-SOURCE
+> Task :geode-old-versions:1.4.0:compileJava NO-SOURCE
+> Task :geode-protobuf-messages:compileUiTestJava NO-SOURCE
+> Task :geode-old-versions:1.1.0:compileUiTestJava NO-SOURCE
+> Task :geode-old-versions:1.4.0:processResources NO-SOURCE
+> Task :geode-old-versions:1.1.1:compileDistributedTestJava NO-SOURCE
+> Task :geode-old-versions:1.1.0:compileUpgradeTestJava NO-SOURCE
+> Task :extensions:session-testing-war:compileUpgradeTestJava NO-SOURCE
+> Task :geode-old-versions:1.2.0:compileAcceptanceTestJava NO-SOURCE
+> Task :geode-old-versions:1.3.0:classes UP-TO-DATE
+> Task :geode-protobuf-messages:extractIncludeUpgradeTestProto UP-TO-DATE
+> Task :geode-protobuf-messages:extractUpgradeTestProto UP-TO-DATE
+> Task :geode-old-versions:1.3.0:compileAcceptanceTestJava NO-SOURCE
+> Task :geode-protobuf-messages:generateUpgradeTestProto NO-SOURCE
+> Task :geode-old-versions:1.2.0:compileDistributedTestJava NO-SOURCE
+> Task :geode-old-versions:1.5.0:compileJava NO-SOURCE
+> Task :geode-old-versions:1.4.0:classes UP-TO-DATE
+> Task :geode-old-versions:1.5.0:processResources NO-SOURCE
+> Task :geode-old-versions:1.1.1:compileIntegrationTestJava NO-SOURCE
+> Task :geode-old-versions:1.6.0:compileJava NO-SOURCE
+> Task :geode-old-versions:1.4.0:compileAcceptanceTestJava NO-SOURCE
+> Task :geode-old-versions:1.2.0:compileIntegrationTestJava NO-SOURCE
+> Task :geode-protobuf-messages:compileUpgradeTestJava NO-SOURCE
+> Task :geode-old-versions:1.3.0:compileDistributedTestJava NO-SOURCE
+> Task :geode-old-versions:1.4.0:compileDistributedTestJava NO-SOURCE
+> Task :geode-old-versions:1.5.0:classes UP-TO-DATE
+> Task :geode-old-versions:1.6.0:processResources NO-SOURCE
+> Task :geode-old-versions:1.1.1:compilePerformanceTestJava NO-SOURCE
+> Task :geode-old-versions:1.4.0:compileIntegrationTestJava NO-SOURCE
+> Task :geode-old-versions:1.5.0:compileAcceptanceTestJava NO-SOURCE
+> Task :geode-old-versions:1.3.0:compileIntegrationTestJava NO-SOURCE
+> Task :geode-old-versions:1.6.0:classes UP-TO-DATE
+> Task :geode-old-versions:1.2.0:compilePerformanceTestJava NO-SOURCE
+> Task :geode-old-versions:1.3.0:compilePerformanceTestJava NO-SOURCE
+> Task :geode-old-versions:1.4.0:compilePerformanceTestJava NO-SOURCE
+> Task :geode-old-versions:1.5.0:compileDistributedTestJava NO-SOURCE
+> Task :geode-old-versions:1.1.1:compileTestJava NO-SOURCE
+> Task :geode-old-versions:1.7.0:compileJava NO-SOURCE
+> Task :geode-old-versions:1.3.0:compileTestJava NO-SOURCE
+> Task :geode-old-versions:1.6.0:compileAcceptanceTestJava NO-SOURCE
+> Task :geode-old-versions:1.2.0:compileTestJava NO-SOURCE
+> Task :geode-old-versions:1.5.0:compileIntegrationTestJava NO-SOURCE
+> Task :geode-old-versions:1.4.0:compileTestJava NO-SOURCE
+> Task :geode-old-versions:1.1.1:compileUiTestJava NO-SOURCE
+> Task :geode-old-versions:1.7.0:processResources NO-SOURCE
+> Task :geode-old-versions:1.7.0:classes UP-TO-DATE
+> Task :geode-old-versions:1.1.1:compileUpgradeTestJava NO-SOURCE
+> Task :geode-old-versions:1.4.0:compileUiTestJava NO-SOURCE
+> Task :geode-old-versions:1.5.0:compilePerformanceTestJava NO-SOURCE
+> Task :geode-old-versions:1.2.0:compileUiTestJava NO-SOURCE
+> Task :geode-old-versions:1.3.0:compileUiTestJava NO-SOURCE
+> Task :geode-old-versions:1.6.0:compileDistributedTestJava NO-SOURCE
+> Task :geode-old-versions:1.7.0:compileAcceptanceTestJava NO-SOURCE
+> Task :geode-old-versions:1.4.0:compileUpgradeTestJava NO-SOURCE
+> Task :geode-old-versions:1.5.0:compileTestJava NO-SOURCE
+> Task :geode-old-versions:1.7.0:compileDistributedTestJava NO-SOURCE
+> Task :geode-old-versions:1.5.0:compileUiTestJava NO-SOURCE
+> Task :geode-old-versions:1.6.0:compileIntegrationTestJava NO-SOURCE
+> Task :geode-old-versions:1.2.0:compileUpgradeTestJava NO-SOURCE
+> Task :geode-old-versions:1.3.0:compileUpgradeTestJava NO-SOURCE
+> Task :geode-old-versions:1.8.0:compileJava NO-SOURCE
+> Task :geode-old-versions:1.7.0:compileIntegrationTestJava NO-SOURCE
+> Task :geode-old-versions:1.6.0:compilePerformanceTestJava NO-SOURCE
+> Task :geode-old-versions:1.5.0:compileUpgradeTestJava NO-SOURCE
+> Task :geode-old-versions:1.8.0:processResources NO-SOURCE
+> Task :geode-old-versions:1.8.0:classes UP-TO-DATE
+> Task :geode-old-versions:1.7.0:compilePerformanceTestJava NO-SOURCE
+> Task :geode-old-versions:1.6.0:compileTestJava NO-SOURCE
+> Task :geode-old-versions:1.9.0:compileJava NO-SOURCE
+> Task :geode-protobuf:geode-protobuf-test:processResources NO-SOURCE
+> Task :geode-old-versions:1.7.0:compileTestJava NO-SOURCE
+> Task :geode-old-versions:1.9.0:processResources NO-SOURCE
+> Task :geode-old-versions:1.9.0:classes UP-TO-DATE
+> Task :geode-old-versions:1.7.0:compileUiTestJava NO-SOURCE
+> Task :processTestResources NO-SOURCE
+> Task :geode-old-versions:1.6.0:compileUiTestJava NO-SOURCE
+> Task :geode-old-versions:1.7.0:compileUpgradeTestJava NO-SOURCE
+> Task :geode-old-versions:1.9.0:compileAcceptanceTestJava NO-SOURCE
+> Task :extensions:processTestResources NO-SOURCE
+> Task :extensions:testClasses UP-TO-DATE
+> Task :geode-old-versions:1.6.0:compileUpgradeTestJava NO-SOURCE
+> Task :geode-old-versions:1.9.0:compileDistributedTestJava NO-SOURCE
+> Task :geode-pulse:geode-pulse-test:processResources UP-TO-DATE
+> Task :geode-old-versions:1.9.0:compileIntegrationTestJava NO-SOURCE
+> Task :geode-old-versions:1.9.0:compilePerformanceTestJava NO-SOURCE
+> Task :geode-old-versions:1.9.0:compileTestJava NO-SOURCE
+> Task :extensions:test NO-SOURCE
+> Task :geode-old-versions:1.9.0:compileUiTestJava NO-SOURCE
+> Task :geode-old-versions:1.9.0:compileUpgradeTestJava NO-SOURCE
+> Task :geode-assembly:processTestResources UP-TO-DATE
+> Task :geode-old-versions:jar UP-TO-DATE
+> Task :geode-common:processTestResources UP-TO-DATE
+> Task :geode-concurrency-test:processTestResources UP-TO-DATE
+> Task :geode-common:testClasses UP-TO-DATE
+> Task :geode-concurrency-test:testClasses UP-TO-DATE
+> Task :geode-connectors:processTestResources UP-TO-DATE
+> Task :geode-concurrency-test:test NO-SOURCE
+> Task :geode-cq:processTestResources UP-TO-DATE
+> Task :geode-concurrency-test:jar UP-TO-DATE
+> Task :geode-dunit:processTestResources UP-TO-DATE
+> Task :geode-experimental-driver:processTestResources UP-TO-DATE
+> Task :geode-lucene:processTestResources UP-TO-DATE
+> Task :geode-junit:processTestResources UP-TO-DATE
+> Task :geode-management:processTestResources UP-TO-DATE
+> Task :geode-memcached:processTestResources UP-TO-DATE
+> Task :geode-old-versions:processTestResources NO-SOURCE
+> Task :geode-old-versions:testClasses UP-TO-DATE
+> Task :geode-old-client-support:processTestResources UP-TO-DATE
+> Task :geode-old-versions:test NO-SOURCE
+> Task :geode-protobuf:processTestResources UP-TO-DATE
+> Task :geode-rebalancer:processTestResources UP-TO-DATE
+> Task :geode-wan:processTestResources UP-TO-DATE
+> Task :geode-web:processTestResources UP-TO-DATE
+> Task :geode-web-api:processTestResources UP-TO-DATE
+> Task :geode-web-management:processTestResources UP-TO-DATE
+> Task :static-analysis:processTestResources NO-SOURCE
+> Task :static-analysis:testClasses UP-TO-DATE
+> Task :static-analysis:test NO-SOURCE
+> Task :boms:geode-client-bom:processTestResources UP-TO-DATE
+> Task :boms:geode-client-bom:testClasses UP-TO-DATE
+> Task :boms:geode-client-bom:test NO-SOURCE
+> Task :extensions:geode-modules:processTestResources UP-TO-DATE
+> Task :extensions:geode-modules-assembly:processTestResources NO-SOURCE
+> Task :extensions:geode-modules-assembly:testClasses UP-TO-DATE
+> Task :extensions:geode-modules-assembly:test NO-SOURCE
+> Task :extensions:geode-modules-session:processTestResources NO-SOURCE
+> Task :extensions:geode-modules-session-internal:processTestResources NO-SOURCE
+> Task :extensions:geode-modules-test:processTestResources NO-SOURCE
+> Task :extensions:geode-modules-tomcat7:processTestResources NO-SOURCE
+> Task :extensions:geode-modules-tomcat8:processTestResources NO-SOURCE
+> Task :extensions:geode-modules-tomcat9:processTestResources NO-SOURCE
+> Task :extensions:session-testing-war:processTestResources NO-SOURCE
+> Task :extensions:session-testing-war:testClasses UP-TO-DATE
+> Task :geode-protobuf-messages:jar
+> Task :geode-protobuf-messages:zip
+> Task :geode-protobuf-messages:processTestResources UP-TO-DATE
+> Task :geode-protobuf-messages:testClasses UP-TO-DATE
+> Task :geode-protobuf-messages:test NO-SOURCE
+> Task :geode-assembly:geode-assembly-test:processTestResources NO-SOURCE
+> Task :geode-lucene:geode-lucene-test:processTestResources NO-SOURCE
+> Task :geode-old-versions:1.0.0-incubating:processTestResources NO-SOURCE
+> Task :geode-old-versions:1.0.0-incubating:testClasses UP-TO-DATE
+> Task :geode-old-versions:1.0.0-incubating:test NO-SOURCE
+> Task :geode-old-versions:1.1.0:processTestResources NO-SOURCE
+> Task :geode-old-versions:1.1.0:testClasses UP-TO-DATE
+> Task :geode-old-versions:1.1.0:test NO-SOURCE
+> Task :geode-old-versions:1.1.1:processTestResources NO-SOURCE
+> Task :geode-old-versions:1.1.1:testClasses UP-TO-DATE
+> Task :geode-old-versions:1.1.1:test NO-SOURCE
+> Task :geode-old-versions:1.2.0:processTestResources NO-SOURCE
+> Task :geode-old-versions:1.2.0:testClasses UP-TO-DATE
+> Task :geode-old-versions:1.2.0:test NO-SOURCE
+> Task :geode-old-versions:1.3.0:processTestResources NO-SOURCE
+> Task :geode-old-versions:1.3.0:testClasses UP-TO-DATE
+> Task :geode-old-versions:1.3.0:test NO-SOURCE
+> Task :geode-old-versions:1.4.0:processTestResources NO-SOURCE
+> Task :geode-old-versions:1.4.0:testClasses UP-TO-DATE
+> Task :geode-old-versions:1.4.0:test NO-SOURCE
+> Task :geode-old-versions:1.5.0:processTestResources NO-SOURCE
+> Task :geode-old-versions:1.5.0:testClasses UP-TO-DATE
+> Task :geode-old-versions:1.5.0:test NO-SOURCE
+> Task :geode-old-versions:1.6.0:processTestResources NO-SOURCE
+> Task :geode-old-versions:1.6.0:testClasses UP-TO-DATE
+> Task :geode-old-versions:1.6.0:test NO-SOURCE
+> Task :geode-old-versions:1.7.0:processTestResources NO-SOURCE
+> Task :geode-old-versions:1.7.0:testClasses UP-TO-DATE
+> Task :geode-old-versions:1.7.0:test NO-SOURCE
+> Task :geode-old-versions:1.9.0:processTestResources NO-SOURCE
+> Task :geode-old-versions:1.9.0:testClasses UP-TO-DATE
+> Task :geode-old-versions:1.9.0:test NO-SOURCE
+> Task :geode-protobuf:geode-protobuf-test:processTestResources NO-SOURCE
+> Task :geode-pulse:geode-pulse-test:processTestResources NO-SOURCE
+> Task :geode-old-versions:1.8.0:compileAcceptanceTestJava NO-SOURCE
+> Task :extensions:session-testing-war:test NO-SOURCE
+> Task :geode-redis:processTestResources UP-TO-DATE
+> Task :geode-old-versions:1.8.0:compileDistributedTestJava NO-SOURCE
+> Task :geode-common:test UP-TO-DATE
+> Task :geode-old-versions:1.8.0:compileIntegrationTestJava NO-SOURCE
+> Task :geode-old-versions:1.8.0:compilePerformanceTestJava NO-SOURCE
+> Task :geode-old-versions:1.8.0:compileTestJava NO-SOURCE
+> Task :geode-old-versions:1.8.0:compileUiTestJava NO-SOURCE
+> Task :geode-old-versions:1.8.0:compileUpgradeTestJava NO-SOURCE
+> Task :geode-old-versions:1.8.0:processTestResources NO-SOURCE
+> Task :geode-old-versions:1.8.0:testClasses UP-TO-DATE
+> Task :static-analysis:pmd-rules:compileJava UP-TO-DATE
+> Task :geode-old-versions:1.8.0:test NO-SOURCE
+> Task :static-analysis:pmd-rules:processResources UP-TO-DATE
+> Task :static-analysis:pmd-rules:classes UP-TO-DATE
+> Task :static-analysis:pmd-rules:compileAcceptanceTestJava NO-SOURCE
+> Task :geode-core:compileJava UP-TO-DATE
+> Task :geode-junit:compileJava UP-TO-DATE
+> Task :geode-pulse:war
+
+> Task :geode-old-client-support:compileJava
+Note: Some input files use or override a deprecated API.
+Note: Recompile with -Xlint:deprecation for details.
+
+> Task :geode-rebalancer:compileJava
+
+> Task :geode-memcached:compileJava
+Note: Some input files use or override a deprecated API.
+Note: Recompile with -Xlint:deprecation for details.
+
+> Task :geode-cq:compileJava
+Note: Some input files use or override a deprecated API.
+Note: Recompile with -Xlint:deprecation for details.
+Note: Some input files use unchecked or unsafe operations.
+Note: Recompile with -Xlint:unchecked for details.
+
+> Task :geode-protobuf:compileJava
+Note: Some input files use or override a deprecated API.
+Note: Recompile with -Xlint:deprecation for details.
+Note: Some input files use unchecked or unsafe operations.
+Note: Recompile with -Xlint:unchecked for details.
+
+> Task :geode-connectors:compileJava
+Note: Some input files use unchecked or unsafe operations.
+Note: Recompile with -Xlint:unchecked for details.
+
+> Task :geode-web:compileJava
+Note: /Users/bschuchardt/devel/gfdev/geode/geode-web/src/main/java/org/apache/geode/management/internal/web/controllers/AbstractCommandsController.java uses or overrides a deprecated API.
+Note: Recompile with -Xlint:deprecation for details.
+
+> Task :geode-wan:compileJava
+Note: Some input files use or override a deprecated API.
+Note: Recompile with -Xlint:deprecation for details.
+
+> Task :geode-lucene:compileJava
+Note: Some input files use or override a deprecated API.
+Note: Recompile with -Xlint:deprecation for details.
+Note: Some input files use unchecked or unsafe operations.
+Note: Recompile with -Xlint:unchecked for details.
+
+> Task :geode-connectors:classes
+> Task :geode-connectors:compilePerformanceTestJava NO-SOURCE
+> Task :geode-web-management:compileJava
+> Task :geode-core:classes UP-TO-DATE
+> Task :geode-core:compileAcceptanceTestJava NO-SOURCE
+> Task :geode-assembly:compileTestJava
+> Task :geode-cq:classes
+> Task :geode-cq:compileAcceptanceTestJava NO-SOURCE
+> Task :geode-cq:compilePerformanceTestJava NO-SOURCE
+
+> Task :geode-web-api:compileJava
+Note: /Users/bschuchardt/devel/gfdev/geode/geode-web-api/src/main/java/org/apache/geode/rest/internal/web/controllers/support/CacheProviderImpl.java uses or overrides a deprecated API.
+Note: Recompile with -Xlint:deprecation for details.
+Note: Some input files use unchecked or unsafe operations.
+Note: Recompile with -Xlint:unchecked for details.
+
+> Task :geode-pulse:geode-pulse-test:compileJava
+Note: /Users/bschuchardt/devel/gfdev/geode/geode-pulse/geode-pulse-test/src/main/java/org/apache/geode/tools/pulse/tests/rules/ServerRule.java uses unchecked or unsafe operations.
+Note: Recompile with -Xlint:unchecked for details.
+
+> Task :geode-junit:classes UP-TO-DATE
+> Task :geode-junit:compileAcceptanceTestJava NO-SOURCE
+> Task :geode-junit:compileDistributedTestJava NO-SOURCE
+
+> Task :extensions:geode-modules:compileJava
+Note: Some input files use or override a deprecated API.
+Note: Recompile with -Xlint:deprecation for details.
+Note: Some input files use unchecked or unsafe operations.
+Note: Recompile with -Xlint:unchecked for details.
+
+> Task :geode-experimental-driver:compileTestJava
+> Task :geode-lucene:classes
+> Task :geode-lucene:compileAcceptanceTestJava NO-SOURCE
+
+> Task :geode-cq:compileTestJava
+Note: /Users/bschuchardt/devel/gfdev/geode/geode-cq/src/test/java/org/apache/geode/test/dunit/rules/CQUnitTestRule.java uses unchecked or unsafe operations.
+Note: Recompile with -Xlint:unchecked for details.
+
+> Task :geode-cq:compileUiTestJava NO-SOURCE
+> Task :geode-lucene:compileUiTestJava NO-SOURCE
+> Task :geode-management:compileTestJava UP-TO-DATE
+> Task :geode-memcached:classes
+> Task :geode-memcached:compileAcceptanceTestJava NO-SOURCE
+
+> Task :geode-redis:compileJava
+Note: Some input files use or override a deprecated API.
+Note: Recompile with -Xlint:deprecation for details.
+Note: Some input files use unchecked or unsafe operations.
+Note: Recompile with -Xlint:unchecked for details.
+
+> Task :geode-core:compilePerformanceTestJava
+Note: Some input files use or override a deprecated API.
+Note: Recompile with -Xlint:deprecation for details.
+Note: /Users/bschuchardt/devel/gfdev/geode/geode-core/src/performanceTest/java/org/apache/geode/cache/query/BaseLineAndCompareQueryPerfJUnitTest.java uses unchecked or unsafe operations.
+Note: Recompile with -Xlint:unchecked for details.
+
+> Task :geode-old-client-support:classes
+> Task :geode-old-client-support:compileAcceptanceTestJava NO-SOURCE
+> Task :geode-old-client-support:compileIntegrationTestJava NO-SOURCE
+> Task :geode-old-client-support:compilePerformanceTestJava NO-SOURCE
+> Task :geode-old-client-support:compileTestJava NO-SOURCE
+> Task :geode-old-client-support:compileUiTestJava NO-SOURCE
+> Task :geode-old-client-support:compileUpgradeTestJava NO-SOURCE
+> Task :geode-protobuf:classes
+> Task :geode-protobuf:compileAcceptanceTestJava NO-SOURCE
+
+> Task :geode-junit:compileIntegrationTestJava
+Note: /Users/bschuchardt/devel/gfdev/geode/geode-junit/src/integrationTest/java/org/apache/geode/test/compiler/JarBuilderTest.java uses or overrides a deprecated API.
+Note: Recompile with -Xlint:deprecation for details.
+
+> Task :geode-junit:compilePerformanceTestJava NO-SOURCE
+> Task :geode-junit:compileTestJava UP-TO-DATE
+> Task :geode-junit:compileUiTestJava NO-SOURCE
+> Task :geode-junit:compileUpgradeTestJava NO-SOURCE
+> Task :geode-protobuf:compilePerformanceTestJava NO-SOURCE
+> Task :geode-protobuf:compileUiTestJava NO-SOURCE
+> Task :geode-protobuf:compileUpgradeTestJava NO-SOURCE
+> Task :extensions:geode-modules-test:compileJava
+> Task :geode-core:compileTestJava UP-TO-DATE
+> Task :geode-core:compileUiTestJava NO-SOURCE
+> Task :geode-rebalancer:classes
+> Task :geode-rebalancer:compileAcceptanceTestJava NO-SOURCE
+> Task :geode-rebalancer:compileDistributedTestJava NO-SOURCE
+
+> Task :geode-memcached:compileIntegrationTestJava
+Note: /Users/bschuchardt/devel/gfdev/geode/geode-memcached/src/integrationTest/java/org/apache/geode/memcached/GemcachedBinaryClientJUnitTest.java uses or overrides a deprecated API.
+Note: Recompile with -Xlint:deprecation for details.
+
+> Task :geode-memcached:compilePerformanceTestJava NO-SOURCE
+> Task :geode-memcached:compileTestJava NO-SOURCE
+> Task :geode-memcached:compileUiTestJava NO-SOURCE
+> Task :geode-memcached:compileUpgradeTestJava NO-SOURCE
+> Task :geode-redis:classes
+> Task :geode-redis:compileAcceptanceTestJava NO-SOURCE
+
+> Task :geode-lucene:geode-lucene-test:compileJava
+Note: Some input files use or override a deprecated API.
+Note: Recompile with -Xlint:deprecation for details.
+Note: Some input files use unchecked or unsafe operations.
+Note: Recompile with -Xlint:unchecked for details.
+
+> Task :geode-protobuf:geode-protobuf-test:compileJava
+> Task :geode-rebalancer:compileIntegrationTestJava
+> Task :geode-rebalancer:compilePerformanceTestJava NO-SOURCE
+
+> Task :geode-pulse:compileIntegrationTestJava
+Note: /Users/bschuchardt/devel/gfdev/geode/geode-pulse/src/integrationTest/java/org/apache/geode/tools/pulse/controllers/PulseControllerJUnitTest.java uses or overrides a deprecated API.
+Note: Recompile with -Xlint:deprecation for details.
+Note: /Users/bschuchardt/devel/gfdev/geode/geode-pulse/src/integrationTest/java/org/apache/geode/tools/pulse/controllers/PulseControllerJUnitTest.java uses unchecked or unsafe operations.
+Note: Recompile with -Xlint:unchecked for details.
+
+> Task :geode-lucene:compilePerformanceTestJava
+Note: /Users/bschuchardt/devel/gfdev/geode/geode-lucene/src/performanceTest/java/org/apache/geode/cache/lucene/internal/repository/LuceneIndexMemoryOverheadTest.java uses unchecked or unsafe operations.
+Note: Recompile with -Xlint:unchecked for details.
+
+> Task :geode-redis:compileIntegrationTestJava
+Note: Some input files use or override a deprecated API.
+Note: Recompile with -Xlint:deprecation for details.
+
+> Task :geode-redis:compilePerformanceTestJava NO-SOURCE
+> Task :geode-rebalancer:compileTestJava
+> Task :geode-rebalancer:compileUiTestJava NO-SOURCE
+> Task :geode-rebalancer:compileUpgradeTestJava NO-SOURCE
+> Task :geode-wan:classes
+> Task :geode-wan:compileAcceptanceTestJava NO-SOURCE
+
+> Task :geode-assembly:geode-assembly-test:compileJava
+Note: Some input files use unchecked or unsafe operations.
+Note: Recompile with -Xlint:unchecked for details.
+
+> Task :geode-web:classes
+> Task :geode-web:compileAcceptanceTestJava NO-SOURCE
+> Task :geode-web:compilePerformanceTestJava NO-SOURCE
+
+> Task :geode-dunit:compileJava
+/Users/bschuchardt/devel/gfdev/geode/geode-dunit/src/main/java/org/apache/geode/security/templates/LdapUserAuthenticator.java:92: warning: LdapCtxFactory is internal proprietary API and may be removed in a future release
+    env.put(Context.INITIAL_CONTEXT_FACTORY, com.sun.jndi.ldap.LdapCtxFactory.class.getName());
+                                                              ^
+
+> Task :geode-pulse:compileTestJava
+> Task :geode-redis:compileTestJava
+> Task :geode-redis:compileUiTestJava NO-SOURCE
+> Task :geode-redis:compileUpgradeTestJava NO-SOURCE
+> Task :geode-web-api:classes
+> Task :geode-web-api:compileAcceptanceTestJava NO-SOURCE
+> Task :geode-web-api:compileDistributedTestJava NO-SOURCE
+> Task :geode-web-api:compilePerformanceTestJava NO-SOURCE
+> Task :geode-web:compileTestJava
+> Task :geode-web:compileUiTestJava NO-SOURCE
+> Task :geode-web-management:classes
+> Task :geode-web-management:compileAcceptanceTestJava NO-SOURCE
+> Task :geode-core:generateJcaGrammarSource NO-SOURCE
+
+> Task :geode-wan:compileIntegrationTestJava
+Note: /Users/bschuchardt/devel/gfdev/geode/geode-wan/src/integrationTest/java/org/apache/geode/internal/cache/wan/misc/WANConfigurationJUnitTest.java uses or overrides a deprecated API.
+Note: Recompile with -Xlint:deprecation for details.
+Note: /Users/bschuchardt/devel/gfdev/geode/geode-wan/src/integrationTest/java/org/apache/geode/internal/cache/wan/misc/WANConfigurationJUnitTest.java uses unchecked or unsafe operations.
+Note: Recompile with -Xlint:unchecked for details.
+
+> Task :geode-wan:compilePerformanceTestJava NO-SOURCE
+> Task :geode-web-api:compileTestJava
+> Task :geode-web-api:compileUiTestJava NO-SOURCE
+> Task :geode-web-api:compileUpgradeTestJava NO-SOURCE
+> Task :geode-junit:jar UP-TO-DATE
+> Task :geode-web-management:jar
+> Task :geode-web-management:compilePerformanceTestJava NO-SOURCE
+> Task :geode-web-management:compileTestJava NO-SOURCE
+> Task :geode-web-management:compileUiTestJava NO-SOURCE
+> Task :geode-web-management:compileUpgradeTestJava NO-SOURCE
+> Task :extensions:geode-modules:classes
+> Task :extensions:geode-modules:compileAcceptanceTestJava NO-SOURCE
+> Task :extensions:geode-modules:compilePerformanceTestJava NO-SOURCE
+
+> Task :geode-protobuf:compileTestJava
+Note: Some input files use unchecked or unsafe operations.
+Note: Recompile with -Xlint:unchecked for details.
+
+> Task :geode-connectors:compileTestJava
+Note: Some input files use or override a deprecated API.
+Note: Recompile with -Xlint:deprecation for details.
+Note: Some input files use unchecked or unsafe operations.
+Note: Recompile with -Xlint:unchecked for details.
+
+> Task :geode-connectors:compileUiTestJava NO-SOURCE
+> Task :geode-connectors:compileUpgradeTestJava NO-SOURCE
+> Task :extensions:geode-modules-test:classes
+> Task :extensions:geode-modules-test:compileAcceptanceTestJava NO-SOURCE
+> Task :extensions:geode-modules-test:compileDistributedTestJava NO-SOURCE
+> Task :extensions:geode-modules-test:compileIntegrationTestJava NO-SOURCE
+> Task :extensions:geode-modules-test:compilePerformanceTestJava NO-SOURCE
+> Task :extensions:geode-modules-test:compileTestJava NO-SOURCE
+> Task :extensions:geode-modules-test:compileUiTestJava NO-SOURCE
+> Task :extensions:geode-modules-test:compileUpgradeTestJava NO-SOURCE
+
+> Task :geode-pulse:compileUiTestJava
+Note: /Users/bschuchardt/devel/gfdev/geode/geode-pulse/src/uiTest/java/org/apache/geode/tools/pulse/tests/ui/PulseBase.java uses or overrides a deprecated API.
+Note: Recompile with -Xlint:deprecation for details.
+Note: /Users/bschuchardt/devel/gfdev/geode/geode-pulse/src/uiTest/java/org/apache/geode/tools/pulse/tests/junit/ClusterSelectedRegionsMemberServiceTest.java uses unchecked or unsafe operations.
+Note: Recompile with -Xlint:unchecked for details.
+
+> Task :geode-core:compileJcaJava
+Note: Some input files use or override a deprecated API.
+Note: Recompile with -Xlint:deprecation for details.
+
+> Task :geode-core:processJcaResources NO-SOURCE
+> Task :geode-core:jcaClasses
+
+> Task :extensions:geode-modules:compileTestJava
+Note: Some input files use or override a deprecated API.
+Note: Recompile with -Xlint:deprecation for details.
+
+> Task :extensions:geode-modules:compileUiTestJava NO-SOURCE
+> Task :extensions:geode-modules:compileUpgradeTestJava NO-SOURCE
+> Task :extensions:geode-modules-tomcat7:compileJava
+> Task :extensions:geode-modules-tomcat7:classes
+> Task :extensions:geode-modules-tomcat7:compileAcceptanceTestJava NO-SOURCE
+> Task :extensions:geode-modules-tomcat7:compileDistributedTestJava NO-SOURCE
+> Task :extensions:geode-modules-tomcat7:compilePerformanceTestJava NO-SOURCE
+> Task :extensions:geode-modules-tomcat7:compileTestJava NO-SOURCE
+> Task :extensions:geode-modules-tomcat7:compileUiTestJava NO-SOURCE
+> Task :extensions:geode-modules-tomcat7:compileUpgradeTestJava NO-SOURCE
+> Task :geode-assembly:geode-assembly-test:classes
+> Task :geode-assembly:geode-assembly-test:compileAcceptanceTestJava NO-SOURCE
+> Task :geode-assembly:geode-assembly-test:compileDistributedTestJava NO-SOURCE
+> Task :geode-assembly:geode-assembly-test:compileIntegrationTestJava NO-SOURCE
+> Task :geode-assembly:geode-assembly-test:compilePerformanceTestJava NO-SOURCE
+> Task :geode-assembly:geode-assembly-test:compileTestJava NO-SOURCE
+> Task :geode-assembly:geode-assembly-test:compileUiTestJava NO-SOURCE
+> Task :geode-assembly:geode-assembly-test:compileUpgradeTestJava NO-SOURCE
+> Task :geode-lucene:geode-lucene-test:classes
+> Task :geode-lucene:geode-lucene-test:compileAcceptanceTestJava NO-SOURCE
+> Task :geode-lucene:geode-lucene-test:compileDistributedTestJava NO-SOURCE
+> Task :geode-lucene:geode-lucene-test:compileIntegrationTestJava NO-SOURCE
+> Task :geode-lucene:geode-lucene-test:compilePerformanceTestJava NO-SOURCE
+> Task :geode-lucene:geode-lucene-test:compileTestJava NO-SOURCE
+> Task :geode-lucene:geode-lucene-test:compileUiTestJava NO-SOURCE
+> Task :geode-lucene:geode-lucene-test:compileUpgradeTestJava NO-SOURCE
+> Task :geode-protobuf:geode-protobuf-test:classes
+> Task :geode-protobuf:geode-protobuf-test:compileAcceptanceTestJava NO-SOURCE
+> Task :geode-protobuf:geode-protobuf-test:compileDistributedTestJava NO-SOURCE
+> Task :geode-protobuf:geode-protobuf-test:compileIntegrationTestJava NO-SOURCE
+> Task :geode-protobuf:geode-protobuf-test:compilePerformanceTestJava NO-SOURCE
+> Task :geode-protobuf:geode-protobuf-test:compileTestJava NO-SOURCE
+> Task :geode-protobuf:geode-protobuf-test:compileUiTestJava NO-SOURCE
+> Task :geode-protobuf:geode-protobuf-test:compileUpgradeTestJava NO-SOURCE
+> Task :geode-pulse:geode-pulse-test:classes
+> Task :geode-pulse:geode-pulse-test:compileAcceptanceTestJava NO-SOURCE
+> Task :geode-pulse:geode-pulse-test:compileDistributedTestJava NO-SOURCE
+> Task :geode-pulse:geode-pulse-test:compileIntegrationTestJava NO-SOURCE
+> Task :geode-pulse:geode-pulse-test:compilePerformanceTestJava NO-SOURCE
+> Task :geode-pulse:geode-pulse-test:compileTestJava NO-SOURCE
+> Task :geode-pulse:geode-pulse-test:compileUiTestJava NO-SOURCE
+> Task :geode-pulse:geode-pulse-test:compileUpgradeTestJava NO-SOURCE
+> Task :static-analysis:pmd-rules:compileDistributedTestJava NO-SOURCE
+> Task :static-analysis:pmd-rules:compileIntegrationTestJava NO-SOURCE
+> Task :static-analysis:pmd-rules:compilePerformanceTestJava NO-SOURCE
+> Task :static-analysis:pmd-rules:compileTestJava UP-TO-DATE
+> Task :static-analysis:pmd-rules:compileUiTestJava NO-SOURCE
+> Task :static-analysis:pmd-rules:compileUpgradeTestJava NO-SOURCE
+> Task :extensions:geode-modules-tomcat8:compileJava
+> Task :extensions:geode-modules-tomcat8:classes
+> Task :extensions:geode-modules-tomcat8:compileAcceptanceTestJava NO-SOURCE
+> Task :extensions:geode-modules-tomcat8:compileIntegrationTestJava NO-SOURCE
+> Task :extensions:geode-modules-tomcat8:compilePerformanceTestJava NO-SOURCE
+> Task :extensions:geode-modules-tomcat8:compileTestJava NO-SOURCE
+> Task :extensions:geode-modules-tomcat8:compileUiTestJava NO-SOURCE
+> Task :extensions:geode-modules-tomcat8:compileUpgradeTestJava NO-SOURCE
+> Task :geode-connectors:jar
+> Task :geode-cq:jar
+> Task :extensions:geode-modules-tomcat9:compileJava
+> Task :extensions:geode-modules-tomcat9:classes
+> Task :extensions:geode-modules-tomcat9:compileAcceptanceTestJava NO-SOURCE
+> Task :extensions:geode-modules-tomcat9:compileDistributedTestJava NO-SOURCE
+> Task :extensions:geode-modules-tomcat9:compileIntegrationTestJava NO-SOURCE
+> Task :extensions:geode-modules-tomcat9:compilePerformanceTestJava NO-SOURCE
+> Task :extensions:geode-modules-tomcat9:compileTestJava NO-SOURCE
+> Task :extensions:geode-modules-tomcat9:compileUiTestJava NO-SOURCE
+> Task :extensions:geode-modules-tomcat9:compileUpgradeTestJava NO-SOURCE
+> Task :geode-memcached:jar
+> Task :geode-wan:compileTestJava
+> Task :geode-wan:compileUiTestJava NO-SOURCE
+> Task :geode-old-client-support:jar
+> Task :geode-rebalancer:jar
+> Task :geode-protobuf:jar
+> Task :geode-wan:jar
+> Task :geode-web-api:jar
+
+> Task :extensions:geode-modules-session-internal:compileJava
+Note: Some input files use or override a deprecated API.
+Note: Recompile with -Xlint:deprecation for details.
+Note: Some input files use unchecked or unsafe operations.
+Note: Recompile with -Xlint:unchecked for details.
+
+> Task :geode-web:jar
+> Task :extensions:geode-modules-session-internal:classes
+> Task :extensions:geode-modules-session-internal:compileAcceptanceTestJava NO-SOURCE
+> Task :extensions:geode-modules-session-internal:compileDistributedTestJava NO-SOURCE
+> Task :extensions:geode-modules-session-internal:compileIntegrationTestJava NO-SOURCE
+> Task :extensions:geode-modules-session-internal:compilePerformanceTestJava NO-SOURCE
+> Task :extensions:geode-modules-session-internal:compileTestJava NO-SOURCE
+> Task :extensions:geode-modules-session-internal:compileUiTestJava NO-SOURCE
+> Task :extensions:geode-modules-session-internal:compileUpgradeTestJava NO-SOURCE
+> Task :geode-redis:jar
+> Task :extensions:geode-modules:jar
+> Task :extensions:geode-modules-session-internal:jar
+> Task :extensions:geode-modules-tomcat7:jar
+> Task :extensions:geode-modules-tomcat8:jar
+> Task :extensions:geode-modules-tomcat9:jar
+> Task :extensions:geode-modules-assembly:distTcServer
+> Task :extensions:geode-modules-assembly:distTcServer30
+> Task :extensions:geode-modules-assembly:distTomcat
+> Task :geode-connectors:testClasses
+> Task :geode-cq:testClasses
+> Task :geode-experimental-driver:testClasses
+> Task :geode-junit:testClasses UP-TO-DATE
+> Task :geode-junit:test UP-TO-DATE
+> Task :geode-lucene:geode-lucene-test:jar UP-TO-DATE
+> Task :geode-management:testClasses UP-TO-DATE
+> Task :geode-management:test UP-TO-DATE
+> Task :geode-memcached:testClasses UP-TO-DATE
+> Task :geode-old-client-support:testClasses UP-TO-DATE
+> Task :geode-protobuf:testClasses
+> Task :geode-protobuf:geode-protobuf-test:jar UP-TO-DATE
+> Task :geode-pulse:processTestResources UP-TO-DATE
+> Task :geode-pulse:testClasses
+> Task :geode-rebalancer:testClasses
+> Task :geode-redis:testClasses
+> Task :geode-wan:testClasses
+> Task :geode-web:testClasses
+> Task :extensions:geode-modules:testClasses
+> Task :extensions:geode-modules-session-internal:testClasses UP-TO-DATE
+> Task :extensions:geode-modules-test:testClasses UP-TO-DATE
+> Task :extensions:geode-modules-tomcat7:testClasses UP-TO-DATE
+> Task :extensions:geode-modules-tomcat8:testClasses UP-TO-DATE
+> Task :extensions:geode-modules-tomcat9:testClasses UP-TO-DATE
+> Task :geode-assembly:geode-assembly-test:testClasses UP-TO-DATE
+> Task :geode-assembly:geode-assembly-test:test NO-SOURCE
+> Task :geode-lucene:geode-lucene-test:testClasses UP-TO-DATE
+> Task :geode-protobuf:geode-protobuf-test:testClasses UP-TO-DATE
+> Task :geode-pulse:geode-pulse-test:testClasses UP-TO-DATE
+> Task :static-analysis:pmd-rules:processTestResources UP-TO-DATE
+> Task :static-analysis:pmd-rules:testClasses UP-TO-DATE
+> Task :static-analysis:pmd-rules:test UP-TO-DATE
+> Task :extensions:geode-modules-session:compileJava
+> Task :extensions:geode-modules-session:classes
+> Task :extensions:geode-modules-session:compileAcceptanceTestJava NO-SOURCE
+> Task :extensions:geode-modules-session:compileDistributedTestJava NO-SOURCE
+> Task :extensions:geode-modules-session:compilePerformanceTestJava NO-SOURCE
+> Task :extensions:geode-modules-session:compileTestJava NO-SOURCE
+> Task :extensions:geode-modules-session:compileUiTestJava NO-SOURCE
+> Task :extensions:geode-modules-session:compileUpgradeTestJava NO-SOURCE
+> Task :extensions:geode-modules-session:jar
+> Task :extensions:geode-modules-session:testClasses UP-TO-DATE
+> Task :extensions:geode-modules-assembly:distAppServer
+> Task :extensions:geode-modules-assembly:dist
+
+> Task :geode-lucene:compileTestJava
+Note: Some input files use or override a deprecated API.
+Note: Recompile with -Xlint:deprecation for details.
+Note: Some input files use unchecked or unsafe operations.
+Note: Recompile with -Xlint:unchecked for details.
+
+> Task :geode-lucene:jar
+> Task :geode-lucene:testClasses
+> Task :geode-assembly:defaultCacheConfig
+> Task :geode-web-management:war
+> Task :geode-web-management:testClasses UP-TO-DATE
+> Task :geode-web-api:war
+> Task :geode-web-api:testClasses
+
+> Task :geode-dunit:compileJava
+Note: Some input files use or override a deprecated API.
+Note: Recompile with -Xlint:deprecation for details.
+Note: Some input files use unchecked or unsafe operations.
+Note: Recompile with -Xlint:unchecked for details.
+1 warning
+
+> Task :geode-assembly:defaultDistributionConfig
+> Task :geode-assembly:testClasses
+> Task :geode-core:jar
+> Task :geode-core:raJar UP-TO-DATE
+> Task :geode-core:jcaJar
+> Task :geode-core:processTestResources UP-TO-DATE
+> Task :geode-core:testClasses UP-TO-DATE
+> Task :geode-dunit:classes
+> Task :geode-dunit:compileAcceptanceTestJava NO-SOURCE
+> Task :geode-assembly:configureDepsJar
+> Task :geode-web:war
+> Task :geode-memcached:compileDistributedTestJava NO-SOURCE
+
+> Task :geode-old-client-support:compileDistributedTestJava
+Note: /Users/bschuchardt/devel/gfdev/geode/geode-old-client-support/src/distributedTest/java/org/apache/geode/OldClientSupportDUnitTest.java uses or overrides a deprecated API.
+Note: Recompile with -Xlint:deprecation for details.
+
+> Task :geode-experimental-driver:test
+> Task :geode-protobuf:compileDistributedTestJava
+> Task :geode-assembly:compileAcceptanceTestJava
+
+> Task :geode-experimental-driver:compileIntegrationTestJava
+Note: Some input files use unchecked or unsafe operations.
+Note: Recompile with -Xlint:unchecked for details.
+
+> Task :geode-dunit:compileDistributedTestJava
+Note: Some input files use or override a deprecated API.
+Note: Recompile with -Xlint:deprecation for details.
+Note: Some input files use unchecked or unsafe operations.
+Note: Recompile with -Xlint:unchecked for details.
+
+> Task :geode-redis:compileDistributedTestJava
+Note: /Users/bschuchardt/devel/gfdev/geode/geode-redis/src/distributedTest/java/org/apache/geode/redis/RedisDistDUnitTest.java uses or overrides a deprecated API.
+Note: Recompile with -Xlint:deprecation for details.
+Note: /Users/bschuchardt/devel/gfdev/geode/geode-redis/src/distributedTest/java/org/apache/geode/redis/RedisDistDUnitTest.java uses unchecked or unsafe operations.
+Note: Recompile with -Xlint:unchecked for details.
+
+> Task :geode-dunit:compileIntegrationTestJava
+> Task :geode-dunit:compilePerformanceTestJava NO-SOURCE
+
+> Task :geode-protobuf:compileIntegrationTestJava
+Note: /Users/bschuchardt/devel/gfdev/geode/geode-protobuf/src/integrationTest/java/org/apache/geode/internal/protocol/protobuf/v1/ValueSerializerIntegrationTest.java uses unchecked or unsafe operations.
+Note: Recompile with -Xlint:unchecked for details.
+
+> Task :geode-dunit:compileTestJava
+
+> Task :geode-core:test
+
+org.apache.geode.distributed.internal.membership.adapter.auth.GMSAuthenticatorWithAuthenticatorTest > getCredentialsShouldReturnNullIfNoPeerAuthInit FAILED
+    java.lang.NullPointerException
+        at java.util.concurrent.ConcurrentHashMap.get(ConcurrentHashMap.java:936)
+        at org.apache.geode.internal.net.SocketCreator.getHostName(SocketCreator.java:302)
+        at org.apache.geode.distributed.internal.membership.InternalDistributedMember.<init>(InternalDistributedMember.java:182)
+        at org.apache.geode.distributed.internal.membership.adapter.auth.GMSAuthenticator.getCredentials(GMSAuthenticator.java:158)
+        at org.apache.geode.distributed.internal.membership.adapter.auth.GMSAuthenticatorWithAuthenticatorTest.getCredentialsShouldReturnNullIfNoPeerAuthInit(GMSAuthenticatorWithAuthenticatorTest.java:87)
+
+org.apache.geode.distributed.internal.membership.adapter.auth.GMSAuthenticatorWithAuthenticatorTest > getCredentialsShouldThrowIfPeerAuthInitCreateReturnsNull FAILED
+    java.lang.AssertionError: 
+    Expecting:
+     <null>
+    to contain:
+     <"Instance could not be obtained from"> 
+        at org.apache.geode.distributed.internal.membership.adapter.auth.GMSAuthenticatorWithAuthenticatorTest.getCredentialsShouldThrowIfPeerAuthInitCreateReturnsNull(GMSAuthenticatorWithAuthenticatorTest.java:111)
+
+org.apache.geode.distributed.internal.membership.adapter.auth.GMSAuthenticatorWithAuthenticatorTest > getCredentialsShouldThrowIfPeerAuthInitGetCredentialsAndInitThrow FAILED
+    java.lang.AssertionError: 
+    Expecting:
+     <null>
+    to contain:
+     <"expected init error"> 
+        at org.apache.geode.distributed.internal.membership.adapter.auth.GMSAuthenticatorWithAuthenticatorTest.getCredentialsShouldThrowIfPeerAuthInitGetCredentialsAndInitThrow(GMSAuthenticatorWithAuthenticatorTest.java:119)
+
+org.apache.geode.distributed.internal.membership.adapter.auth.GMSAuthenticatorWithAuthenticatorTest > getCredentialsShouldReturnNullIfEmptyPeerAuthInit FAILED
+    java.lang.NullPointerException
+        at java.util.concurrent.ConcurrentHashMap.get(ConcurrentHashMap.java:936)
+        at org.apache.geode.internal.net.SocketCreator.getHostName(SocketCreator.java:302)
+        at org.apache.geode.distributed.internal.membership.InternalDistributedMember.<init>(InternalDistributedMember.java:182)
+        at org.apache.geode.distributed.internal.membership.adapter.auth.GMSAuthenticator.getCredentials(GMSAuthenticator.java:158)
+        at org.apache.geode.distributed.internal.membership.adapter.auth.GMSAuthenticatorWithAuthenticatorTest.getCredentialsShouldReturnNullIfEmptyPeerAuthInit(GMSAuthenticatorWithAuthenticatorTest.java:94)
+
+org.apache.geode.distributed.internal.membership.adapter.auth.GMSAuthenticatorWithAuthenticatorTest > authenticateShouldReturnFailureMessageIfAuthenticateThrows FAILED
+    java.lang.AssertionError: 
+    Expecting:
+     <"Security check failed. Failed to acquire Authenticator object">
+    to start with:
+     <"Security check failed. expected authenticate error">
+        at org.apache.geode.distributed.internal.membership.adapter.auth.GMSAuthenticatorWithAuthenticatorTest.authenticateShouldReturnFailureMessageIfAuthenticateThrows(GMSAuthenticatorWithAuthenticatorTest.java:199)
+
+org.apache.geode.distributed.internal.membership.adapter.auth.GMSAuthenticatorWithAuthenticatorTest > authenticateShouldReturnNullIfSuccessful FAILED
+    org.junit.ComparisonFailure: expected:<null> but was:<"Security check failed. Failed to acquire Authenticator object">
+        at sun.reflect.NativeConstructorAccessorImpl.newInstance0(Native Method)
+        at sun.reflect.NativeConstructorAccessorImpl.newInstance(NativeConstructorAccessorImpl.java:62)
+        at sun.reflect.DelegatingConstructorAccessorImpl.newInstance(DelegatingConstructorAccessorImpl.java:45)
+        at org.apache.geode.distributed.internal.membership.adapter.auth.GMSAuthenticatorWithAuthenticatorTest.authenticateShouldReturnNullIfSuccessful(GMSAuthenticatorWithAuthenticatorTest.java:141)
+
+org.apache.geode.distributed.internal.membership.adapter.auth.GMSAuthenticatorWithAuthenticatorTest > usesPeerAuthInitToGetCredentials FAILED
+    java.lang.NullPointerException
+
+org.apache.geode.distributed.internal.membership.adapter.auth.GMSAuthenticatorWithAuthenticatorTest > getCredentialsShouldThrowIfPeerAuthInitGetCredentialsThrows FAILED
+    java.lang.AssertionError: 
+    Expecting:
+     <null>
+    to contain:
+     <"expected get credential error"> 
+        at org.apache.geode.distributed.internal.membership.adapter.auth.GMSAuthenticatorWithAuthenticatorTest.getCredentialsShouldThrowIfPeerAuthInitGetCredentialsThrows(GMSAuthenticatorWithAuthenticatorTest.java:127)
+
+org.apache.geode.distributed.internal.membership.adapter.auth.GMSAuthenticatorWithAuthenticatorTest > getCredentialsShouldThrowIfPeerAuthInitDoesNotExist FAILED
+    java.lang.AssertionError: 
+    Expecting:
+     <null>
+    to contain:
+     <"Instance could not be obtained from"> 
+        at org.apache.geode.distributed.internal.membership.adapter.auth.GMSAuthenticatorWithAuthenticatorTest.getCredentialsShouldThrowIfPeerAuthInitDoesNotExist(GMSAuthenticatorWithAuthenticatorTest.java:103)
+
+> Task :geode-web:compileDistributedTestJava
+Note: Some input files use or override a deprecated API.
+Note: Recompile with -Xlint:deprecation for details.
+
+> Task :geode-dunit:compileUiTestJava NO-SOURCE
+> Task :geode-dunit:compileUpgradeTestJava NO-SOURCE
+
+> Task :geode-assembly:compileDistributedTestJava
+Note: Some input files use or override a deprecated API.
+Note: Recompile with -Xlint:deprecation for details.
+Note: Some input files use unchecked or unsafe operations.
+Note: Recompile with -Xlint:unchecked for details.
+
+> Task :geode-web:compileIntegrationTestJava
+> Task :geode-web:compileUpgradeTestJava NO-SOURCE
+
+> Task :geode-web-api:compileIntegrationTestJava
+Note: /Users/bschuchardt/devel/gfdev/geode/geode-web-api/src/integrationTest/java/org/apache/geode/rest/internal/web/controllers/RestAccessControllerTest.java uses or overrides a deprecated API.
+Note: Recompile with -Xlint:deprecation for details.
+Note: Some input files use unchecked or unsafe operations.
+Note: Recompile with -Xlint:unchecked for details.
+
+> Task :geode-assembly:compileIntegrationTestJava
+Note: Some input files use or override a deprecated API.
+Note: Recompile with -Xlint:deprecation for details.
+Note: Some input files use unchecked or unsafe operations.
+Note: Recompile with -Xlint:unchecked for details.
+
+> Task :geode-dunit:jar
+> Task :geode-assembly:compileUiTestJava
+> Task :geode-assembly:compileUpgradeTestJava
+> Task :extensions:geode-modules:compileDistributedTestJava
+> Task :geode-web-management:compileCommonTestJava
+> Task :geode-web-management:commonTestClasses
+
+> Task :extensions:geode-modules:compileIntegrationTestJava
+Note: Some input files use or override a deprecated API.
+Note: Recompile with -Xlint:deprecation for details.
+Note: Some input files use unchecked or unsafe operations.
+Note: Recompile with -Xlint:unchecked for details.
+
+> Task :geode-web-management:compileDistributedTestJava
+
+> Task :extensions:geode-modules-session:compileIntegrationTestJava
+Note: /Users/bschuchardt/devel/gfdev/geode/extensions/geode-modules-session/src/integrationTest/java/org/apache/geode/modules/session/installer/InstallerJUnitTest.java uses or overrides a deprecated API.
+Note: Recompile with -Xlint:deprecation for details.
+
+> Task :extensions:geode-modules-tomcat7:compileIntegrationTestJava
+> Task :geode-web-management:compileIntegrationTestJava
+> Task :geode-assembly:depsJar
+> Task :geode-connectors:test
+> Task :geode-cq:test
+> Task :geode-lucene:test
+
+> Task :extensions:geode-modules-tomcat8:compileDistributedTestJava
+Note: Some input files use or override a deprecated API.
+Note: Recompile with -Xlint:deprecation for details.
+
+> Task :geode-dunit:testClasses
+
+> Task :geode-wan:compileDistributedTestJava
+Note: Some input files use or override a deprecated API.
+Note: Recompile with -Xlint:deprecation for details.
+Note: Some input files use unchecked or unsafe operations.
+Note: Recompile with -Xlint:unchecked for details.
+
+> Task :geode-wan:compileUpgradeTestJava
+Note: Some input files use or override a deprecated API.
+Note: Recompile with -Xlint:deprecation for details.
+Note: Some input files use unchecked or unsafe operations.
+Note: Recompile with -Xlint:unchecked for details.
+
+> Task :geode-memcached:test NO-SOURCE
+> Task :geode-old-client-support:test NO-SOURCE
+> Task :geode-dunit:test
+
+> Task :geode-cq:compileDistributedTestJava
+Note: Some input files use or override a deprecated API.
+Note: Recompile with -Xlint:deprecation for details.
+Note: Some input files use unchecked or unsafe operations.
+Note: Recompile with -Xlint:unchecked for details.
+
+> Task :geode-cq:compileIntegrationTestJava
+Note: /Users/bschuchardt/devel/gfdev/geode/geode-cq/src/integrationTest/java/org/apache/geode/cache/query/cq/CQJUnitTest.java uses or overrides a deprecated API.
+Note: Recompile with -Xlint:deprecation for details.
+Note: /Users/bschuchardt/devel/gfdev/geode/geode-cq/src/integrationTest/java/org/apache/geode/cache/query/cq/CQJUnitTest.java uses unchecked or unsafe operations.
+Note: Recompile with -Xlint:unchecked for details.
+
+> Task :geode-assembly:docs
+
+> Task :geode-cq:compileUpgradeTestJava
+Note: Some input files use or override a deprecated API.
+Note: Recompile with -Xlint:deprecation for details.
+
+> Task :geode-protobuf:test
+> Task :geode-rebalancer:test
+> Task :geode-assembly:configureGfshDepsJar
+> Task :geode-assembly:gfshDepsJar
+> Task :geode-pulse:test
+> Task :geode-assembly:installDist
+
+> Task :geode-connectors:compileAcceptanceTestJava
+Note: Some input files use unchecked or unsafe operations.
+Note: Recompile with -Xlint:unchecked for details.
+
+> Task :geode-connectors:compileDistributedTestJava
+Note: Some input files use or override a deprecated API.
+Note: Recompile with -Xlint:deprecation for details.
+
+> Task :geode-connectors:compileIntegrationTestJava
+Note: /Users/bschuchardt/devel/gfdev/geode/geode-connectors/src/integrationTest/java/org/apache/geode/connectors/jdbc/internal/cli/JDBCConnectorFunctionsSecurityTest.java uses or overrides a deprecated API.
+Note: Recompile with -Xlint:deprecation for details.
+
+> Task :geode-core:test
+
+org.apache.geode.distributed.internal.membership.adapter.auth.GMSAuthenticatorWithSecurityManagerTest > getCredentialsShouldReturnNullIfNoPeerAuthInit FAILED
+    java.lang.NullPointerException
+        at java.util.concurrent.ConcurrentHashMap.get(ConcurrentHashMap.java:936)
+        at org.apache.geode.internal.net.SocketCreator.getHostName(SocketCreator.java:302)
+        at org.apache.geode.distributed.internal.membership.InternalDistributedMember.<init>(InternalDistributedMember.java:182)
+        at org.apache.geode.distributed.internal.membership.adapter.auth.GMSAuthenticator.getCredentials(GMSAuthenticator.java:158)
+        at org.apache.geode.distributed.internal.membership.adapter.auth.GMSAuthenticatorWithSecurityManagerTest.getCredentialsShouldReturnNullIfNoPeerAuthInit(GMSAuthenticatorWithSecurityManagerTest.java:89)
+
+org.apache.geode.distributed.internal.membership.adapter.auth.GMSAuthenticatorWithSecurityManagerTest > getCredentialsShouldThrowIfPeerAuthInitCreateReturnsNull FAILED
+    java.lang.AssertionError: 
+    Expecting:
+     <null>
+    to contain:
+     <"Instance could not be obtained from"> 
+        at org.apache.geode.distributed.internal.membership.adapter.auth.GMSAuthenticatorWithSecurityManagerTest.getCredentialsShouldThrowIfPeerAuthInitCreateReturnsNull(GMSAuthenticatorWithSecurityManagerTest.java:113)
+
+org.apache.geode.distributed.internal.membership.adapter.auth.GMSAuthenticatorWithSecurityManagerTest > getCredentialsShouldThrowIfPeerAuthInitGetCredentialsAndInitThrow FAILED
+    java.lang.AssertionError: 
+    Expecting message:
+     <"expected init error">
+    but was:
+     <null>
+        at org.apache.geode.distributed.internal.membership.adapter.auth.GMSAuthenticatorWithSecurityManagerTest.getCredentialsShouldThrowIfPeerAuthInitGetCredentialsAndInitThrow(GMSAuthenticatorWithSecurityManagerTest.java:121)
+
+org.apache.geode.distributed.internal.membership.adapter.auth.GMSAuthenticatorWithSecurityManagerTest > getCredentialsShouldReturnNullIfEmptyPeerAuthInit FAILED
+    java.lang.NullPointerException
+        at java.util.concurrent.ConcurrentHashMap.get(ConcurrentHashMap.java:936)
+        at org.apache.geode.internal.net.SocketCreator.getHostName(SocketCreator.java:302)
+        at org.apache.geode.distributed.internal.membership.InternalDistributedMember.<init>(InternalDistributedMember.java:182)
+        at org.apache.geode.distributed.internal.membership.adapter.auth.GMSAuthenticator.getCredentials(GMSAuthenticator.java:158)
+        at org.apache.geode.distributed.internal.membership.adapter.auth.GMSAuthenticatorWithSecurityManagerTest.getCredentialsShouldReturnNullIfEmptyPeerAuthInit(GMSAuthenticatorWithSecurityManagerTest.java:96)
+
+org.apache.geode.distributed.internal.membership.adapter.auth.GMSAuthenticatorWithSecurityManagerTest > usesPeerAuthInitToGetCredentials FAILED
+    java.lang.NullPointerException
+        at java.util.concurrent.ConcurrentHashMap.get(ConcurrentHashMap.java:936)
+        at org.apache.geode.internal.net.SocketCreator.getHostName(SocketCreator.java:302)
+        at org.apache.geode.distributed.internal.membership.InternalDistributedMember.<init>(InternalDistributedMember.java:182)
+        at org.apache.geode.distributed.internal.membership.adapter.auth.GMSAuthenticator.getCredentials(GMSAuthenticator.java:158)
+        at org.apache.geode.distributed.internal.membership.adapter.auth.GMSAuthenticatorWithSecurityManagerTest.usesPeerAuthInitToGetCredentials(GMSAuthenticatorWithSecurityManagerTest.java:80)
+
+org.apache.geode.distributed.internal.membership.adapter.auth.GMSAuthenticatorWithSecurityManagerTest > getCredentialsShouldThrowIfPeerAuthInitGetCredentialsThrows FAILED
+    java.lang.AssertionError: 
+    Expecting message:
+     <"expected get credential error">
+    but was:
+     <null>
+        at org.apache.geode.distributed.internal.membership.adapter.auth.GMSAuthenticatorWithSecurityManagerTest.getCredentialsShouldThrowIfPeerAuthInitGetCredentialsThrows(GMSAuthenticatorWithSecurityManagerTest.java:129)
+
+org.apache.geode.distributed.internal.membership.adapter.auth.GMSAuthenticatorWithSecurityManagerTest > getCredentialsShouldThrowIfPeerAuthInitDoesNotExist FAILED
+    java.lang.AssertionError: 
+    Expecting:
+     <null>
+    to contain:
+     <"Instance could not be obtained"> 
+        at org.apache.geode.distributed.internal.membership.adapter.auth.GMSAuthenticatorWithSecurityManagerTest.getCredentialsShouldThrowIfPeerAuthInitDoesNotExist(GMSAuthenticatorWithSecurityManagerTest.java:105)
+
+> Task :geode-redis:test
+
+> Task :geode-core:test
+
+org.apache.geode.distributed.internal.membership.gms.GMSMemberJUnitTest > testCompareToMyLSBLarger FAILED
+    java.lang.AssertionError: expected:<1> but was:<0>
+        at org.junit.Assert.fail(Assert.java:88)
+        at org.junit.Assert.failNotEquals(Assert.java:834)
+        at org.junit.Assert.assertEquals(Assert.java:645)
+        at org.junit.Assert.assertEquals(Assert.java:631)
+        at org.apache.geode.distributed.internal.membership.gms.GMSMemberJUnitTest.testCompareToMyLSBLarger(GMSMemberJUnitTest.java:153)
+
+org.apache.geode.distributed.internal.membership.gms.GMSMemberJUnitTest > testCompareToTheirLSBLarger FAILED
+    java.lang.AssertionError: expected:<-1> but was:<0>
+        at org.junit.Assert.fail(Assert.java:88)
+        at org.junit.Assert.failNotEquals(Assert.java:834)
+        at org.junit.Assert.assertEquals(Assert.java:645)
+        at org.junit.Assert.assertEquals(Assert.java:631)
+        at org.apache.geode.distributed.internal.membership.gms.GMSMemberJUnitTest.testCompareToTheirLSBLarger(GMSMemberJUnitTest.java:160)
+
+org.apache.geode.distributed.internal.membership.gms.GMSMemberJUnitTest > testCompareToMyMSBLarger FAILED
+    java.lang.AssertionError: expected:<1> but was:<0>
+        at org.junit.Assert.fail(Assert.java:88)
+        at org.junit.Assert.failNotEquals(Assert.java:834)
+        at org.junit.Assert.assertEquals(Assert.java:645)
+        at org.junit.Assert.assertEquals(Assert.java:631)
+        at org.apache.geode.distributed.internal.membership.gms.GMSMemberJUnitTest.testCompareToMyMSBLarger(GMSMemberJUnitTest.java:139)
+
+org.apache.geode.distributed.internal.membership.gms.GMSMemberJUnitTest > testCompareToTheirMSBLarger FAILED
+    java.lang.AssertionError: expected:<-1> but was:<0>
+        at org.junit.Assert.fail(Assert.java:88)
+        at org.junit.Assert.failNotEquals(Assert.java:834)
+        at org.junit.Assert.assertEquals(Assert.java:645)
+        at org.junit.Assert.assertEquals(Assert.java:631)
+        at org.apache.geode.distributed.internal.membership.gms.GMSMemberJUnitTest.testCompareToTheirMSBLarger(GMSMemberJUnitTest.java:146)
+
+> Task :geode-lucene:compileDistributedTestJava
+Note: Some input files use or override a deprecated API.
+Note: Recompile with -Xlint:deprecation for details.
+Note: Some input files use unchecked or unsafe operations.
+Note: Recompile with -Xlint:unchecked for details.
+
+> Task :geode-assembly:test
+
+> Task :geode-lucene:compileIntegrationTestJava
+Note: Some input files use or override a deprecated API.
+Note: Recompile with -Xlint:deprecation for details.
+Note: Some input files use unchecked or unsafe operations.
+Note: Recompile with -Xlint:unchecked for details.
+
+> Task :geode-lucene:compileUpgradeTestJava
+Note: Some input files use or override a deprecated API.
+Note: Recompile with -Xlint:deprecation for details.
+Note: /Users/bschuchardt/devel/gfdev/geode/geode-lucene/src/upgradeTest/java/org/apache/geode/cache/lucene/LuceneSearchWithRollingUpgradeDUnit.java uses unchecked or unsafe operations.
+Note: Recompile with -Xlint:unchecked for details.
+
+> Task :geode-web-management:test NO-SOURCE
+> Task :extensions:geode-modules-session:test NO-SOURCE
+> Task :extensions:geode-modules-session-internal:test NO-SOURCE
+> Task :extensions:geode-modules-test:test NO-SOURCE
+> Task :extensions:geode-modules-tomcat7:test NO-SOURCE
+> Task :extensions:geode-modules-tomcat8:test NO-SOURCE
+> Task :extensions:geode-modules-tomcat9:test NO-SOURCE
+> Task :geode-lucene:geode-lucene-test:test NO-SOURCE
+> Task :geode-protobuf:geode-protobuf-test:test NO-SOURCE
+> Task :geode-pulse:geode-pulse-test:test NO-SOURCE
+> Task :geode-wan:test
+> Task :geode-web-api:test
+> Task :geode-web:test
+> Task :extensions:geode-modules:test
+
+> Task :geode-core:test
+
+6285 tests completed, 20 failed, 10 skipped
+
+> Task :geode-core:test FAILED
+
+> Task :combineReports
+All test reports at /Users/bschuchardt/devel/gfdev/geode/build/reports/combined
+
+> Task :geode-core:compileDistributedTestJava
+Note: Some input files use or override a deprecated API.
+Note: Recompile with -Xlint:deprecation for details.
+Note: Some input files use unchecked or unsafe operations.
+Note: Recompile with -Xlint:unchecked for details.
+
+> Task :geode-core:compileIntegrationTestJava
+Note: Some input files use or override a deprecated API.
+Note: Recompile with -Xlint:deprecation for details.
+Note: Some input files use unchecked or unsafe operations.
+Note: Recompile with -Xlint:unchecked for details.
+
+> Task :geode-core:compileUpgradeTestJava
+Note: Some input files use or override a deprecated API.
+Note: Recompile with -Xlint:deprecation for details.
+Note: Some input files use unchecked or unsafe operations.
+Note: Recompile with -Xlint:unchecked for details.
+
+> Task :classes
+> Task :compileTestJava NO-SOURCE
+> Task :testClasses UP-TO-DATE
+
+FAILURE: Build failed with an exception.
+
+* What went wrong:
+Execution failed for task ':geode-core:test'.
+> There were failing tests. See the report at: file:///Users/bschuchardt/devel/gfdev/geode/geode-core/build/reports/test/index.html
+
+* Try:
+Run with --stacktrace option to get the stack trace. Run with --info or --debug option to get more log output. Run with --scan to get full insights.
+
+* Get more help at https://help.gradle.org
+
+Deprecated Gradle features were used in this build, making it incompatible with Gradle 6.0.
+Use '--warning-mode all' to show the individual deprecation warnings.
+See https://docs.gradle.org/5.4/userguide/command_line_interface.html#sec:command_line_warnings
+
+BUILD FAILED in 4m 13s
+241 actionable tasks: 140 executed, 101 up-to-date


Mime
View raw message