flume-user mailing list archives

Site index · List index
Message view « Date » · « Thread »
Top « Date » · « Thread »
From qazw qazw <qazw3...@gmail.com>
Subject Installing Flume 1.7, TestSyslogUtils failed
Date Thu, 05 May 2016 16:02:05 GMT
Hello,

This is my first mail in the list :-)
I am compiling and installing Flume 1.7 (with maven 3.3.9) because I want
to test specially the patch FLUME-2781.
<https://issues.apache.org/jira/browse/FLUME-2781> But the install fails
with the 'test org.apache.flume.source.TestExecSource' and
'org.apache.flume.source.TestSyslogUtils'. Logs:

Tests run: 10, Failures: 1, Errors: 0, Skipped: 0, Time elapsed: 42.282 sec
<<< FAILURE!
testMonitoredCounterGroup(org.apache.flume.source.TestExecSource)  Time
elapsed: 3751 sec  <<< FAILURE!
org.junit.ComparisonFailure: Expected Value: 5 expected:<[5]> but was:<[0]>
    at org.junit.Assert.assertEquals(Assert.java:125)
    at
org.apache.flume.source.TestExecSource.testMonitoredCounterGroup(TestExecSource.java:273)
    at sun.reflect.NativeMethodAccessorImpl.invoke0(Native Method)
    at
sun.reflect.NativeMethodAccessorImpl.invoke(NativeMethodAccessorImpl.java:62)
    at
sun.reflect.DelegatingMethodAccessorImpl.invoke(DelegatingMethodAccessorImpl.java:43)
    at java.lang.reflect.Method.invoke(Method.java:498)
    at
org.junit.runners.model.FrameworkMethod$1.runReflectiveCall(FrameworkMethod.java:45)
    at
org.junit.internal.runners.model.ReflectiveCallable.run(ReflectiveCallable.java:15)
    at
org.junit.runners.model.FrameworkMethod.invokeExplosively(FrameworkMethod.java:42)
    at
org.junit.internal.runners.statements.InvokeMethod.evaluate(InvokeMethod.java:20)
    at
org.junit.internal.runners.statements.RunBefores.evaluate(RunBefores.java:28)
    at
org.junit.internal.runners.statements.RunAfters.evaluate(RunAfters.java:30)
    at org.junit.runners.ParentRunner.runLeaf(ParentRunner.java:263)
    at
org.junit.runners.BlockJUnit4ClassRunner.runChild(BlockJUnit4ClassRunner.java:68)
    at
org.junit.runners.BlockJUnit4ClassRunner.runChild(BlockJUnit4ClassRunner.java:47)
    at org.junit.runners.ParentRunner$3.run(ParentRunner.java:231)
    at org.junit.runners.ParentRunner$1.schedule(ParentRunner.java:60)
    at org.junit.runners.ParentRunner.runChildren(ParentRunner.java:229)
    at org.junit.runners.ParentRunner.access$000(ParentRunner.java:50)
    at org.junit.runners.ParentRunner$2.evaluate(ParentRunner.java:222)
    at org.junit.runners.ParentRunner.run(ParentRunner.java:300)
    at
org.apache.maven.surefire.junit4.JUnit4Provider.execute(JUnit4Provider.java:252)
    at
org.apache.maven.surefire.junit4.JUnit4Provider.executeTestSet(JUnit4Provider.java:141)
    at
org.apache.maven.surefire.junit4.JUnit4Provider.invoke(JUnit4Provider.java:112)
    at sun.reflect.NativeMethodAccessorImpl.invoke0(Native Method)
    at
sun.reflect.NativeMethodAccessorImpl.invoke(NativeMethodAccessorImpl.java:62)
    at
sun.reflect.DelegatingMethodAccessorImpl.invoke(DelegatingMethodAccessorImpl.java:43)
    at java.lang.reflect.Method.invoke(Method.java:498)
    at
org.apache.maven.surefire.util.ReflectionUtils.invokeMethodWithArray(ReflectionUtils.java:189)
    at
org.apache.maven.surefire.booter.ProviderFactory$ProviderProxy.invoke(ProviderFactory.java:165)
    at
org.apache.maven.surefire.booter.ProviderFactory.invokeProvider(ProviderFactory.java:85)
    at
org.apache.maven.surefire.booter.ForkedBooter.runSuitesInProcess(ForkedBooter.java:115)
    at
org.apache.maven.surefire.booter.ForkedBooter.main(ForkedBooter.java:75)

===========

Tests run: 25, Failures: 4, Errors: 0, Skipped: 0, Time elapsed: 0.341 sec
<<< FAILURE!
TestHeader9(org.apache.flume.source.TestSyslogUtils)  Time elapsed: 11 sec
<<< FAILURE!
java.lang.AssertionError: expected:<1462406754000> but was:<null>
    at org.junit.Assert.fail(Assert.java:93)
    at org.junit.Assert.failNotEquals(Assert.java:647)
    at org.junit.Assert.assertEquals(Assert.java:128)
    at org.junit.Assert.assertEquals(Assert.java:147)
    at
org.apache.flume.source.TestSyslogUtils.checkHeader(TestSyslogUtils.java:254)
    at
org.apache.flume.source.TestSyslogUtils.checkHeader(TestSyslogUtils.java:268)
    at
org.apache.flume.source.TestSyslogUtils.TestHeader9(TestSyslogUtils.java:144)
    at sun.reflect.NativeMethodAccessorImpl.invoke0(Native Method)
    at
sun.reflect.NativeMethodAccessorImpl.invoke(NativeMethodAccessorImpl.java:62)
    at
sun.reflect.DelegatingMethodAccessorImpl.invoke(DelegatingMethodAccessorImpl.java:43)
    at java.lang.reflect.Method.invoke(Method.java:498)
    at
org.junit.runners.model.FrameworkMethod$1.runReflectiveCall(FrameworkMethod.java:45)
    at
org.junit.internal.runners.model.ReflectiveCallable.run(ReflectiveCallable.java:15)
    at
org.junit.runners.model.FrameworkMethod.invokeExplosively(FrameworkMethod.java:42)
    at
org.junit.internal.runners.statements.InvokeMethod.evaluate(InvokeMethod.java:20)
    at org.junit.runners.ParentRunner.runLeaf(ParentRunner.java:263)
    at
org.junit.runners.BlockJUnit4ClassRunner.runChild(BlockJUnit4ClassRunner.java:68)
    at
org.junit.runners.BlockJUnit4ClassRunner.runChild(BlockJUnit4ClassRunner.java:47)
    at org.junit.runners.ParentRunner$3.run(ParentRunner.java:231)
    at org.junit.runners.ParentRunner$1.schedule(ParentRunner.java:60)
    at org.junit.runners.ParentRunner.runChildren(ParentRunner.java:229)
    at org.junit.runners.ParentRunner.access$000(ParentRunner.java:50)
    at org.junit.runners.ParentRunner$2.evaluate(ParentRunner.java:222)
    at org.junit.runners.ParentRunner.run(ParentRunner.java:300)
    at
org.apache.maven.surefire.junit4.JUnit4Provider.execute(JUnit4Provider.java:252)
    at
org.apache.maven.surefire.junit4.JUnit4Provider.executeTestSet(JUnit4Provider.java:141)
    at
org.apache.maven.surefire.junit4.JUnit4Provider.invoke(JUnit4Provider.java:112)
    at sun.reflect.NativeMethodAccessorImpl.invoke0(Native Method)
    at
sun.reflect.NativeMethodAccessorImpl.invoke(NativeMethodAccessorImpl.java:62)
    at
sun.reflect.DelegatingMethodAccessorImpl.invoke(DelegatingMethodAccessorImpl.java:43)
    at java.lang.reflect.Method.invoke(Method.java:498)
    at
org.apache.maven.surefire.util.ReflectionUtils.invokeMethodWithArray(ReflectionUtils.java:189)
    at
org.apache.maven.surefire.booter.ProviderFactory$ProviderProxy.invoke(ProviderFactory.java:165)
    at
org.apache.maven.surefire.booter.ProviderFactory.invokeProvider(ProviderFactory.java:85)
    at
org.apache.maven.surefire.booter.ForkedBooter.runSuitesInProcess(ForkedBooter.java:115)
    at
org.apache.maven.surefire.booter.ForkedBooter.main(ForkedBooter.java:75)

TestHeader10(org.apache.flume.source.TestSyslogUtils)  Time elapsed: 3 sec
<<< FAILURE!
java.lang.AssertionError: expected:<1462406754000> but was:<null>
    at org.junit.Assert.fail(Assert.java:93)
    at org.junit.Assert.failNotEquals(Assert.java:647)
    at org.junit.Assert.assertEquals(Assert.java:128)
    at org.junit.Assert.assertEquals(Assert.java:147)
    at
org.apache.flume.source.TestSyslogUtils.checkHeader(TestSyslogUtils.java:254)
    at
org.apache.flume.source.TestSyslogUtils.checkHeader(TestSyslogUtils.java:268)
    at
org.apache.flume.source.TestSyslogUtils.TestHeader10(TestSyslogUtils.java:160)
    at sun.reflect.NativeMethodAccessorImpl.invoke0(Native Method)
    at
sun.reflect.NativeMethodAccessorImpl.invoke(NativeMethodAccessorImpl.java:62)
    at
sun.reflect.DelegatingMethodAccessorImpl.invoke(DelegatingMethodAccessorImpl.java:43)
    at java.lang.reflect.Method.invoke(Method.java:498)
    at
org.junit.runners.model.FrameworkMethod$1.runReflectiveCall(FrameworkMethod.java:45)
    at
org.junit.internal.runners.model.ReflectiveCallable.run(ReflectiveCallable.java:15)
    at
org.junit.runners.model.FrameworkMethod.invokeExplosively(FrameworkMethod.java:42)
    at
org.junit.internal.runners.statements.InvokeMethod.evaluate(InvokeMethod.java:20)
    at org.junit.runners.ParentRunner.runLeaf(ParentRunner.java:263)
    at
org.junit.runners.BlockJUnit4ClassRunner.runChild(BlockJUnit4ClassRunner.java:68)
    at
org.junit.runners.BlockJUnit4ClassRunner.runChild(BlockJUnit4ClassRunner.java:47)
    at org.junit.runners.ParentRunner$3.run(ParentRunner.java:231)
    at org.junit.runners.ParentRunner$1.schedule(ParentRunner.java:60)
    at org.junit.runners.ParentRunner.runChildren(ParentRunner.java:229)
    at org.junit.runners.ParentRunner.access$000(ParentRunner.java:50)
    at org.junit.runners.ParentRunner$2.evaluate(ParentRunner.java:222)
    at org.junit.runners.ParentRunner.run(ParentRunner.java:300)
    at
org.apache.maven.surefire.junit4.JUnit4Provider.execute(JUnit4Provider.java:252)
    at
org.apache.maven.surefire.junit4.JUnit4Provider.executeTestSet(JUnit4Provider.java:141)
    at
org.apache.maven.surefire.junit4.JUnit4Provider.invoke(JUnit4Provider.java:112)
    at sun.reflect.NativeMethodAccessorImpl.invoke0(Native Method)
    at
sun.reflect.NativeMethodAccessorImpl.invoke(NativeMethodAccessorImpl.java:62)
    at
sun.reflect.DelegatingMethodAccessorImpl.invoke(DelegatingMethodAccessorImpl.java:43)
    at java.lang.reflect.Method.invoke(Method.java:498)
    at
org.apache.maven.surefire.util.ReflectionUtils.invokeMethodWithArray(ReflectionUtils.java:189)
    at
org.apache.maven.surefire.booter.ProviderFactory$ProviderProxy.invoke(ProviderFactory.java:165)
    at
org.apache.maven.surefire.booter.ProviderFactory.invokeProvider(ProviderFactory.java:85)
    at
org.apache.maven.surefire.booter.ForkedBooter.runSuitesInProcess(ForkedBooter.java:115)
    at
org.apache.maven.surefire.booter.ForkedBooter.main(ForkedBooter.java:75)

TestRfc3164HeaderApacheLogWithNulls(org.apache.flume.source.TestSyslogUtils)
Time elapsed: 0 sec  <<< FAILURE!
java.lang.AssertionError: expected:<1462406755000> but was:<null>
    at org.junit.Assert.fail(Assert.java:93)
    at org.junit.Assert.failNotEquals(Assert.java:647)
    at org.junit.Assert.assertEquals(Assert.java:128)
    at org.junit.Assert.assertEquals(Assert.java:147)
    at
org.apache.flume.source.TestSyslogUtils.checkHeader(TestSyslogUtils.java:254)
    at
org.apache.flume.source.TestSyslogUtils.checkHeader(TestSyslogUtils.java:268)
    at
org.apache.flume.source.TestSyslogUtils.TestRfc3164HeaderApacheLogWithNulls(TestSyslogUtils.java:190)
    at sun.reflect.NativeMethodAccessorImpl.invoke0(Native Method)
    at
sun.reflect.NativeMethodAccessorImpl.invoke(NativeMethodAccessorImpl.java:62)
    at
sun.reflect.DelegatingMethodAccessorImpl.invoke(DelegatingMethodAccessorImpl.java:43)
    at java.lang.reflect.Method.invoke(Method.java:498)
    at
org.junit.runners.model.FrameworkMethod$1.runReflectiveCall(FrameworkMethod.java:45)
    at
org.junit.internal.runners.model.ReflectiveCallable.run(ReflectiveCallable.java:15)
    at
org.junit.runners.model.FrameworkMethod.invokeExplosively(FrameworkMethod.java:42)
    at
org.junit.internal.runners.statements.InvokeMethod.evaluate(InvokeMethod.java:20)
    at org.junit.runners.ParentRunner.runLeaf(ParentRunner.java:263)
    at
org.junit.runners.BlockJUnit4ClassRunner.runChild(BlockJUnit4ClassRunner.java:68)
    at
org.junit.runners.BlockJUnit4ClassRunner.runChild(BlockJUnit4ClassRunner.java:47)
    at org.junit.runners.ParentRunner$3.run(ParentRunner.java:231)
    at org.junit.runners.ParentRunner$1.schedule(ParentRunner.java:60)
    at org.junit.runners.ParentRunner.runChildren(ParentRunner.java:229)
    at org.junit.runners.ParentRunner.access$000(ParentRunner.java:50)
    at org.junit.runners.ParentRunner$2.evaluate(ParentRunner.java:222)
    at org.junit.runners.ParentRunner.run(ParentRunner.java:300)
    at
org.apache.maven.surefire.junit4.JUnit4Provider.execute(JUnit4Provider.java:252)
    at
org.apache.maven.surefire.junit4.JUnit4Provider.executeTestSet(JUnit4Provider.java:141)
    at
org.apache.maven.surefire.junit4.JUnit4Provider.invoke(JUnit4Provider.java:112)
    at sun.reflect.NativeMethodAccessorImpl.invoke0(Native Method)
    at
sun.reflect.NativeMethodAccessorImpl.invoke(NativeMethodAccessorImpl.java:62)
    at
sun.reflect.DelegatingMethodAccessorImpl.invoke(DelegatingMethodAccessorImpl.java:43)
    at java.lang.reflect.Method.invoke(Method.java:498)
    at
org.apache.maven.surefire.util.ReflectionUtils.invokeMethodWithArray(ReflectionUtils.java:189)
    at
org.apache.maven.surefire.booter.ProviderFactory$ProviderProxy.invoke(ProviderFactory.java:165)
    at
org.apache.maven.surefire.booter.ProviderFactory.invokeProvider(ProviderFactory.java:85)
    at
org.apache.maven.surefire.booter.ForkedBooter.runSuitesInProcess(ForkedBooter.java:115)
    at
org.apache.maven.surefire.booter.ForkedBooter.main(ForkedBooter.java:75)

TestRfc3164Dates(org.apache.flume.source.TestSyslogUtils)  Time elapsed: 0
sec  <<< FAILURE!
java.lang.AssertionError: expected:<1436054875000> but was:<null>
    at org.junit.Assert.fail(Assert.java:93)
    at org.junit.Assert.failNotEquals(Assert.java:647)
    at org.junit.Assert.assertEquals(Assert.java:128)
    at org.junit.Assert.assertEquals(Assert.java:147)
    at
org.apache.flume.source.TestSyslogUtils.checkHeader(TestSyslogUtils.java:254)
    at
org.apache.flume.source.TestSyslogUtils.checkHeader(TestSyslogUtils.java:268)
    at
org.apache.flume.source.TestSyslogUtils.TestRfc3164Dates(TestSyslogUtils.java:226)
    at sun.reflect.NativeMethodAccessorImpl.invoke0(Native Method)
    at
sun.reflect.NativeMethodAccessorImpl.invoke(NativeMethodAccessorImpl.java:62)
    at
sun.reflect.DelegatingMethodAccessorImpl.invoke(DelegatingMethodAccessorImpl.java:43)
    at java.lang.reflect.Method.invoke(Method.java:498)
    at
org.junit.runners.model.FrameworkMethod$1.runReflectiveCall(FrameworkMethod.java:45)
    at
org.junit.internal.runners.model.ReflectiveCallable.run(ReflectiveCallable.java:15)
    at
org.junit.runners.model.FrameworkMethod.invokeExplosively(FrameworkMethod.java:42)
    at
org.junit.internal.runners.statements.InvokeMethod.evaluate(InvokeMethod.java:20)
    at org.junit.runners.ParentRunner.runLeaf(ParentRunner.java:263)
    at
org.junit.runners.BlockJUnit4ClassRunner.runChild(BlockJUnit4ClassRunner.java:68)
    at
org.junit.runners.BlockJUnit4ClassRunner.runChild(BlockJUnit4ClassRunner.java:47)
    at org.junit.runners.ParentRunner$3.run(ParentRunner.java:231)
    at org.junit.runners.ParentRunner$1.schedule(ParentRunner.java:60)
    at org.junit.runners.ParentRunner.runChildren(ParentRunner.java:229)
    at org.junit.runners.ParentRunner.access$000(ParentRunner.java:50)
    at org.junit.runners.ParentRunner$2.evaluate(ParentRunner.java:222)
    at org.junit.runners.ParentRunner.run(ParentRunner.java:300)
    at
org.apache.maven.surefire.junit4.JUnit4Provider.execute(JUnit4Provider.java:252)
    at
org.apache.maven.surefire.junit4.JUnit4Provider.executeTestSet(JUnit4Provider.java:141)
    at
org.apache.maven.surefire.junit4.JUnit4Provider.invoke(JUnit4Provider.java:112)
    at sun.reflect.NativeMethodAccessorImpl.invoke0(Native Method)
    at
sun.reflect.NativeMethodAccessorImpl.invoke(NativeMethodAccessorImpl.java:62)
    at
sun.reflect.DelegatingMethodAccessorImpl.invoke(DelegatingMethodAccessorImpl.java:43)
    at java.lang.reflect.Method.invoke(Method.java:498)
    at
org.apache.maven.surefire.util.ReflectionUtils.invokeMethodWithArray(ReflectionUtils.java:189)
    at
org.apache.maven.surefire.booter.ProviderFactory$ProviderProxy.invoke(ProviderFactory.java:165)
    at
org.apache.maven.surefire.booter.ProviderFactory.invokeProvider(ProviderFactory.java:85)
    at
org.apache.maven.surefire.booter.ForkedBooter.runSuitesInProcess(ForkedBooter.java:115)
    at
org.apache.maven.surefire.booter.ForkedBooter.main(ForkedBooter.java:75)

Which is the reason of these errors? Are important or i could skip these
tests?

Thanks.

Mime
View raw message