flume-dev mailing list archives

Site index · List index
Message view « Date » · « Thread »
Top « Date » · « Thread »
From Apache Jenkins Server <jenk...@builds.apache.org>
Subject Build failed in Jenkins: Flume-trunk-hbase-1 #215
Date Wed, 12 Oct 2016 19:53:14 GMT
See <https://builds.apache.org/job/Flume-trunk-hbase-1/215/changes>

Changes:

[mpercy] Remove test dependencies from binary release artifact

------------------------------------------
[...truncated 2850 lines...]
[INFO] 
[INFO] Flume checkstyle project ........................... SUCCESS [  3.426 s]
[INFO] Apache Flume ....................................... SUCCESS [  6.340 s]
[INFO] Flume NG SDK ....................................... SUCCESS [01:41 min]
[INFO] Flume NG Configuration ............................. SUCCESS [  5.480 s]
[INFO] Flume Auth ......................................... SUCCESS [ 17.772 s]
[INFO] Flume NG Core ...................................... SUCCESS [08:52 min]
[INFO] Flume NG Sinks ..................................... SUCCESS [  1.207 s]
[INFO] Flume NG HDFS Sink ................................. SUCCESS [02:30 min]
[INFO] Flume NG IRC Sink .................................. SUCCESS [  5.494 s]
[INFO] Flume NG Channels .................................. SUCCESS [  2.082 s]
[INFO] Flume NG JDBC channel .............................. SUCCESS [ 46.688 s]
[INFO] Flume NG file-based channel ........................ SUCCESS [05:31 min]
[INFO] Flume NG Spillable Memory channel .................. FAILURE [15:03 min]
[INFO] Flume NG Node ...................................... SKIPPED
[INFO] Flume NG Embedded Agent ............................ SKIPPED
[INFO] Flume NG HBase Sink ................................ SUCCESS [05:27 min]
[INFO] Flume NG ElasticSearch Sink ........................ SUCCESS [01:16 min]
[INFO] Flume NG Morphline Solr Sink ....................... SUCCESS [ 42.727 s]
[INFO] Flume Shared Utils ................................. SUCCESS [  1.138 s]
[INFO] Flume Shared Kafka Test Utils ...................... SUCCESS [  4.200 s]
[INFO] Flume Kafka Sink ................................... FAILURE [15:04 min]
[INFO] Flume NG Kite Dataset Sink ......................... SUCCESS [ 28.192 s]
[INFO] Flume NG Hive Sink ................................. SUCCESS [01:24 min]
[INFO] Flume Sources ...................................... SUCCESS [  0.919 s]
[INFO] Flume Scribe Source ................................ SUCCESS [  7.592 s]
[INFO] Flume JMS Source ................................... SUCCESS [ 21.741 s]
[INFO] Flume Twitter Source ............................... SUCCESS [  5.879 s]
[INFO] Flume Kafka Source ................................. SUCCESS [02:24 min]
[INFO] Flume Taildir Source ............................... SUCCESS [ 20.187 s]
[INFO] flume-kafka-channel ................................ SKIPPED
[INFO] Flume legacy Sources ............................... SUCCESS [  1.003 s]
[INFO] Flume legacy Avro source ........................... SUCCESS [  5.918 s]
[INFO] Flume legacy Thrift Source ......................... SUCCESS [  4.555 s]
[INFO] Flume NG Clients ................................... SUCCESS [  0.919 s]
[INFO] Flume NG Log4j Appender ............................ SUCCESS [ 37.611 s]
[INFO] Flume NG Tools ..................................... SUCCESS [  5.393 s]
[INFO] Flume NG distribution .............................. SKIPPED
[INFO] Flume NG Integration Tests ......................... SUCCESS [02:13 min]
[INFO] ------------------------------------------------------------------------
[INFO] BUILD FAILURE
[INFO] ------------------------------------------------------------------------
[INFO] Total time: 01:06 h
[INFO] Finished at: 2016-10-12T19:51:56+00:00
[INFO] Final Memory: 236M/879M
[INFO] ------------------------------------------------------------------------
Waiting for Jenkins to finish collecting data
[ERROR] Failed to execute goal org.apache.maven.plugins:maven-surefire-plugin:2.12.3:test
(default-test) on project flume-spillable-memory-channel: ExecutionException; nested exception
is java.util.concurrent.ExecutionException: java.lang.RuntimeException: The forked VM terminated
without saying properly goodbye. VM crash or System.exit called ? -> [Help 1]
org.apache.maven.lifecycle.LifecycleExecutionException: Failed to execute goal org.apache.maven.plugins:maven-surefire-plugin:2.12.3:test
(default-test) on project flume-spillable-memory-channel: ExecutionException; nested exception
is java.util.concurrent.ExecutionException: java.lang.RuntimeException: The forked VM terminated
without saying properly goodbye. VM crash or System.exit called ?
	at org.apache.maven.lifecycle.internal.MojoExecutor.execute(MojoExecutor.java:216)
	at org.apache.maven.lifecycle.internal.MojoExecutor.execute(MojoExecutor.java:153)
	at org.apache.maven.lifecycle.internal.MojoExecutor.execute(MojoExecutor.java:145)
	at org.apache.maven.lifecycle.internal.LifecycleModuleBuilder.buildProject(LifecycleModuleBuilder.java:116)
	at org.apache.maven.lifecycle.internal.LifecycleModuleBuilder.buildProject(LifecycleModuleBuilder.java:80)
	at org.apache.maven.lifecycle.internal.builder.singlethreaded.SingleThreadedBuilder.build(SingleThreadedBuilder.java:51)
	at org.apache.maven.lifecycle.internal.LifecycleStarter.execute(LifecycleStarter.java:128)
	at org.apache.maven.DefaultMaven.doExecute(DefaultMaven.java:307)
	at org.apache.maven.DefaultMaven.doExecute(DefaultMaven.java:193)
	at org.apache.maven.DefaultMaven.execute(DefaultMaven.java:106)
	at org.jvnet.hudson.maven3.launcher.Maven32Launcher.main(Maven32Launcher.java:132)
	at sun.reflect.NativeMethodAccessorImpl.invoke0(Native Method)
	at sun.reflect.NativeMethodAccessorImpl.invoke(NativeMethodAccessorImpl.java:57)
	at sun.reflect.DelegatingMethodAccessorImpl.invoke(DelegatingMethodAccessorImpl.java:43)
	at java.lang.reflect.Method.invoke(Method.java:606)
	at org.codehaus.plexus.classworlds.launcher.Launcher.launchStandard(Launcher.java:330)
	at org.codehaus.plexus.classworlds.launcher.Launcher.launch(Launcher.java:238)
	at jenkins.maven3.agent.Maven32Main.launch(Maven32Main.java:186)
	at sun.reflect.NativeMethodAccessorImpl.invoke0(Native Method)
	at sun.reflect.NativeMethodAccessorImpl.invoke(NativeMethodAccessorImpl.java:57)
	at sun.reflect.DelegatingMethodAccessorImpl.invoke(DelegatingMethodAccessorImpl.java:43)
	at java.lang.reflect.Method.invoke(Method.java:606)
	at hudson.maven.Maven3Builder.call(Maven3Builder.java:136)
	at hudson.maven.Maven3Builder.call(Maven3Builder.java:71)
	at hudson.remoting.UserRequest.perform(UserRequest.java:153)
	at hudson.remoting.UserRequest.perform(UserRequest.java:50)
	at hudson.remoting.Request$2.run(Request.java:332)
	at hudson.remoting.InterceptingExecutorService$1.call(InterceptingExecutorService.java:68)
	at java.util.concurrent.FutureTask.run(FutureTask.java:262)
	at java.util.concurrent.ThreadPoolExecutor.runWorker(ThreadPoolExecutor.java:1145)
	at java.util.concurrent.ThreadPoolExecutor$Worker.run(ThreadPoolExecutor.java:615)
	at java.lang.Thread.run(Thread.java:745)
Caused by: org.apache.maven.plugin.MojoExecutionException: ExecutionException; nested exception
is java.util.concurrent.ExecutionException: java.lang.RuntimeException: The forked VM terminated
without saying properly goodbye. VM crash or System.exit called ?
	at org.apache.maven.plugin.surefire.SurefirePlugin.assertNoException(SurefirePlugin.java:160)
	at org.apache.maven.plugin.surefire.SurefirePlugin.handleSummary(SurefirePlugin.java:149)
	at org.apache.maven.plugin.surefire.AbstractSurefireMojo.executeAfterPreconditionsChecked(AbstractSurefireMojo.java:650)
	at org.apache.maven.plugin.surefire.AbstractSurefireMojo.execute(AbstractSurefireMojo.java:586)
	at org.apache.maven.plugin.DefaultBuildPluginManager.executeMojo(DefaultBuildPluginManager.java:134)
	at org.apache.maven.lifecycle.internal.MojoExecutor.execute(MojoExecutor.java:208)
	... 31 more
Caused by: org.apache.maven.surefire.booter.SurefireBooterForkException: ExecutionException;
nested exception is java.util.concurrent.ExecutionException: java.lang.RuntimeException: The
forked VM terminated without saying properly goodbye. VM crash or System.exit called ?
	at org.apache.maven.plugin.surefire.booterclient.ForkStarter.runSuitesForkPerTestSet(ForkStarter.java:192)
	at org.apache.maven.plugin.surefire.booterclient.ForkStarter.run(ForkStarter.java:121)
	at org.apache.maven.plugin.surefire.AbstractSurefireMojo.executeProvider(AbstractSurefireMojo.java:740)
	at org.apache.maven.plugin.surefire.AbstractSurefireMojo.executeAllProviders(AbstractSurefireMojo.java:682)
	at org.apache.maven.plugin.surefire.AbstractSurefireMojo.executeAfterPreconditionsChecked(AbstractSurefireMojo.java:648)
	... 34 more
Caused by: java.util.concurrent.ExecutionException: java.lang.RuntimeException: The forked
VM terminated without saying properly goodbye. VM crash or System.exit called ?
	at java.util.concurrent.FutureTask.report(FutureTask.java:122)
	at java.util.concurrent.FutureTask.get(FutureTask.java:188)
	at org.apache.maven.plugin.surefire.booterclient.ForkStarter.runSuitesForkPerTestSet(ForkStarter.java:176)
	... 38 more
Caused by: java.lang.RuntimeException: The forked VM terminated without saying properly goodbye.
VM crash or System.exit called ?
	at org.apache.maven.plugin.surefire.booterclient.output.ForkClient.close(ForkClient.java:257)
	at org.apache.maven.plugin.surefire.booterclient.ForkStarter.fork(ForkStarter.java:301)
	at org.apache.maven.plugin.surefire.booterclient.ForkStarter.access$100(ForkStarter.java:75)
	at org.apache.maven.plugin.surefire.booterclient.ForkStarter$1.call(ForkStarter.java:163)
	at org.apache.maven.plugin.surefire.booterclient.ForkStarter$1.call(ForkStarter.java:160)
	... 4 more
[ERROR] Failed to execute goal org.apache.maven.plugins:maven-surefire-plugin:2.12.3:test
(default-test) on project flume-ng-kafka-sink: ExecutionException; nested exception is java.util.concurrent.ExecutionException:
java.lang.RuntimeException: The forked VM terminated without saying properly goodbye. VM crash
or System.exit called ? -> [Help 1]
org.apache.maven.lifecycle.LifecycleExecutionException: Failed to execute goal org.apache.maven.plugins:maven-surefire-plugin:2.12.3:test
(default-test) on project flume-ng-kafka-sink: ExecutionException; nested exception is java.util.concurrent.ExecutionException:
java.lang.RuntimeException: The forked VM terminated without saying properly goodbye. VM crash
or System.exit called ?
	at org.apache.maven.lifecycle.internal.MojoExecutor.execute(MojoExecutor.java:216)
	at org.apache.maven.lifecycle.internal.MojoExecutor.execute(MojoExecutor.java:153)
	at org.apache.maven.lifecycle.internal.MojoExecutor.execute(MojoExecutor.java:145)
	at org.apache.maven.lifecycle.internal.LifecycleModuleBuilder.buildProject(LifecycleModuleBuilder.java:116)
	at org.apache.maven.lifecycle.internal.LifecycleModuleBuilder.buildProject(LifecycleModuleBuilder.java:80)
	at org.apache.maven.lifecycle.internal.builder.singlethreaded.SingleThreadedBuilder.build(SingleThreadedBuilder.java:51)
	at org.apache.maven.lifecycle.internal.LifecycleStarter.execute(LifecycleStarter.java:128)
	at org.apache.maven.DefaultMaven.doExecute(DefaultMaven.java:307)
	at org.apache.maven.DefaultMaven.doExecute(DefaultMaven.java:193)
	at org.apache.maven.DefaultMaven.execute(DefaultMaven.java:106)
	at org.jvnet.hudson.maven3.launcher.Maven32Launcher.main(Maven32Launcher.java:132)
	at sun.reflect.NativeMethodAccessorImpl.invoke0(Native Method)
	at sun.reflect.NativeMethodAccessorImpl.invoke(NativeMethodAccessorImpl.java:57)
	at sun.reflect.DelegatingMethodAccessorImpl.invoke(DelegatingMethodAccessorImpl.java:43)
	at java.lang.reflect.Method.invoke(Method.java:606)
	at org.codehaus.plexus.classworlds.launcher.Launcher.launchStandard(Launcher.java:330)
	at org.codehaus.plexus.classworlds.launcher.Launcher.launch(Launcher.java:238)
	at jenkins.maven3.agent.Maven32Main.launch(Maven32Main.java:186)
	at sun.reflect.NativeMethodAccessorImpl.invoke0(Native Method)
	at sun.reflect.NativeMethodAccessorImpl.invoke(NativeMethodAccessorImpl.java:57)
	at sun.reflect.DelegatingMethodAccessorImpl.invoke(DelegatingMethodAccessorImpl.java:43)
	at java.lang.reflect.Method.invoke(Method.java:606)
	at hudson.maven.Maven3Builder.call(Maven3Builder.java:136)
	at hudson.maven.Maven3Builder.call(Maven3Builder.java:71)
	at hudson.remoting.UserRequest.perform(UserRequest.java:153)
	at hudson.remoting.UserRequest.perform(UserRequest.java:50)
	at hudson.remoting.Request$2.run(Request.java:332)
	at hudson.remoting.InterceptingExecutorService$1.call(InterceptingExecutorService.java:68)
	at java.util.concurrent.FutureTask.run(FutureTask.java:262)
	at java.util.concurrent.ThreadPoolExecutor.runWorker(ThreadPoolExecutor.java:1145)
	at java.util.concurrent.ThreadPoolExecutor$Worker.run(ThreadPoolExecutor.java:615)
	at java.lang.Thread.run(Thread.java:745)
Caused by: org.apache.maven.plugin.MojoExecutionException: ExecutionException; nested exception
is java.util.concurrent.ExecutionException: java.lang.RuntimeException: The forked VM terminated
without saying properly goodbye. VM crash or System.exit called ?
	at org.apache.maven.plugin.surefire.SurefirePlugin.assertNoException(SurefirePlugin.java:160)
	at org.apache.maven.plugin.surefire.SurefirePlugin.handleSummary(SurefirePlugin.java:149)
	at org.apache.maven.plugin.surefire.AbstractSurefireMojo.executeAfterPreconditionsChecked(AbstractSurefireMojo.java:650)
	at org.apache.maven.plugin.surefire.AbstractSurefireMojo.execute(AbstractSurefireMojo.java:586)
	at org.apache.maven.plugin.DefaultBuildPluginManager.executeMojo(DefaultBuildPluginManager.java:134)
	at org.apache.maven.lifecycle.internal.MojoExecutor.execute(MojoExecutor.java:208)
	... 31 more
Caused by: org.apache.maven.surefire.booter.SurefireBooterForkException: ExecutionException;
nested exception is java.util.concurrent.ExecutionException: java.lang.RuntimeException: The
forked VM terminated without saying properly goodbye. VM crash or System.exit called ?
	at org.apache.maven.plugin.surefire.booterclient.ForkStarter.runSuitesForkPerTestSet(ForkStarter.java:192)
	at org.apache.maven.plugin.surefire.booterclient.ForkStarter.run(ForkStarter.java:121)
	at org.apache.maven.plugin.surefire.AbstractSurefireMojo.executeProvider(AbstractSurefireMojo.java:740)
	at org.apache.maven.plugin.surefire.AbstractSurefireMojo.executeAllProviders(AbstractSurefireMojo.java:682)
	at org.apache.maven.plugin.surefire.AbstractSurefireMojo.executeAfterPreconditionsChecked(AbstractSurefireMojo.java:648)
	... 34 more
Caused by: java.util.concurrent.ExecutionException: java.lang.RuntimeException: The forked
VM terminated without saying properly goodbye. VM crash or System.exit called ?
	at java.util.concurrent.FutureTask.report(FutureTask.java:122)
	at java.util.concurrent.FutureTask.get(FutureTask.java:188)
	at org.apache.maven.plugin.surefire.booterclient.ForkStarter.runSuitesForkPerTestSet(ForkStarter.java:176)
	... 38 more
Caused by: java.lang.RuntimeException: The forked VM terminated without saying properly goodbye.
VM crash or System.exit called ?
	at org.apache.maven.plugin.surefire.booterclient.output.ForkClient.close(ForkClient.java:257)
	at org.apache.maven.plugin.surefire.booterclient.ForkStarter.fork(ForkStarter.java:301)
	at org.apache.maven.plugin.surefire.booterclient.ForkStarter.access$100(ForkStarter.java:75)
	at org.apache.maven.plugin.surefire.booterclient.ForkStarter$1.call(ForkStarter.java:163)
	at org.apache.maven.plugin.surefire.booterclient.ForkStarter$1.call(ForkStarter.java:160)
	... 4 more
[ERROR] 
[ERROR] Re-run Maven using the -X switch to enable full debug logging.
[ERROR] 
[ERROR] For more information about the errors and possible solutions, please read the following
articles:
[ERROR] [Help 1] http://cwiki.apache.org/confluence/display/MAVEN/MojoExecutionException
[ERROR] 
[ERROR] After correcting the problems, you can resume the build with the command
[ERROR]   mvn <goals> -rf :flume-spillable-memory-channel
[JENKINS] Archiving <https://builds.apache.org/job/Flume-trunk-hbase-1/ws/flume-ng-legacy-sources/pom.xml>
to org.apache.flume/flume-ng-legacy-sources/1.8.0-SNAPSHOT/flume-ng-legacy-sources-1.8.0-SNAPSHOT.pom
[JENKINS] Archiving <https://builds.apache.org/job/Flume-trunk-hbase-1/ws/flume-ng-channels/flume-file-channel/pom.xml>
to org.apache.flume.flume-ng-channels/flume-file-channel/1.8.0-SNAPSHOT/flume-file-channel-1.8.0-SNAPSHOT.pom
[JENKINS] Archiving <https://builds.apache.org/job/Flume-trunk-hbase-1/ws/flume-ng-channels/flume-file-channel/target/flume-file-channel-1.8.0-SNAPSHOT.jar>
to org.apache.flume.flume-ng-channels/flume-file-channel/1.8.0-SNAPSHOT/flume-file-channel-1.8.0-SNAPSHOT.jar
[JENKINS] Archiving <https://builds.apache.org/job/Flume-trunk-hbase-1/ws/flume-ng-sources/flume-twitter-source/pom.xml>
to org.apache.flume.flume-ng-sources/flume-twitter-source/1.8.0-SNAPSHOT/flume-twitter-source-1.8.0-SNAPSHOT.pom
[JENKINS] Archiving <https://builds.apache.org/job/Flume-trunk-hbase-1/ws/flume-ng-sources/flume-twitter-source/target/flume-twitter-source-1.8.0-SNAPSHOT.jar>
to org.apache.flume.flume-ng-sources/flume-twitter-source/1.8.0-SNAPSHOT/flume-twitter-source-1.8.0-SNAPSHOT.jar
[JENKINS] Archiving <https://builds.apache.org/job/Flume-trunk-hbase-1/ws/flume-ng-sinks/flume-ng-elasticsearch-sink/pom.xml>
to org.apache.flume.flume-ng-sinks/flume-ng-elasticsearch-sink/1.8.0-SNAPSHOT/flume-ng-elasticsearch-sink-1.8.0-SNAPSHOT.pom
[JENKINS] Archiving <https://builds.apache.org/job/Flume-trunk-hbase-1/ws/flume-ng-sinks/flume-ng-elasticsearch-sink/target/flume-ng-elasticsearch-sink-1.8.0-SNAPSHOT.jar>
to org.apache.flume.flume-ng-sinks/flume-ng-elasticsearch-sink/1.8.0-SNAPSHOT/flume-ng-elasticsearch-sink-1.8.0-SNAPSHOT.jar
[JENKINS] Archiving <https://builds.apache.org/job/Flume-trunk-hbase-1/ws/flume-ng-sinks/flume-hive-sink/pom.xml>
to org.apache.flume.flume-ng-sinks/flume-hive-sink/1.8.0-SNAPSHOT/flume-hive-sink-1.8.0-SNAPSHOT.pom
[JENKINS] Archiving <https://builds.apache.org/job/Flume-trunk-hbase-1/ws/flume-ng-sinks/flume-hive-sink/target/flume-hive-sink-1.8.0-SNAPSHOT.jar>
to org.apache.flume.flume-ng-sinks/flume-hive-sink/1.8.0-SNAPSHOT/flume-hive-sink-1.8.0-SNAPSHOT.jar
[JENKINS] Archiving <https://builds.apache.org/job/Flume-trunk-hbase-1/ws/pom.xml> to
org.apache.flume/flume-parent/1.8.0-SNAPSHOT/flume-parent-1.8.0-SNAPSHOT.pom
[JENKINS] Archiving <https://builds.apache.org/job/Flume-trunk-hbase-1/ws/target/flume-parent-1.8.0-SNAPSHOT-site.xml>
to org.apache.flume/flume-parent/1.8.0-SNAPSHOT/flume-parent-1.8.0-SNAPSHOT-site.xml
Compressed 47.19 KB of artifacts by 67.8% relative to #214
[JENKINS] Archiving <https://builds.apache.org/job/Flume-trunk-hbase-1/ws/flume-ng-sinks/flume-hdfs-sink/pom.xml>
to org.apache.flume.flume-ng-sinks/flume-hdfs-sink/1.8.0-SNAPSHOT/flume-hdfs-sink-1.8.0-SNAPSHOT.pom
[JENKINS] Archiving <https://builds.apache.org/job/Flume-trunk-hbase-1/ws/flume-ng-sinks/flume-hdfs-sink/target/flume-hdfs-sink-1.8.0-SNAPSHOT.jar>
to org.apache.flume.flume-ng-sinks/flume-hdfs-sink/1.8.0-SNAPSHOT/flume-hdfs-sink-1.8.0-SNAPSHOT.jar
[JENKINS] Archiving <https://builds.apache.org/job/Flume-trunk-hbase-1/ws/flume-ng-configuration/pom.xml>
to org.apache.flume/flume-ng-configuration/1.8.0-SNAPSHOT/flume-ng-configuration-1.8.0-SNAPSHOT.pom
[JENKINS] Archiving <https://builds.apache.org/job/Flume-trunk-hbase-1/ws/flume-ng-configuration/target/flume-ng-configuration-1.8.0-SNAPSHOT.jar>
to org.apache.flume/flume-ng-configuration/1.8.0-SNAPSHOT/flume-ng-configuration-1.8.0-SNAPSHOT.jar
[JENKINS] Archiving <https://builds.apache.org/job/Flume-trunk-hbase-1/ws/flume-ng-channels/flume-kafka-channel/pom.xml>
to org.apache.flume.flume-ng-channels/flume-kafka-channel/1.8.0-SNAPSHOT/flume-kafka-channel-1.8.0-SNAPSHOT.pom
[JENKINS] Archiving <https://builds.apache.org/job/Flume-trunk-hbase-1/ws/flume-ng-clients/pom.xml>
to org.apache.flume/flume-ng-clients/1.8.0-SNAPSHOT/flume-ng-clients-1.8.0-SNAPSHOT.pom
[JENKINS] Archiving <https://builds.apache.org/job/Flume-trunk-hbase-1/ws/flume-shared/pom.xml>
to org.apache.flume/flume-shared/1.8.0-SNAPSHOT/flume-shared-1.8.0-SNAPSHOT.pom
[JENKINS] Archiving <https://builds.apache.org/job/Flume-trunk-hbase-1/ws/flume-ng-tests/pom.xml>
to org.apache.flume/flume-ng-tests/1.8.0-SNAPSHOT/flume-ng-tests-1.8.0-SNAPSHOT.pom
[JENKINS] Archiving <https://builds.apache.org/job/Flume-trunk-hbase-1/ws/flume-ng-tests/target/flume-ng-tests-1.8.0-SNAPSHOT.jar>
to org.apache.flume/flume-ng-tests/1.8.0-SNAPSHOT/flume-ng-tests-1.8.0-SNAPSHOT.jar
[JENKINS] Archiving <https://builds.apache.org/job/Flume-trunk-hbase-1/ws/flume-ng-sinks/flume-ng-hbase-sink/pom.xml>
to org.apache.flume.flume-ng-sinks/flume-ng-hbase-sink/1.8.0-SNAPSHOT/flume-ng-hbase-sink-1.8.0-SNAPSHOT.pom
[JENKINS] Archiving <https://builds.apache.org/job/Flume-trunk-hbase-1/ws/flume-ng-sinks/flume-ng-hbase-sink/target/flume-ng-hbase-sink-1.8.0-SNAPSHOT.jar>
to org.apache.flume.flume-ng-sinks/flume-ng-hbase-sink/1.8.0-SNAPSHOT/flume-ng-hbase-sink-1.8.0-SNAPSHOT.jar
[JENKINS] Archiving <https://builds.apache.org/job/Flume-trunk-hbase-1/ws/flume-ng-channels/flume-spillable-memory-channel/pom.xml>
to org.apache.flume.flume-ng-channels/flume-spillable-memory-channel/1.8.0-SNAPSHOT/flume-spillable-memory-channel-1.8.0-SNAPSHOT.pom
[JENKINS] Archiving <https://builds.apache.org/job/Flume-trunk-hbase-1/ws/flume-ng-legacy-sources/flume-thrift-source/pom.xml>
to org.apache.flume.flume-ng-legacy-sources/flume-thrift-source/1.8.0-SNAPSHOT/flume-thrift-source-1.8.0-SNAPSHOT.pom
[JENKINS] Archiving <https://builds.apache.org/job/Flume-trunk-hbase-1/ws/flume-ng-legacy-sources/flume-thrift-source/target/flume-thrift-source-1.8.0-SNAPSHOT.jar>
to org.apache.flume.flume-ng-legacy-sources/flume-thrift-source/1.8.0-SNAPSHOT/flume-thrift-source-1.8.0-SNAPSHOT.jar
[JENKINS] Archiving <https://builds.apache.org/job/Flume-trunk-hbase-1/ws/flume-ng-core/pom.xml>
to org.apache.flume/flume-ng-core/1.8.0-SNAPSHOT/flume-ng-core-1.8.0-SNAPSHOT.pom
[JENKINS] Archiving <https://builds.apache.org/job/Flume-trunk-hbase-1/ws/flume-ng-core/target/flume-ng-core-1.8.0-SNAPSHOT.jar>
to org.apache.flume/flume-ng-core/1.8.0-SNAPSHOT/flume-ng-core-1.8.0-SNAPSHOT.jar
[JENKINS] Archiving <https://builds.apache.org/job/Flume-trunk-hbase-1/ws/flume-tools/pom.xml>
to org.apache.flume/flume-tools/1.8.0-SNAPSHOT/flume-tools-1.8.0-SNAPSHOT.pom
[JENKINS] Archiving <https://builds.apache.org/job/Flume-trunk-hbase-1/ws/flume-tools/target/flume-tools-1.8.0-SNAPSHOT.jar>
to org.apache.flume/flume-tools/1.8.0-SNAPSHOT/flume-tools-1.8.0-SNAPSHOT.jar
[JENKINS] Archiving <https://builds.apache.org/job/Flume-trunk-hbase-1/ws/flume-ng-dist/pom.xml>
to org.apache.flume/flume-ng-dist/1.8.0-SNAPSHOT/flume-ng-dist-1.8.0-SNAPSHOT.pom
[JENKINS] Archiving <https://builds.apache.org/job/Flume-trunk-hbase-1/ws/flume-ng-sinks/flume-ng-kafka-sink/pom.xml>
to org.apache.flume.flume-ng-sinks/flume-ng-kafka-sink/1.8.0-SNAPSHOT/flume-ng-kafka-sink-1.8.0-SNAPSHOT.pom
[JENKINS] Archiving <https://builds.apache.org/job/Flume-trunk-hbase-1/ws/flume-ng-sources/flume-jms-source/pom.xml>
to org.apache.flume.flume-ng-sources/flume-jms-source/1.8.0-SNAPSHOT/flume-jms-source-1.8.0-SNAPSHOT.pom
[JENKINS] Archiving <https://builds.apache.org/job/Flume-trunk-hbase-1/ws/flume-ng-sources/flume-jms-source/target/flume-jms-source-1.8.0-SNAPSHOT.jar>
to org.apache.flume.flume-ng-sources/flume-jms-source/1.8.0-SNAPSHOT/flume-jms-source-1.8.0-SNAPSHOT.jar
[JENKINS] Archiving <https://builds.apache.org/job/Flume-trunk-hbase-1/ws/flume-shared/flume-shared-kafka-test/pom.xml>
to org.apache.flume.flume-shared/flume-shared-kafka-test/1.8.0-SNAPSHOT/flume-shared-kafka-test-1.8.0-SNAPSHOT.pom
[JENKINS] Archiving <https://builds.apache.org/job/Flume-trunk-hbase-1/ws/flume-shared/flume-shared-kafka-test/target/flume-shared-kafka-test-1.8.0-SNAPSHOT.jar>
to org.apache.flume.flume-shared/flume-shared-kafka-test/1.8.0-SNAPSHOT/flume-shared-kafka-test-1.8.0-SNAPSHOT.jar
[JENKINS] Archiving <https://builds.apache.org/job/Flume-trunk-hbase-1/ws/flume-shared/flume-shared-kafka-test/target/flume-shared-kafka-test-1.8.0-SNAPSHOT-tests.jar>
to org.apache.flume.flume-shared/flume-shared-kafka-test/1.8.0-SNAPSHOT/flume-shared-kafka-test-1.8.0-SNAPSHOT-tests.jar
[JENKINS] Archiving <https://builds.apache.org/job/Flume-trunk-hbase-1/ws/flume-ng-legacy-sources/flume-avro-source/pom.xml>
to org.apache.flume.flume-ng-legacy-sources/flume-avro-source/1.8.0-SNAPSHOT/flume-avro-source-1.8.0-SNAPSHOT.pom
[JENKINS] Archiving <https://builds.apache.org/job/Flume-trunk-hbase-1/ws/flume-ng-legacy-sources/flume-avro-source/target/flume-avro-source-1.8.0-SNAPSHOT.jar>
to org.apache.flume.flume-ng-legacy-sources/flume-avro-source/1.8.0-SNAPSHOT/flume-avro-source-1.8.0-SNAPSHOT.jar
[JENKINS] Archiving <https://builds.apache.org/job/Flume-trunk-hbase-1/ws/flume-ng-sources/flume-kafka-source/pom.xml>
to org.apache.flume.flume-ng-sources/flume-kafka-source/1.8.0-SNAPSHOT/flume-kafka-source-1.8.0-SNAPSHOT.pom
[JENKINS] Archiving <https://builds.apache.org/job/Flume-trunk-hbase-1/ws/flume-ng-sources/flume-kafka-source/target/flume-kafka-source-1.8.0-SNAPSHOT.jar>
to org.apache.flume.flume-ng-sources/flume-kafka-source/1.8.0-SNAPSHOT/flume-kafka-source-1.8.0-SNAPSHOT.jar
[JENKINS] Archiving <https://builds.apache.org/job/Flume-trunk-hbase-1/ws/flume-checkstyle/pom.xml>
to org.apache.flume/flume-checkstyle/1.8.0-SNAPSHOT/flume-checkstyle-1.8.0-SNAPSHOT.pom
[JENKINS] Archiving <https://builds.apache.org/job/Flume-trunk-hbase-1/ws/flume-checkstyle/target/flume-checkstyle-1.8.0-SNAPSHOT.jar>
to org.apache.flume/flume-checkstyle/1.8.0-SNAPSHOT/flume-checkstyle-1.8.0-SNAPSHOT.jar
[JENKINS] Archiving <https://builds.apache.org/job/Flume-trunk-hbase-1/ws/flume-ng-auth/pom.xml>
to org.apache.flume/flume-ng-auth/1.8.0-SNAPSHOT/flume-ng-auth-1.8.0-SNAPSHOT.pom
[JENKINS] Archiving <https://builds.apache.org/job/Flume-trunk-hbase-1/ws/flume-ng-auth/target/flume-ng-auth-1.8.0-SNAPSHOT.jar>
to org.apache.flume/flume-ng-auth/1.8.0-SNAPSHOT/flume-ng-auth-1.8.0-SNAPSHOT.jar
[JENKINS] Archiving <https://builds.apache.org/job/Flume-trunk-hbase-1/ws/flume-ng-sinks/flume-irc-sink/pom.xml>
to org.apache.flume.flume-ng-sinks/flume-irc-sink/1.8.0-SNAPSHOT/flume-irc-sink-1.8.0-SNAPSHOT.pom
[JENKINS] Archiving <https://builds.apache.org/job/Flume-trunk-hbase-1/ws/flume-ng-sinks/flume-irc-sink/target/flume-irc-sink-1.8.0-SNAPSHOT.jar>
to org.apache.flume.flume-ng-sinks/flume-irc-sink/1.8.0-SNAPSHOT/flume-irc-sink-1.8.0-SNAPSHOT.jar
[JENKINS] Archiving <https://builds.apache.org/job/Flume-trunk-hbase-1/ws/flume-ng-sources/flume-taildir-source/pom.xml>
to org.apache.flume.flume-ng-sources/flume-taildir-source/1.8.0-SNAPSHOT/flume-taildir-source-1.8.0-SNAPSHOT.pom
[JENKINS] Archiving <https://builds.apache.org/job/Flume-trunk-hbase-1/ws/flume-ng-sources/flume-taildir-source/target/flume-taildir-source-1.8.0-SNAPSHOT.jar>
to org.apache.flume.flume-ng-sources/flume-taildir-source/1.8.0-SNAPSHOT/flume-taildir-source-1.8.0-SNAPSHOT.jar
[JENKINS] Archiving <https://builds.apache.org/job/Flume-trunk-hbase-1/ws/flume-ng-channels/flume-jdbc-channel/pom.xml>
to org.apache.flume.flume-ng-channels/flume-jdbc-channel/1.8.0-SNAPSHOT/flume-jdbc-channel-1.8.0-SNAPSHOT.pom
[JENKINS] Archiving <https://builds.apache.org/job/Flume-trunk-hbase-1/ws/flume-ng-channels/flume-jdbc-channel/target/flume-jdbc-channel-1.8.0-SNAPSHOT.jar>
to org.apache.flume.flume-ng-channels/flume-jdbc-channel/1.8.0-SNAPSHOT/flume-jdbc-channel-1.8.0-SNAPSHOT.jar
[JENKINS] Archiving <https://builds.apache.org/job/Flume-trunk-hbase-1/ws/flume-ng-clients/flume-ng-log4jappender/pom.xml>
to org.apache.flume.flume-ng-clients/flume-ng-log4jappender/1.8.0-SNAPSHOT/flume-ng-log4jappender-1.8.0-SNAPSHOT.pom
[JENKINS] Archiving <https://builds.apache.org/job/Flume-trunk-hbase-1/ws/flume-ng-clients/flume-ng-log4jappender/target/flume-ng-log4jappender-1.8.0-SNAPSHOT.jar>
to org.apache.flume.flume-ng-clients/flume-ng-log4jappender/1.8.0-SNAPSHOT/flume-ng-log4jappender-1.8.0-SNAPSHOT.jar
[JENKINS] Archiving <https://builds.apache.org/job/Flume-trunk-hbase-1/ws/flume-ng-clients/flume-ng-log4jappender/target/flume-ng-log4jappender-1.8.0-SNAPSHOT-jar-with-dependencies.jar>
to org.apache.flume.flume-ng-clients/flume-ng-log4jappender/1.8.0-SNAPSHOT/flume-ng-log4jappender-1.8.0-SNAPSHOT-jar-with-dependencies.jar
Compressed 7.10 MB of artifacts by 95.9% relative to #214
[JENKINS] Archiving <https://builds.apache.org/job/Flume-trunk-hbase-1/ws/flume-ng-sinks/pom.xml>
to org.apache.flume/flume-ng-sinks/1.8.0-SNAPSHOT/flume-ng-sinks-1.8.0-SNAPSHOT.pom
[JENKINS] Archiving <https://builds.apache.org/job/Flume-trunk-hbase-1/ws/flume-ng-sources/pom.xml>
to org.apache.flume/flume-ng-sources/1.8.0-SNAPSHOT/flume-ng-sources-1.8.0-SNAPSHOT.pom
[JENKINS] Archiving <https://builds.apache.org/job/Flume-trunk-hbase-1/ws/flume-ng-node/pom.xml>
to org.apache.flume/flume-ng-node/1.8.0-SNAPSHOT/flume-ng-node-1.8.0-SNAPSHOT.pom
[JENKINS] Archiving <https://builds.apache.org/job/Flume-trunk-hbase-1/ws/flume-ng-channels/pom.xml>
to org.apache.flume/flume-ng-channels/1.8.0-SNAPSHOT/flume-ng-channels-1.8.0-SNAPSHOT.pom
[JENKINS] Archiving <https://builds.apache.org/job/Flume-trunk-hbase-1/ws/flume-ng-embedded-agent/pom.xml>
to org.apache.flume/flume-ng-embedded-agent/1.8.0-SNAPSHOT/flume-ng-embedded-agent-1.8.0-SNAPSHOT.pom
[JENKINS] Archiving <https://builds.apache.org/job/Flume-trunk-hbase-1/ws/flume-ng-sinks/flume-dataset-sink/pom.xml>
to org.apache.flume.flume-ng-sinks/flume-dataset-sink/1.8.0-SNAPSHOT/flume-dataset-sink-1.8.0-SNAPSHOT.pom
[JENKINS] Archiving <https://builds.apache.org/job/Flume-trunk-hbase-1/ws/flume-ng-sinks/flume-dataset-sink/target/flume-dataset-sink-1.8.0-SNAPSHOT.jar>
to org.apache.flume.flume-ng-sinks/flume-dataset-sink/1.8.0-SNAPSHOT/flume-dataset-sink-1.8.0-SNAPSHOT.jar
[JENKINS] Archiving <https://builds.apache.org/job/Flume-trunk-hbase-1/ws/flume-ng-sinks/flume-ng-morphline-solr-sink/pom.xml>
to org.apache.flume.flume-ng-sinks/flume-ng-morphline-solr-sink/1.8.0-SNAPSHOT/flume-ng-morphline-solr-sink-1.8.0-SNAPSHOT.pom
[JENKINS] Archiving <https://builds.apache.org/job/Flume-trunk-hbase-1/ws/flume-ng-sinks/flume-ng-morphline-solr-sink/target/flume-ng-morphline-solr-sink-1.8.0-SNAPSHOT.jar>
to org.apache.flume.flume-ng-sinks/flume-ng-morphline-solr-sink/1.8.0-SNAPSHOT/flume-ng-morphline-solr-sink-1.8.0-SNAPSHOT.jar
[JENKINS] Archiving <https://builds.apache.org/job/Flume-trunk-hbase-1/ws/flume-ng-sdk/pom.xml>
to org.apache.flume/flume-ng-sdk/1.8.0-SNAPSHOT/flume-ng-sdk-1.8.0-SNAPSHOT.pom
[JENKINS] Archiving <https://builds.apache.org/job/Flume-trunk-hbase-1/ws/flume-ng-sdk/target/flume-ng-sdk-1.8.0-SNAPSHOT.jar>
to org.apache.flume/flume-ng-sdk/1.8.0-SNAPSHOT/flume-ng-sdk-1.8.0-SNAPSHOT.jar
[JENKINS] Archiving <https://builds.apache.org/job/Flume-trunk-hbase-1/ws/flume-ng-sdk/target/flume-ng-sdk-1.8.0-SNAPSHOT-tests.jar>
to org.apache.flume/flume-ng-sdk/1.8.0-SNAPSHOT/flume-ng-sdk-1.8.0-SNAPSHOT-tests.jar
[JENKINS] Archiving <https://builds.apache.org/job/Flume-trunk-hbase-1/ws/flume-ng-sources/flume-scribe-source/pom.xml>
to org.apache.flume.flume-ng-sources/flume-scribe-source/1.8.0-SNAPSHOT/flume-scribe-source-1.8.0-SNAPSHOT.pom
[JENKINS] Archiving <https://builds.apache.org/job/Flume-trunk-hbase-1/ws/flume-ng-sources/flume-scribe-source/target/flume-scribe-source-1.8.0-SNAPSHOT.jar>
to org.apache.flume.flume-ng-sources/flume-scribe-source/1.8.0-SNAPSHOT/flume-scribe-source-1.8.0-SNAPSHOT.jar
channel stopped
[WARNINGS] Skipping publisher since build result is FAILURE
Archiving artifacts

Mime
View raw message