flume-dev mailing list archives

Site index · List index
Message view « Date » · « Thread »
Top « Date » · « Thread »
From Apache Jenkins Server <jenk...@builds.apache.org>
Subject Build failed in Jenkins: Flume-trunk-hbase-1 #209
Date Mon, 10 Oct 2016 19:50:46 GMT
See <https://builds.apache.org/job/Flume-trunk-hbase-1/209/changes>

Changes:

[mpercy] FLUME-2999. Kafka channel and sink should enable statically assigned

------------------------------------------
[...truncated 7008 lines...]
  TestSyslogSource.tearDown:63 »  Failed to locate tar-ball distribution. Please...
  TestSyslogSource.testRemoveFields:82 »  Failed to locate tar-ball distribution...
  TestSyslogSource.tearDown:63 »  Failed to locate tar-ball distribution. Please...
  TestSyslogSource.testKeepTimestampAndHostname:92 »  Failed to locate tar-ball ...
  TestSyslogSource.tearDown:63 »  Failed to locate tar-ball distribution. Please...
  TestRpcClient.setUp:36 »  Failed to locate tar-ball distribution. Please speci...
  TestRpcClient.tearDown:42 »  Failed to locate tar-ball distribution. Please sp...
  TestFileChannel.testInOut:117 »  Failed to locate tar-ball distribution. Pleas...
  TestFileChannel.tearDown:95 »  Failed to locate tar-ball distribution. Please ...
  TestRpcClientCommunicationFailure.testFailure:61 »  Failed to locate tar-ball ...

Tests run: 19, Failures: 0, Errors: 19, Skipped: 0

[ERROR] There are test failures.

Please refer to <https://builds.apache.org/job/Flume-trunk-hbase-1/ws/flume-ng-tests/target/surefire-reports>
for the individual test results.
[JENKINS] Recording test results
[INFO] 
[INFO] --- maven-jar-plugin:3.0.0:jar (default-jar) @ flume-ng-tests ---
[INFO] Building jar: <https://builds.apache.org/job/Flume-trunk-hbase-1/ws/flume-ng-tests/target/flume-ng-tests-1.7.0-SNAPSHOT.jar>
[INFO] 
[INFO] --- maven-site-plugin:3.3:attach-descriptor (attach-descriptor) @ flume-ng-tests ---
[INFO] 
[INFO] --- apache-rat-plugin:0.11:check (verify.rat) @ flume-ng-tests ---
[INFO] 51 implicit excludes (use -debug for more details).
[INFO] Exclude: **/.idea/
[INFO] Exclude: **/*.iml
[INFO] Exclude: **/nb-configuration.xml
[INFO] Exclude: .git/
[INFO] Exclude: patchprocess/
[INFO] Exclude: .gitignore
[INFO] Exclude: .repository/
[INFO] Exclude: **/*.diff
[INFO] Exclude: **/*.patch
[INFO] Exclude: **/*.avsc
[INFO] Exclude: **/*.avro
[INFO] Exclude: **/docs/**
[INFO] Exclude: **/test/resources/**
[INFO] Exclude: **/.settings/*
[INFO] Exclude: **/.classpath
[INFO] Exclude: **/.project
[INFO] Exclude: **/target/**
[INFO] Exclude: **/derby.log
[INFO] Exclude: **/metastore_db/
[INFO] 9 resources included (use -debug for more details)
[INFO] Rat check: Summary of files. Unapproved: 0 unknown: 0 generated: 0 approved: 9 licence.
[INFO] 
[INFO] --- maven-checkstyle-plugin:2.17:check (verify) @ flume-ng-tests ---
[INFO] 
[INFO] --- maven-install-plugin:2.5.2:install (default-install) @ flume-ng-tests ---
[INFO] Installing <https://builds.apache.org/job/Flume-trunk-hbase-1/ws/flume-ng-tests/target/flume-ng-tests-1.7.0-SNAPSHOT.jar>
to <https://builds.apache.org/job/Flume-trunk-hbase-1/ws/.repository/org/apache/flume/flume-ng-tests/1.7.0-SNAPSHOT/flume-ng-tests-1.7.0-SNAPSHOT.jar>
[INFO] Installing <https://builds.apache.org/job/Flume-trunk-hbase-1/ws/flume-ng-tests/pom.xml>
to <https://builds.apache.org/job/Flume-trunk-hbase-1/ws/.repository/org/apache/flume/flume-ng-tests/1.7.0-SNAPSHOT/flume-ng-tests-1.7.0-SNAPSHOT.pom>
[INFO] ------------------------------------------------------------------------
[INFO] Reactor Summary:
[INFO] 
[INFO] Flume checkstyle project ........................... SUCCESS [ 16.771 s]
[INFO] Apache Flume ....................................... SUCCESS [ 11.552 s]
[INFO] Flume NG SDK ....................................... SUCCESS [02:34 min]
[INFO] Flume NG Configuration ............................. SUCCESS [ 12.940 s]
[INFO] Flume Auth ......................................... SUCCESS [ 22.007 s]
[INFO] Flume NG Core ...................................... SUCCESS [09:06 min]
[INFO] Flume NG Sinks ..................................... SUCCESS [  2.175 s]
[INFO] Flume NG HDFS Sink ................................. SUCCESS [02:29 min]
[INFO] Flume NG IRC Sink .................................. SUCCESS [  9.213 s]
[INFO] Flume NG Channels .................................. SUCCESS [  4.454 s]
[INFO] Flume NG JDBC channel .............................. SUCCESS [05:44 min]
[INFO] Flume NG file-based channel ........................ SUCCESS [05:50 min]
[INFO] Flume NG Spillable Memory channel .................. SUCCESS [02:03 min]
[INFO] Flume NG Node ...................................... SUCCESS [ 58.168 s]
[INFO] Flume NG Embedded Agent ............................ SUCCESS [ 33.826 s]
[INFO] Flume NG HBase Sink ................................ SUCCESS [05:15 min]
[INFO] Flume NG ElasticSearch Sink ........................ SUCCESS [01:17 min]
[INFO] Flume NG Morphline Solr Sink ....................... SUCCESS [ 41.784 s]
[INFO] Flume Shared Utils ................................. SUCCESS [  2.883 s]
[INFO] Flume Shared Kafka Test Utils ...................... SUCCESS [  6.706 s]
[INFO] Flume Kafka Sink ................................... SUCCESS [ 47.861 s]
[INFO] Flume NG Kite Dataset Sink ......................... SUCCESS [ 27.748 s]
[INFO] Flume NG Hive Sink ................................. SUCCESS [01:19 min]
[INFO] Flume Sources ...................................... SUCCESS [  2.856 s]
[INFO] Flume Scribe Source ................................ SUCCESS [ 16.872 s]
[INFO] Flume JMS Source ................................... SUCCESS [ 25.537 s]
[INFO] Flume Twitter Source ............................... SUCCESS [  9.465 s]
[INFO] Flume Kafka Source ................................. FAILURE [ 42.991 s]
[INFO] Flume Taildir Source ............................... SUCCESS [ 27.809 s]
[INFO] flume-kafka-channel ................................ SUCCESS [03:18 min]
[INFO] Flume legacy Sources ............................... SUCCESS [  3.740 s]
[INFO] Flume legacy Avro source ........................... SUCCESS [ 11.946 s]
[INFO] Flume legacy Thrift Source ......................... SUCCESS [  9.604 s]
[INFO] Flume NG Clients ................................... SUCCESS [  3.091 s]
[INFO] Flume NG Log4j Appender ............................ SUCCESS [ 39.107 s]
[INFO] Flume NG Tools ..................................... SUCCESS [ 10.513 s]
[INFO] Flume NG distribution .............................. SKIPPED
[INFO] Flume NG Integration Tests ......................... SUCCESS [ 11.347 s]
[INFO] ------------------------------------------------------------------------
[INFO] BUILD FAILURE
[INFO] ------------------------------------------------------------------------
[INFO] Total time: 51:16 min
[INFO] Finished at: 2016-10-10T19:47:09+00:00
[INFO] Final Memory: 302M/692M
[INFO] ------------------------------------------------------------------------
Waiting for Jenkins to finish collecting data
[ERROR] Failed to execute goal org.apache.maven.plugins:maven-surefire-plugin:2.12.3:test
(default-test) on project flume-kafka-source: ExecutionException; nested exception is java.util.concurrent.ExecutionException:
java.lang.RuntimeException: The forked VM terminated without saying properly goodbye. VM crash
or System.exit called ? -> [Help 1]
org.apache.maven.lifecycle.LifecycleExecutionException: Failed to execute goal org.apache.maven.plugins:maven-surefire-plugin:2.12.3:test
(default-test) on project flume-kafka-source: ExecutionException; nested exception is java.util.concurrent.ExecutionException:
java.lang.RuntimeException: The forked VM terminated without saying properly goodbye. VM crash
or System.exit called ?
	at org.apache.maven.lifecycle.internal.MojoExecutor.execute(MojoExecutor.java:216)
	at org.apache.maven.lifecycle.internal.MojoExecutor.execute(MojoExecutor.java:153)
	at org.apache.maven.lifecycle.internal.MojoExecutor.execute(MojoExecutor.java:145)
	at org.apache.maven.lifecycle.internal.LifecycleModuleBuilder.buildProject(LifecycleModuleBuilder.java:116)
	at org.apache.maven.lifecycle.internal.LifecycleModuleBuilder.buildProject(LifecycleModuleBuilder.java:80)
	at org.apache.maven.lifecycle.internal.builder.singlethreaded.SingleThreadedBuilder.build(SingleThreadedBuilder.java:51)
	at org.apache.maven.lifecycle.internal.LifecycleStarter.execute(LifecycleStarter.java:128)
	at org.apache.maven.DefaultMaven.doExecute(DefaultMaven.java:307)
	at org.apache.maven.DefaultMaven.doExecute(DefaultMaven.java:193)
	at org.apache.maven.DefaultMaven.execute(DefaultMaven.java:106)
	at org.jvnet.hudson.maven3.launcher.Maven32Launcher.main(Maven32Launcher.java:132)
	at sun.reflect.NativeMethodAccessorImpl.invoke0(Native Method)
	at sun.reflect.NativeMethodAccessorImpl.invoke(NativeMethodAccessorImpl.java:57)
	at sun.reflect.DelegatingMethodAccessorImpl.invoke(DelegatingMethodAccessorImpl.java:43)
	at java.lang.reflect.Method.invoke(Method.java:606)
	at org.codehaus.plexus.classworlds.launcher.Launcher.launchStandard(Launcher.java:330)
	at org.codehaus.plexus.classworlds.launcher.Launcher.launch(Launcher.java:238)
	at jenkins.maven3.agent.Maven32Main.launch(Maven32Main.java:186)
	at sun.reflect.NativeMethodAccessorImpl.invoke0(Native Method)
	at sun.reflect.NativeMethodAccessorImpl.invoke(NativeMethodAccessorImpl.java:57)
	at sun.reflect.DelegatingMethodAccessorImpl.invoke(DelegatingMethodAccessorImpl.java:43)
	at java.lang.reflect.Method.invoke(Method.java:606)
	at hudson.maven.Maven3Builder.call(Maven3Builder.java:136)
	at hudson.maven.Maven3Builder.call(Maven3Builder.java:71)
	at hudson.remoting.UserRequest.perform(UserRequest.java:153)
	at hudson.remoting.UserRequest.perform(UserRequest.java:50)
	at hudson.remoting.Request$2.run(Request.java:332)
	at hudson.remoting.InterceptingExecutorService$1.call(InterceptingExecutorService.java:68)
	at java.util.concurrent.FutureTask.run(FutureTask.java:262)
	at java.util.concurrent.ThreadPoolExecutor.runWorker(ThreadPoolExecutor.java:1145)
	at java.util.concurrent.ThreadPoolExecutor$Worker.run(ThreadPoolExecutor.java:615)
	at java.lang.Thread.run(Thread.java:745)
Caused by: org.apache.maven.plugin.MojoExecutionException: ExecutionException; nested exception
is java.util.concurrent.ExecutionException: java.lang.RuntimeException: The forked VM terminated
without saying properly goodbye. VM crash or System.exit called ?
	at org.apache.maven.plugin.surefire.SurefirePlugin.assertNoException(SurefirePlugin.java:160)
	at org.apache.maven.plugin.surefire.SurefirePlugin.handleSummary(SurefirePlugin.java:149)
	at org.apache.maven.plugin.surefire.AbstractSurefireMojo.executeAfterPreconditionsChecked(AbstractSurefireMojo.java:650)
	at org.apache.maven.plugin.surefire.AbstractSurefireMojo.execute(AbstractSurefireMojo.java:586)
	at org.apache.maven.plugin.DefaultBuildPluginManager.executeMojo(DefaultBuildPluginManager.java:134)
	at org.apache.maven.lifecycle.internal.MojoExecutor.execute(MojoExecutor.java:208)
	... 31 more
Caused by: org.apache.maven.surefire.booter.SurefireBooterForkException: ExecutionException;
nested exception is java.util.concurrent.ExecutionException: java.lang.RuntimeException: The
forked VM terminated without saying properly goodbye. VM crash or System.exit called ?
	at org.apache.maven.plugin.surefire.booterclient.ForkStarter.runSuitesForkPerTestSet(ForkStarter.java:192)
	at org.apache.maven.plugin.surefire.booterclient.ForkStarter.run(ForkStarter.java:121)
	at org.apache.maven.plugin.surefire.AbstractSurefireMojo.executeProvider(AbstractSurefireMojo.java:740)
	at org.apache.maven.plugin.surefire.AbstractSurefireMojo.executeAllProviders(AbstractSurefireMojo.java:682)
	at org.apache.maven.plugin.surefire.AbstractSurefireMojo.executeAfterPreconditionsChecked(AbstractSurefireMojo.java:648)
	... 34 more
Caused by: java.util.concurrent.ExecutionException: java.lang.RuntimeException: The forked
VM terminated without saying properly goodbye. VM crash or System.exit called ?
	at java.util.concurrent.FutureTask.report(FutureTask.java:122)
	at java.util.concurrent.FutureTask.get(FutureTask.java:188)
	at org.apache.maven.plugin.surefire.booterclient.ForkStarter.runSuitesForkPerTestSet(ForkStarter.java:176)
	... 38 more
Caused by: java.lang.RuntimeException: The forked VM terminated without saying properly goodbye.
VM crash or System.exit called ?
	at org.apache.maven.plugin.surefire.booterclient.output.ForkClient.close(ForkClient.java:257)
	at org.apache.maven.plugin.surefire.booterclient.ForkStarter.fork(ForkStarter.java:301)
	at org.apache.maven.plugin.surefire.booterclient.ForkStarter.access$100(ForkStarter.java:75)
	at org.apache.maven.plugin.surefire.booterclient.ForkStarter$1.call(ForkStarter.java:163)
	at org.apache.maven.plugin.surefire.booterclient.ForkStarter$1.call(ForkStarter.java:160)
	... 4 more
[ERROR] 
[ERROR] Re-run Maven using the -X switch to enable full debug logging.
[ERROR] 
[ERROR] For more information about the errors and possible solutions, please read the following
articles:
[ERROR] [Help 1] http://cwiki.apache.org/confluence/display/MAVEN/MojoExecutionException
[ERROR] 
[ERROR] After correcting the problems, you can resume the build with the command
[ERROR]   mvn <goals> -rf :flume-kafka-source
[JENKINS] Archiving <https://builds.apache.org/job/Flume-trunk-hbase-1/ws/flume-ng-legacy-sources/pom.xml>
to org.apache.flume/flume-ng-legacy-sources/1.7.0-SNAPSHOT/flume-ng-legacy-sources-1.7.0-SNAPSHOT.pom
[JENKINS] Archiving <https://builds.apache.org/job/Flume-trunk-hbase-1/ws/flume-ng-channels/flume-file-channel/pom.xml>
to org.apache.flume.flume-ng-channels/flume-file-channel/1.7.0-SNAPSHOT/flume-file-channel-1.7.0-SNAPSHOT.pom
[JENKINS] Archiving <https://builds.apache.org/job/Flume-trunk-hbase-1/ws/flume-ng-channels/flume-file-channel/target/flume-file-channel-1.7.0-SNAPSHOT.jar>
to org.apache.flume.flume-ng-channels/flume-file-channel/1.7.0-SNAPSHOT/flume-file-channel-1.7.0-SNAPSHOT.jar
[JENKINS] Archiving <https://builds.apache.org/job/Flume-trunk-hbase-1/ws/flume-ng-sources/flume-twitter-source/pom.xml>
to org.apache.flume.flume-ng-sources/flume-twitter-source/1.7.0-SNAPSHOT/flume-twitter-source-1.7.0-SNAPSHOT.pom
[JENKINS] Archiving <https://builds.apache.org/job/Flume-trunk-hbase-1/ws/flume-ng-sources/flume-twitter-source/target/flume-twitter-source-1.7.0-SNAPSHOT.jar>
to org.apache.flume.flume-ng-sources/flume-twitter-source/1.7.0-SNAPSHOT/flume-twitter-source-1.7.0-SNAPSHOT.jar
[JENKINS] Archiving <https://builds.apache.org/job/Flume-trunk-hbase-1/ws/flume-ng-sinks/flume-ng-elasticsearch-sink/pom.xml>
to org.apache.flume.flume-ng-sinks/flume-ng-elasticsearch-sink/1.7.0-SNAPSHOT/flume-ng-elasticsearch-sink-1.7.0-SNAPSHOT.pom
[JENKINS] Archiving <https://builds.apache.org/job/Flume-trunk-hbase-1/ws/flume-ng-sinks/flume-ng-elasticsearch-sink/target/flume-ng-elasticsearch-sink-1.7.0-SNAPSHOT.jar>
to org.apache.flume.flume-ng-sinks/flume-ng-elasticsearch-sink/1.7.0-SNAPSHOT/flume-ng-elasticsearch-sink-1.7.0-SNAPSHOT.jar
[JENKINS] Archiving <https://builds.apache.org/job/Flume-trunk-hbase-1/ws/flume-ng-sinks/flume-hive-sink/pom.xml>
to org.apache.flume.flume-ng-sinks/flume-hive-sink/1.7.0-SNAPSHOT/flume-hive-sink-1.7.0-SNAPSHOT.pom
[JENKINS] Archiving <https://builds.apache.org/job/Flume-trunk-hbase-1/ws/flume-ng-sinks/flume-hive-sink/target/flume-hive-sink-1.7.0-SNAPSHOT.jar>
to org.apache.flume.flume-ng-sinks/flume-hive-sink/1.7.0-SNAPSHOT/flume-hive-sink-1.7.0-SNAPSHOT.jar
[JENKINS] Archiving <https://builds.apache.org/job/Flume-trunk-hbase-1/ws/pom.xml> to
org.apache.flume/flume-parent/1.7.0-SNAPSHOT/flume-parent-1.7.0-SNAPSHOT.pom
[JENKINS] Archiving <https://builds.apache.org/job/Flume-trunk-hbase-1/ws/target/flume-parent-1.7.0-SNAPSHOT-site.xml>
to org.apache.flume/flume-parent/1.7.0-SNAPSHOT/flume-parent-1.7.0-SNAPSHOT-site.xml
[JENKINS] Archiving <https://builds.apache.org/job/Flume-trunk-hbase-1/ws/flume-ng-sinks/flume-hdfs-sink/pom.xml>
to org.apache.flume.flume-ng-sinks/flume-hdfs-sink/1.7.0-SNAPSHOT/flume-hdfs-sink-1.7.0-SNAPSHOT.pom
[JENKINS] Archiving <https://builds.apache.org/job/Flume-trunk-hbase-1/ws/flume-ng-sinks/flume-hdfs-sink/target/flume-hdfs-sink-1.7.0-SNAPSHOT.jar>
to org.apache.flume.flume-ng-sinks/flume-hdfs-sink/1.7.0-SNAPSHOT/flume-hdfs-sink-1.7.0-SNAPSHOT.jar
[JENKINS] Archiving <https://builds.apache.org/job/Flume-trunk-hbase-1/ws/flume-ng-configuration/pom.xml>
to org.apache.flume/flume-ng-configuration/1.7.0-SNAPSHOT/flume-ng-configuration-1.7.0-SNAPSHOT.pom
[JENKINS] Archiving <https://builds.apache.org/job/Flume-trunk-hbase-1/ws/flume-ng-configuration/target/flume-ng-configuration-1.7.0-SNAPSHOT.jar>
to org.apache.flume/flume-ng-configuration/1.7.0-SNAPSHOT/flume-ng-configuration-1.7.0-SNAPSHOT.jar
[JENKINS] Archiving <https://builds.apache.org/job/Flume-trunk-hbase-1/ws/flume-ng-channels/flume-kafka-channel/pom.xml>
to org.apache.flume.flume-ng-channels/flume-kafka-channel/1.7.0-SNAPSHOT/flume-kafka-channel-1.7.0-SNAPSHOT.pom
[JENKINS] Archiving <https://builds.apache.org/job/Flume-trunk-hbase-1/ws/flume-ng-channels/flume-kafka-channel/target/flume-kafka-channel-1.7.0-SNAPSHOT.jar>
to org.apache.flume.flume-ng-channels/flume-kafka-channel/1.7.0-SNAPSHOT/flume-kafka-channel-1.7.0-SNAPSHOT.jar
[JENKINS] Archiving <https://builds.apache.org/job/Flume-trunk-hbase-1/ws/flume-ng-clients/pom.xml>
to org.apache.flume/flume-ng-clients/1.7.0-SNAPSHOT/flume-ng-clients-1.7.0-SNAPSHOT.pom
[JENKINS] Archiving <https://builds.apache.org/job/Flume-trunk-hbase-1/ws/flume-shared/pom.xml>
to org.apache.flume/flume-shared/1.7.0-SNAPSHOT/flume-shared-1.7.0-SNAPSHOT.pom
No prior successful build to compare, so performing full copy of artifacts
[JENKINS] Archiving <https://builds.apache.org/job/Flume-trunk-hbase-1/ws/flume-ng-tests/pom.xml>
to org.apache.flume/flume-ng-tests/1.7.0-SNAPSHOT/flume-ng-tests-1.7.0-SNAPSHOT.pom
[JENKINS] Archiving <https://builds.apache.org/job/Flume-trunk-hbase-1/ws/flume-ng-tests/target/flume-ng-tests-1.7.0-SNAPSHOT.jar>
to org.apache.flume/flume-ng-tests/1.7.0-SNAPSHOT/flume-ng-tests-1.7.0-SNAPSHOT.jar
[JENKINS] Archiving <https://builds.apache.org/job/Flume-trunk-hbase-1/ws/flume-ng-sinks/flume-ng-hbase-sink/pom.xml>
to org.apache.flume.flume-ng-sinks/flume-ng-hbase-sink/1.7.0-SNAPSHOT/flume-ng-hbase-sink-1.7.0-SNAPSHOT.pom
[JENKINS] Archiving <https://builds.apache.org/job/Flume-trunk-hbase-1/ws/flume-ng-sinks/flume-ng-hbase-sink/target/flume-ng-hbase-sink-1.7.0-SNAPSHOT.jar>
to org.apache.flume.flume-ng-sinks/flume-ng-hbase-sink/1.7.0-SNAPSHOT/flume-ng-hbase-sink-1.7.0-SNAPSHOT.jar
[JENKINS] Archiving <https://builds.apache.org/job/Flume-trunk-hbase-1/ws/flume-ng-channels/flume-spillable-memory-channel/pom.xml>
to org.apache.flume.flume-ng-channels/flume-spillable-memory-channel/1.7.0-SNAPSHOT/flume-spillable-memory-channel-1.7.0-SNAPSHOT.pom
[JENKINS] Archiving <https://builds.apache.org/job/Flume-trunk-hbase-1/ws/flume-ng-channels/flume-spillable-memory-channel/target/flume-spillable-memory-channel-1.7.0-SNAPSHOT.jar>
to org.apache.flume.flume-ng-channels/flume-spillable-memory-channel/1.7.0-SNAPSHOT/flume-spillable-memory-channel-1.7.0-SNAPSHOT.jar
[JENKINS] Archiving <https://builds.apache.org/job/Flume-trunk-hbase-1/ws/flume-ng-legacy-sources/flume-thrift-source/pom.xml>
to org.apache.flume.flume-ng-legacy-sources/flume-thrift-source/1.7.0-SNAPSHOT/flume-thrift-source-1.7.0-SNAPSHOT.pom
[JENKINS] Archiving <https://builds.apache.org/job/Flume-trunk-hbase-1/ws/flume-ng-legacy-sources/flume-thrift-source/target/flume-thrift-source-1.7.0-SNAPSHOT.jar>
to org.apache.flume.flume-ng-legacy-sources/flume-thrift-source/1.7.0-SNAPSHOT/flume-thrift-source-1.7.0-SNAPSHOT.jar
[JENKINS] Archiving <https://builds.apache.org/job/Flume-trunk-hbase-1/ws/flume-ng-core/pom.xml>
to org.apache.flume/flume-ng-core/1.7.0-SNAPSHOT/flume-ng-core-1.7.0-SNAPSHOT.pom
[JENKINS] Archiving <https://builds.apache.org/job/Flume-trunk-hbase-1/ws/flume-ng-core/target/flume-ng-core-1.7.0-SNAPSHOT.jar>
to org.apache.flume/flume-ng-core/1.7.0-SNAPSHOT/flume-ng-core-1.7.0-SNAPSHOT.jar
[JENKINS] Archiving <https://builds.apache.org/job/Flume-trunk-hbase-1/ws/flume-tools/pom.xml>
to org.apache.flume/flume-tools/1.7.0-SNAPSHOT/flume-tools-1.7.0-SNAPSHOT.pom
[JENKINS] Archiving <https://builds.apache.org/job/Flume-trunk-hbase-1/ws/flume-tools/target/flume-tools-1.7.0-SNAPSHOT.jar>
to org.apache.flume/flume-tools/1.7.0-SNAPSHOT/flume-tools-1.7.0-SNAPSHOT.jar
[JENKINS] Archiving <https://builds.apache.org/job/Flume-trunk-hbase-1/ws/flume-ng-dist/pom.xml>
to org.apache.flume/flume-ng-dist/1.7.0-SNAPSHOT/flume-ng-dist-1.7.0-SNAPSHOT.pom
[JENKINS] Archiving <https://builds.apache.org/job/Flume-trunk-hbase-1/ws/flume-ng-sinks/flume-ng-kafka-sink/pom.xml>
to org.apache.flume.flume-ng-sinks/flume-ng-kafka-sink/1.7.0-SNAPSHOT/flume-ng-kafka-sink-1.7.0-SNAPSHOT.pom
[JENKINS] Archiving <https://builds.apache.org/job/Flume-trunk-hbase-1/ws/flume-ng-sinks/flume-ng-kafka-sink/target/flume-ng-kafka-sink-1.7.0-SNAPSHOT.jar>
to org.apache.flume.flume-ng-sinks/flume-ng-kafka-sink/1.7.0-SNAPSHOT/flume-ng-kafka-sink-1.7.0-SNAPSHOT.jar
[JENKINS] Archiving <https://builds.apache.org/job/Flume-trunk-hbase-1/ws/flume-ng-sinks/flume-ng-kafka-sink/target/flume-ng-kafka-sink-1.7.0-SNAPSHOT-tests.jar>
to org.apache.flume.flume-ng-sinks/flume-ng-kafka-sink/1.7.0-SNAPSHOT/flume-ng-kafka-sink-1.7.0-SNAPSHOT-tests.jar
[JENKINS] Archiving <https://builds.apache.org/job/Flume-trunk-hbase-1/ws/flume-ng-sources/flume-jms-source/pom.xml>
to org.apache.flume.flume-ng-sources/flume-jms-source/1.7.0-SNAPSHOT/flume-jms-source-1.7.0-SNAPSHOT.pom
[JENKINS] Archiving <https://builds.apache.org/job/Flume-trunk-hbase-1/ws/flume-ng-sources/flume-jms-source/target/flume-jms-source-1.7.0-SNAPSHOT.jar>
to org.apache.flume.flume-ng-sources/flume-jms-source/1.7.0-SNAPSHOT/flume-jms-source-1.7.0-SNAPSHOT.jar
[JENKINS] Archiving <https://builds.apache.org/job/Flume-trunk-hbase-1/ws/flume-shared/flume-shared-kafka-test/pom.xml>
to org.apache.flume.flume-shared/flume-shared-kafka-test/1.7.0-SNAPSHOT/flume-shared-kafka-test-1.7.0-SNAPSHOT.pom
[JENKINS] Archiving <https://builds.apache.org/job/Flume-trunk-hbase-1/ws/flume-shared/flume-shared-kafka-test/target/flume-shared-kafka-test-1.7.0-SNAPSHOT.jar>
to org.apache.flume.flume-shared/flume-shared-kafka-test/1.7.0-SNAPSHOT/flume-shared-kafka-test-1.7.0-SNAPSHOT.jar
[JENKINS] Archiving <https://builds.apache.org/job/Flume-trunk-hbase-1/ws/flume-shared/flume-shared-kafka-test/target/flume-shared-kafka-test-1.7.0-SNAPSHOT-tests.jar>
to org.apache.flume.flume-shared/flume-shared-kafka-test/1.7.0-SNAPSHOT/flume-shared-kafka-test-1.7.0-SNAPSHOT-tests.jar
No prior successful build to compare, so performing full copy of artifacts
[JENKINS] Archiving <https://builds.apache.org/job/Flume-trunk-hbase-1/ws/flume-ng-legacy-sources/flume-avro-source/pom.xml>
to org.apache.flume.flume-ng-legacy-sources/flume-avro-source/1.7.0-SNAPSHOT/flume-avro-source-1.7.0-SNAPSHOT.pom
[JENKINS] Archiving <https://builds.apache.org/job/Flume-trunk-hbase-1/ws/flume-ng-legacy-sources/flume-avro-source/target/flume-avro-source-1.7.0-SNAPSHOT.jar>
to org.apache.flume.flume-ng-legacy-sources/flume-avro-source/1.7.0-SNAPSHOT/flume-avro-source-1.7.0-SNAPSHOT.jar
[JENKINS] Archiving <https://builds.apache.org/job/Flume-trunk-hbase-1/ws/flume-ng-sources/flume-kafka-source/pom.xml>
to org.apache.flume.flume-ng-sources/flume-kafka-source/1.7.0-SNAPSHOT/flume-kafka-source-1.7.0-SNAPSHOT.pom
[JENKINS] Archiving <https://builds.apache.org/job/Flume-trunk-hbase-1/ws/flume-checkstyle/pom.xml>
to org.apache.flume/flume-checkstyle/1.7.0-SNAPSHOT/flume-checkstyle-1.7.0-SNAPSHOT.pom
[JENKINS] Archiving <https://builds.apache.org/job/Flume-trunk-hbase-1/ws/flume-checkstyle/target/flume-checkstyle-1.7.0-SNAPSHOT.jar>
to org.apache.flume/flume-checkstyle/1.7.0-SNAPSHOT/flume-checkstyle-1.7.0-SNAPSHOT.jar
[JENKINS] Archiving <https://builds.apache.org/job/Flume-trunk-hbase-1/ws/flume-ng-auth/pom.xml>
to org.apache.flume/flume-ng-auth/1.7.0-SNAPSHOT/flume-ng-auth-1.7.0-SNAPSHOT.pom
[JENKINS] Archiving <https://builds.apache.org/job/Flume-trunk-hbase-1/ws/flume-ng-auth/target/flume-ng-auth-1.7.0-SNAPSHOT.jar>
to org.apache.flume/flume-ng-auth/1.7.0-SNAPSHOT/flume-ng-auth-1.7.0-SNAPSHOT.jar
[JENKINS] Archiving <https://builds.apache.org/job/Flume-trunk-hbase-1/ws/flume-ng-sinks/flume-irc-sink/pom.xml>
to org.apache.flume.flume-ng-sinks/flume-irc-sink/1.7.0-SNAPSHOT/flume-irc-sink-1.7.0-SNAPSHOT.pom
[JENKINS] Archiving <https://builds.apache.org/job/Flume-trunk-hbase-1/ws/flume-ng-sinks/flume-irc-sink/target/flume-irc-sink-1.7.0-SNAPSHOT.jar>
to org.apache.flume.flume-ng-sinks/flume-irc-sink/1.7.0-SNAPSHOT/flume-irc-sink-1.7.0-SNAPSHOT.jar
[JENKINS] Archiving <https://builds.apache.org/job/Flume-trunk-hbase-1/ws/flume-ng-sources/flume-taildir-source/pom.xml>
to org.apache.flume.flume-ng-sources/flume-taildir-source/1.7.0-SNAPSHOT/flume-taildir-source-1.7.0-SNAPSHOT.pom
[JENKINS] Archiving <https://builds.apache.org/job/Flume-trunk-hbase-1/ws/flume-ng-sources/flume-taildir-source/target/flume-taildir-source-1.7.0-SNAPSHOT.jar>
to org.apache.flume.flume-ng-sources/flume-taildir-source/1.7.0-SNAPSHOT/flume-taildir-source-1.7.0-SNAPSHOT.jar
[JENKINS] Archiving <https://builds.apache.org/job/Flume-trunk-hbase-1/ws/flume-ng-channels/flume-jdbc-channel/pom.xml>
to org.apache.flume.flume-ng-channels/flume-jdbc-channel/1.7.0-SNAPSHOT/flume-jdbc-channel-1.7.0-SNAPSHOT.pom
[JENKINS] Archiving <https://builds.apache.org/job/Flume-trunk-hbase-1/ws/flume-ng-channels/flume-jdbc-channel/target/flume-jdbc-channel-1.7.0-SNAPSHOT.jar>
to org.apache.flume.flume-ng-channels/flume-jdbc-channel/1.7.0-SNAPSHOT/flume-jdbc-channel-1.7.0-SNAPSHOT.jar
[JENKINS] Archiving <https://builds.apache.org/job/Flume-trunk-hbase-1/ws/flume-ng-clients/flume-ng-log4jappender/pom.xml>
to org.apache.flume.flume-ng-clients/flume-ng-log4jappender/1.7.0-SNAPSHOT/flume-ng-log4jappender-1.7.0-SNAPSHOT.pom
[JENKINS] Archiving <https://builds.apache.org/job/Flume-trunk-hbase-1/ws/flume-ng-clients/flume-ng-log4jappender/target/flume-ng-log4jappender-1.7.0-SNAPSHOT.jar>
to org.apache.flume.flume-ng-clients/flume-ng-log4jappender/1.7.0-SNAPSHOT/flume-ng-log4jappender-1.7.0-SNAPSHOT.jar
[JENKINS] Archiving <https://builds.apache.org/job/Flume-trunk-hbase-1/ws/flume-ng-clients/flume-ng-log4jappender/target/flume-ng-log4jappender-1.7.0-SNAPSHOT-jar-with-dependencies.jar>
to org.apache.flume.flume-ng-clients/flume-ng-log4jappender/1.7.0-SNAPSHOT/flume-ng-log4jappender-1.7.0-SNAPSHOT-jar-with-dependencies.jar
Compressed 7.10 MB of artifacts by 90.2% relative to #208
[JENKINS] Archiving <https://builds.apache.org/job/Flume-trunk-hbase-1/ws/flume-ng-sinks/pom.xml>
to org.apache.flume/flume-ng-sinks/1.7.0-SNAPSHOT/flume-ng-sinks-1.7.0-SNAPSHOT.pom
[JENKINS] Archiving <https://builds.apache.org/job/Flume-trunk-hbase-1/ws/flume-ng-sources/pom.xml>
to org.apache.flume/flume-ng-sources/1.7.0-SNAPSHOT/flume-ng-sources-1.7.0-SNAPSHOT.pom
[JENKINS] Archiving <https://builds.apache.org/job/Flume-trunk-hbase-1/ws/flume-ng-node/pom.xml>
to org.apache.flume/flume-ng-node/1.7.0-SNAPSHOT/flume-ng-node-1.7.0-SNAPSHOT.pom
[JENKINS] Archiving <https://builds.apache.org/job/Flume-trunk-hbase-1/ws/flume-ng-node/target/flume-ng-node-1.7.0-SNAPSHOT.jar>
to org.apache.flume/flume-ng-node/1.7.0-SNAPSHOT/flume-ng-node-1.7.0-SNAPSHOT.jar
[JENKINS] Archiving <https://builds.apache.org/job/Flume-trunk-hbase-1/ws/flume-ng-channels/pom.xml>
to org.apache.flume/flume-ng-channels/1.7.0-SNAPSHOT/flume-ng-channels-1.7.0-SNAPSHOT.pom
[JENKINS] Archiving <https://builds.apache.org/job/Flume-trunk-hbase-1/ws/flume-ng-embedded-agent/pom.xml>
to org.apache.flume/flume-ng-embedded-agent/1.7.0-SNAPSHOT/flume-ng-embedded-agent-1.7.0-SNAPSHOT.pom
[JENKINS] Archiving <https://builds.apache.org/job/Flume-trunk-hbase-1/ws/flume-ng-embedded-agent/target/flume-ng-embedded-agent-1.7.0-SNAPSHOT.jar>
to org.apache.flume/flume-ng-embedded-agent/1.7.0-SNAPSHOT/flume-ng-embedded-agent-1.7.0-SNAPSHOT.jar
[JENKINS] Archiving <https://builds.apache.org/job/Flume-trunk-hbase-1/ws/flume-ng-sinks/flume-dataset-sink/pom.xml>
to org.apache.flume.flume-ng-sinks/flume-dataset-sink/1.7.0-SNAPSHOT/flume-dataset-sink-1.7.0-SNAPSHOT.pom
[JENKINS] Archiving <https://builds.apache.org/job/Flume-trunk-hbase-1/ws/flume-ng-sinks/flume-dataset-sink/target/flume-dataset-sink-1.7.0-SNAPSHOT.jar>
to org.apache.flume.flume-ng-sinks/flume-dataset-sink/1.7.0-SNAPSHOT/flume-dataset-sink-1.7.0-SNAPSHOT.jar
[JENKINS] Archiving <https://builds.apache.org/job/Flume-trunk-hbase-1/ws/flume-ng-sinks/flume-ng-morphline-solr-sink/pom.xml>
to org.apache.flume.flume-ng-sinks/flume-ng-morphline-solr-sink/1.7.0-SNAPSHOT/flume-ng-morphline-solr-sink-1.7.0-SNAPSHOT.pom
[JENKINS] Archiving <https://builds.apache.org/job/Flume-trunk-hbase-1/ws/flume-ng-sinks/flume-ng-morphline-solr-sink/target/flume-ng-morphline-solr-sink-1.7.0-SNAPSHOT.jar>
to org.apache.flume.flume-ng-sinks/flume-ng-morphline-solr-sink/1.7.0-SNAPSHOT/flume-ng-morphline-solr-sink-1.7.0-SNAPSHOT.jar
[JENKINS] Archiving <https://builds.apache.org/job/Flume-trunk-hbase-1/ws/flume-ng-sdk/pom.xml>
to org.apache.flume/flume-ng-sdk/1.7.0-SNAPSHOT/flume-ng-sdk-1.7.0-SNAPSHOT.pom
[JENKINS] Archiving <https://builds.apache.org/job/Flume-trunk-hbase-1/ws/flume-ng-sdk/target/flume-ng-sdk-1.7.0-SNAPSHOT.jar>
to org.apache.flume/flume-ng-sdk/1.7.0-SNAPSHOT/flume-ng-sdk-1.7.0-SNAPSHOT.jar
[JENKINS] Archiving <https://builds.apache.org/job/Flume-trunk-hbase-1/ws/flume-ng-sdk/target/flume-ng-sdk-1.7.0-SNAPSHOT-tests.jar>
to org.apache.flume/flume-ng-sdk/1.7.0-SNAPSHOT/flume-ng-sdk-1.7.0-SNAPSHOT-tests.jar
[JENKINS] Archiving <https://builds.apache.org/job/Flume-trunk-hbase-1/ws/flume-ng-sources/flume-scribe-source/pom.xml>
to org.apache.flume.flume-ng-sources/flume-scribe-source/1.7.0-SNAPSHOT/flume-scribe-source-1.7.0-SNAPSHOT.pom
[JENKINS] Archiving <https://builds.apache.org/job/Flume-trunk-hbase-1/ws/flume-ng-sources/flume-scribe-source/target/flume-scribe-source-1.7.0-SNAPSHOT.jar>
to org.apache.flume.flume-ng-sources/flume-scribe-source/1.7.0-SNAPSHOT/flume-scribe-source-1.7.0-SNAPSHOT.jar
channel stopped
[WARNINGS] Skipping publisher since build result is FAILURE
Archiving artifacts
Updating FLUME-2999

Mime
View raw message