flink-user mailing list archives

Site index · List index
Message view « Date » · « Thread »
Top « Date » · « Thread »
From Juan Rodríguez Hortalá <juan.rodriguez.hort...@gmail.com>
Subject Failure to donwload flink-contrib dependency
Date Sun, 20 Nov 2016 20:21:00 GMT
Hi,

I'm having problems to download flink-contrib in my Java maven project, the
relevant part of the pom is:

<properties>
   <project.build.sourceEncoding>UTF-8</project.build.sourceEncoding>
   <flink.version>1.1.3</flink.version>
</properties>

<dependency>
   <groupId>org.apache.flink</groupId>
   <artifactId>flink-contrib</artifactId>
   <version>${flink.version}</version>
</dependency>


I see that in
https://repo1.maven.org/maven2/org/apache/flink/flink-contrib/1.1.3/ there
are no jar files, but only the following, I'm not sure if that is relevant.

../ <https://repo1.maven.org/maven2/org/apache/flink/flink-contrib/>flink-contrib-1.1.3.pom
<https://repo1.maven.org/maven2/org/apache/flink/flink-contrib/1.1.3/flink-contrib-1.1.3.pom>
                           10-Oct-2016 15:38
1643flink-contrib-1.1.3.pom.asc
<https://repo1.maven.org/maven2/org/apache/flink/flink-contrib/1.1.3/flink-contrib-1.1.3.pom.asc>
                       10-Oct-2016 15:38
819flink-contrib-1.1.3.pom.asc.md5
<https://repo1.maven.org/maven2/org/apache/flink/flink-contrib/1.1.3/flink-contrib-1.1.3.pom.asc.md5>
                   10-Oct-2016 15:38
32flink-contrib-1.1.3.pom.asc.sha1
<https://repo1.maven.org/maven2/org/apache/flink/flink-contrib/1.1.3/flink-contrib-1.1.3.pom.asc.sha1>
                  10-Oct-2016 15:38
40flink-contrib-1.1.3.pom.md5
<https://repo1.maven.org/maven2/org/apache/flink/flink-contrib/1.1.3/flink-contrib-1.1.3.pom.md5>
                       10-Oct-2016 15:38
32flink-contrib-1.1.3.pom.sha1
<https://repo1.maven.org/maven2/org/apache/flink/flink-contrib/1.1.3/flink-contrib-1.1.3.pom.sha1>
                      10-Oct-2016 15:38                  40

Below is the maven output, can someone give me a hand with this?

Thanks,

Juan

juanrh@juanyDell MINGW64 ~/git/flink-state-eviction (master)
$ mvn clean package -e -X
Apache Maven 3.3.9 (bb52d8502b132ec0a5a3f4c09453c07478323dc5;
2015-11-10T08:41:47-08:00)
Maven home: C:\Users\juanrh\Sistemas\maven\apache-maven-3.3.9
Java version: 1.8.0_65, vendor: Oracle Corporation
Java home: C:\Program Files\Java\jdk1.8.0_65\jre
Default locale: en_US, platform encoding: Cp1252
OS name: "windows 10", version: "10.0", arch: "amd64", family: "dos"
[DEBUG] Created new class realm maven.api
[DEBUG] Importing foreign packages into class realm maven.api
[DEBUG]   Imported: javax.enterprise.inject.* < plexus.core
[DEBUG]   Imported: javax.enterprise.util.* < plexus.core
[DEBUG]   Imported: javax.inject.* < plexus.core
[DEBUG]   Imported: org.apache.maven.* < plexus.core
[DEBUG]   Imported: org.apache.maven.artifact < plexus.core
[DEBUG]   Imported: org.apache.maven.classrealm < plexus.core
[DEBUG]   Imported: org.apache.maven.cli < plexus.core
[DEBUG]   Imported: org.apache.maven.configuration < plexus.core
[DEBUG]   Imported: org.apache.maven.exception < plexus.core
[DEBUG]   Imported: org.apache.maven.execution < plexus.core
[DEBUG]   Imported: org.apache.maven.execution.scope < plexus.core
[DEBUG]   Imported: org.apache.maven.lifecycle < plexus.core
[DEBUG]   Imported: org.apache.maven.model < plexus.core
[DEBUG]   Imported: org.apache.maven.monitor < plexus.core
[DEBUG]   Imported: org.apache.maven.plugin < plexus.core
[DEBUG]   Imported: org.apache.maven.profiles < plexus.core
[DEBUG]   Imported: org.apache.maven.project < plexus.core
[DEBUG]   Imported: org.apache.maven.reporting < plexus.core
[DEBUG]   Imported: org.apache.maven.repository < plexus.core
[DEBUG]   Imported: org.apache.maven.rtinfo < plexus.core
[DEBUG]   Imported: org.apache.maven.settings < plexus.core
[DEBUG]   Imported: org.apache.maven.toolchain < plexus.core
[DEBUG]   Imported: org.apache.maven.usability < plexus.core
[DEBUG]   Imported: org.apache.maven.wagon.* < plexus.core
[DEBUG]   Imported: org.apache.maven.wagon.authentication < plexus.core
[DEBUG]   Imported: org.apache.maven.wagon.authorization < plexus.core
[DEBUG]   Imported: org.apache.maven.wagon.events < plexus.core
[DEBUG]   Imported: org.apache.maven.wagon.observers < plexus.core
[DEBUG]   Imported: org.apache.maven.wagon.proxy < plexus.core
[DEBUG]   Imported: org.apache.maven.wagon.repository < plexus.core
[DEBUG]   Imported: org.apache.maven.wagon.resource < plexus.core
[DEBUG]   Imported: org.codehaus.classworlds < plexus.core
[DEBUG]   Imported: org.codehaus.plexus.* < plexus.core
[DEBUG]   Imported: org.codehaus.plexus.classworlds < plexus.core
[DEBUG]   Imported: org.codehaus.plexus.component < plexus.core
[DEBUG]   Imported: org.codehaus.plexus.configuration < plexus.core
[DEBUG]   Imported: org.codehaus.plexus.container < plexus.core
[DEBUG]   Imported: org.codehaus.plexus.context < plexus.core
[DEBUG]   Imported: org.codehaus.plexus.lifecycle < plexus.core
[DEBUG]   Imported: org.codehaus.plexus.logging < plexus.core
[DEBUG]   Imported: org.codehaus.plexus.personality < plexus.core
[DEBUG]   Imported: org.codehaus.plexus.util.xml.Xpp3Dom < plexus.core
[DEBUG]   Imported: org.codehaus.plexus.util.xml.pull.XmlPullParser <
plexus.core
[DEBUG]   Imported:
org.codehaus.plexus.util.xml.pull.XmlPullParserException < plexus.core
[DEBUG]   Imported: org.codehaus.plexus.util.xml.pull.XmlSerializer <
plexus.core
[DEBUG]   Imported: org.eclipse.aether.* < plexus.core
[DEBUG]   Imported: org.eclipse.aether.artifact < plexus.core
[DEBUG]   Imported: org.eclipse.aether.collection < plexus.core
[DEBUG]   Imported: org.eclipse.aether.deployment < plexus.core
[DEBUG]   Imported: org.eclipse.aether.graph < plexus.core
[DEBUG]   Imported: org.eclipse.aether.impl < plexus.core
[DEBUG]   Imported: org.eclipse.aether.installation < plexus.core
[DEBUG]   Imported: org.eclipse.aether.internal.impl < plexus.core
[DEBUG]   Imported: org.eclipse.aether.metadata < plexus.core
[DEBUG]   Imported: org.eclipse.aether.repository < plexus.core
[DEBUG]   Imported: org.eclipse.aether.resolution < plexus.core
[DEBUG]   Imported: org.eclipse.aether.spi < plexus.core
[DEBUG]   Imported: org.eclipse.aether.transfer < plexus.core
[DEBUG]   Imported: org.eclipse.aether.version < plexus.core
[DEBUG]   Imported: org.slf4j.* < plexus.core
[DEBUG]   Imported: org.slf4j.helpers.* < plexus.core
[DEBUG]   Imported: org.slf4j.spi.* < plexus.core
[DEBUG] Populating class realm maven.api
[INFO] Error stacktraces are turned on.
[DEBUG] Reading global settings from
C:\Users\juanrh\Sistemas\maven\apache-maven-3.3.9\conf\settings.xml
[DEBUG] Reading user settings from C:\Users\juanrh\.m2\settings.xml
[DEBUG] Reading global toolchains from
C:\Users\juanrh\Sistemas\maven\apache-maven-3.3.9\conf\toolchains.xml
[DEBUG] Reading user toolchains from C:\Users\juanrh\.m2\toolchains.xml
[DEBUG] Using local repository at C:\Users\juanrh\.m2\repository
[DEBUG] Using manager EnhancedLocalRepositoryManager with priority 10.0 for
C:\Users\juanrh\.m2\repository
[INFO] Scanning for projects...
[DEBUG] Extension realms for project
com.github.juanrh:flink-state-eviction:jar:1.0-SNAPSHOT: (none)
[DEBUG] Looking up lifecyle mappings for packaging jar from
ClassRealm[plexus.core, parent: null]
[DEBUG] === REACTOR BUILD PLAN
================================================
[DEBUG] Project: com.github.juanrh:flink-state-eviction:jar:1.0-SNAPSHOT
[DEBUG] Tasks:   [clean, package]
[DEBUG] Style:   Regular
[DEBUG]
=======================================================================
[INFO]
[INFO]
------------------------------------------------------------------------
[INFO] Building Flink Quickstart Job 1.0-SNAPSHOT
[INFO]
------------------------------------------------------------------------
[DEBUG] Lifecycle default -> [validate, initialize, generate-sources,
process-sources, generate-resources, process-resources, compile,
process-classes, generate-test-sources, process-test-sources,
generate-test-resources, process-test-resources, test-compile,
process-test-classes, test, prepare-package, package, pre-integration-test,
integration-test, post-integration-test, verify, install, deploy]
[DEBUG] Lifecycle clean -> [pre-clean, clean, post-clean]
[DEBUG] Lifecycle site -> [pre-site, site, post-site, site-deploy]
[DEBUG] Lifecycle default -> [validate, initialize, generate-sources,
process-sources, generate-resources, process-resources, compile,
process-classes, generate-test-sources, process-test-sources,
generate-test-resources, process-test-resources, test-compile,
process-test-classes, test, prepare-package, package, pre-integration-test,
integration-test, post-integration-test, verify, install, deploy]
[DEBUG] Lifecycle clean -> [pre-clean, clean, post-clean]
[DEBUG] Lifecycle site -> [pre-site, site, post-site, site-deploy]
[DEBUG] Lifecycle default -> [validate, initialize, generate-sources,
process-sources, generate-resources, process-resources, compile,
process-classes, generate-test-sources, process-test-sources,
generate-test-resources, process-test-resources, test-compile,
process-test-classes, test, prepare-package, package, pre-integration-test,
integration-test, post-integration-test, verify, install, deploy]
[DEBUG] Lifecycle clean -> [pre-clean, clean, post-clean]
[DEBUG] Lifecycle site -> [pre-site, site, post-site, site-deploy]
[DEBUG] Lifecycle default -> [validate, initialize, generate-sources,
process-sources, generate-resources, process-resources, compile,
process-classes, generate-test-sources, process-test-sources,
generate-test-resources, process-test-resources, test-compile,
process-test-classes, test, prepare-package, package, pre-integration-test,
integration-test, post-integration-test, verify, install, deploy]
[DEBUG] Lifecycle clean -> [pre-clean, clean, post-clean]
[DEBUG] Lifecycle site -> [pre-site, site, post-site, site-deploy]
[DEBUG] Lifecycle default -> [validate, initialize, generate-sources,
process-sources, generate-resources, process-resources, compile,
process-classes, generate-test-sources, process-test-sources,
generate-test-resources, process-test-resources, test-compile,
process-test-classes, test, prepare-package, package, pre-integration-test,
integration-test, post-integration-test, verify, install, deploy]
[DEBUG] Lifecycle clean -> [pre-clean, clean, post-clean]
[DEBUG] Lifecycle site -> [pre-site, site, post-site, site-deploy]
[DEBUG] Lifecycle default -> [validate, initialize, generate-sources,
process-sources, generate-resources, process-resources, compile,
process-classes, generate-test-sources, process-test-sources,
generate-test-resources, process-test-resources, test-compile,
process-test-classes, test, prepare-package, package, pre-integration-test,
integration-test, post-integration-test, verify, install, deploy]
[DEBUG] Lifecycle clean -> [pre-clean, clean, post-clean]
[DEBUG] Lifecycle site -> [pre-site, site, post-site, site-deploy]
[DEBUG] Lifecycle default -> [validate, initialize, generate-sources,
process-sources, generate-resources, process-resources, compile,
process-classes, generate-test-sources, process-test-sources,
generate-test-resources, process-test-resources, test-compile,
process-test-classes, test, prepare-package, package, pre-integration-test,
integration-test, post-integration-test, verify, install, deploy]
[DEBUG] Lifecycle clean -> [pre-clean, clean, post-clean]
[DEBUG] Lifecycle site -> [pre-site, site, post-site, site-deploy]
[DEBUG] Lifecycle default -> [validate, initialize, generate-sources,
process-sources, generate-resources, process-resources, compile,
process-classes, generate-test-sources, process-test-sources,
generate-test-resources, process-test-resources, test-compile,
process-test-classes, test, prepare-package, package, pre-integration-test,
integration-test, post-integration-test, verify, install, deploy]
[DEBUG] Lifecycle clean -> [pre-clean, clean, post-clean]
[DEBUG] Lifecycle site -> [pre-site, site, post-site, site-deploy]
[DEBUG] Lifecycle default -> [validate, initialize, generate-sources,
process-sources, generate-resources, process-resources, compile,
process-classes, generate-test-sources, process-test-sources,
generate-test-resources, process-test-resources, test-compile,
process-test-classes, test, prepare-package, package, pre-integration-test,
integration-test, post-integration-test, verify, install, deploy]
[DEBUG] Lifecycle clean -> [pre-clean, clean, post-clean]
[DEBUG] Lifecycle site -> [pre-site, site, post-site, site-deploy]
[DEBUG] === PROJECT BUILD PLAN
================================================
[DEBUG] Project:       com.github.juanrh:flink-state-eviction:1.0-SNAPSHOT
[DEBUG] Dependencies (collect): []
[DEBUG] Dependencies (resolve): [compile, runtime, test]
[DEBUG] Repositories (dependencies): [apache.snapshots (
https://repository.apache.org/content/repositories/snapshots/, default,
snapshots), central (https://repo.maven.apache.org/maven2, default,
releases)]
[DEBUG] Repositories (plugins)     : [central (
https://repo.maven.apache.org/maven2, default, releases)]
[DEBUG]
-----------------------------------------------------------------------
[DEBUG] Goal:
org.apache.maven.plugins:maven-clean-plugin:2.5:clean (default-clean)
[DEBUG] Style:         Regular
[DEBUG] Configuration: <?xml version="1.0" encoding="UTF-8"?>
<configuration>
  <directory default-value="${project.build.directory}"/>
  <excludeDefaultDirectories
default-value="false">${clean.excludeDefaultDirectories}</excludeDefaultDirectories>
  <failOnError default-value="true">${maven.clean.failOnError}</failOnError>
  <followSymLinks
default-value="false">${clean.followSymLinks}</followSymLinks>
  <outputDirectory default-value="${project.build.outputDirectory}"/>
  <reportDirectory default-value="${project.reporting.outputDirectory}"/>
  <retryOnError
default-value="true">${maven.clean.retryOnError}</retryOnError>
  <skip default-value="false">${clean.skip}</skip>
  <testOutputDirectory
default-value="${project.build.testOutputDirectory}"/>
  <verbose>${clean.verbose}</verbose>
</configuration>
[DEBUG]
-----------------------------------------------------------------------
[DEBUG] Goal:
org.apache.maven.plugins:maven-resources-plugin:2.6:resources
(default-resources)
[DEBUG] Style:         Regular
[DEBUG] Configuration: <?xml version="1.0" encoding="UTF-8"?>
<configuration>
  <buildFilters default-value="${project.build.filters}"/>
  <encoding
default-value="${project.build.sourceEncoding}">${encoding}</encoding>
  <escapeString>${maven.resources.escapeString}</escapeString>
  <escapeWindowsPaths
default-value="true">${maven.resources.escapeWindowsPaths}</escapeWindowsPaths>
  <includeEmptyDirs
default-value="false">${maven.resources.includeEmptyDirs}</includeEmptyDirs>
  <outputDirectory default-value="${project.build.outputDirectory}"/>
  <overwrite default-value="false">${maven.resources.overwrite}</overwrite>
  <project default-value="${project}"/>
  <resources default-value="${project.resources}"/>
  <session default-value="${session}"/>
  <supportMultiLineFiltering
default-value="false">${maven.resources.supportMultiLineFiltering}</supportMultiLineFiltering>
  <useBuildFilters default-value="true"/>
  <useDefaultDelimiters default-value="true"/>
</configuration>
[DEBUG]
-----------------------------------------------------------------------
[DEBUG] Goal:
org.apache.maven.plugins:maven-compiler-plugin:3.1:compile (default-compile)
[DEBUG] Style:         Regular
[DEBUG] Configuration: <?xml version="1.0" encoding="UTF-8"?>
<configuration>
  <basedir default-value="${basedir}"/>
  <buildDirectory default-value="${project.build.directory}"/>
  <classpathElements default-value="${project.compileClasspathElements}"/>
  <compileSourceRoots default-value="${project.compileSourceRoots}"/>
  <compilerId
default-value="javac">${maven.compiler.compilerId}</compilerId>
  <compilerReuseStrategy
default-value="${reuseCreated}">${maven.compiler.compilerReuseStrategy}</compilerReuseStrategy>
  <compilerVersion>${maven.compiler.compilerVersion}</compilerVersion>
  <debug default-value="true">${maven.compiler.debug}</debug>
  <debuglevel>${maven.compiler.debuglevel}</debuglevel>
  <encoding
default-value="${project.build.sourceEncoding}">${encoding}</encoding>
  <executable>${maven.compiler.executable}</executable>
  <failOnError
default-value="true">${maven.compiler.failOnError}</failOnError>
  <forceJavacCompilerUse
default-value="false">${maven.compiler.forceJavacCompilerUse}</forceJavacCompilerUse>
  <fork default-value="false">${maven.compiler.fork}</fork>
  <generatedSourcesDirectory
default-value="${project.build.directory}/generated-sources/annotations"/>
  <maxmem>${maven.compiler.maxmem}</maxmem>
  <meminitial>${maven.compiler.meminitial}</meminitial>
  <mojoExecution>${mojoExecution}</mojoExecution>
  <optimize default-value="false">${maven.compiler.optimize}</optimize>
  <outputDirectory default-value="${project.build.outputDirectory}"/>
  <projectArtifact default-value="${project.artifact}"/>
  <showDeprecation
default-value="false">${maven.compiler.showDeprecation}</showDeprecation>
  <showWarnings
default-value="false">${maven.compiler.showWarnings}</showWarnings>
  <skipMain>${maven.main.skip}</skipMain>
  <skipMultiThreadWarning
default-value="false">${maven.compiler.skipMultiThreadWarning}</skipMultiThreadWarning>
  <source default-value="1.5">1.7</source>
  <staleMillis default-value="0">${lastModGranularityMs}</staleMillis>
  <target default-value="1.5">1.7</target>
  <useIncrementalCompilation
default-value="true">${maven.compiler.useIncrementalCompilation}</useIncrementalCompilation>
  <verbose default-value="false">${maven.compiler.verbose}</verbose>
  <mavenSession default-value="${session}"/>
  <session default-value="${session}"/>
</configuration>
[DEBUG]
-----------------------------------------------------------------------
[DEBUG] Goal:
org.apache.maven.plugins:maven-resources-plugin:2.6:testResources
(default-testResources)
[DEBUG] Style:         Regular
[DEBUG] Configuration: <?xml version="1.0" encoding="UTF-8"?>
<configuration>
  <buildFilters default-value="${project.build.filters}"/>
  <encoding
default-value="${project.build.sourceEncoding}">${encoding}</encoding>
  <escapeString>${maven.resources.escapeString}</escapeString>
  <escapeWindowsPaths
default-value="true">${maven.resources.escapeWindowsPaths}</escapeWindowsPaths>
  <includeEmptyDirs
default-value="false">${maven.resources.includeEmptyDirs}</includeEmptyDirs>
  <outputDirectory default-value="${project.build.testOutputDirectory}"/>
  <overwrite default-value="false">${maven.resources.overwrite}</overwrite>
  <project default-value="${project}"/>
  <resources default-value="${project.testResources}"/>
  <session default-value="${session}"/>
  <skip>${maven.test.skip}</skip>
  <supportMultiLineFiltering
default-value="false">${maven.resources.supportMultiLineFiltering}</supportMultiLineFiltering>
  <useBuildFilters default-value="true"/>
  <useDefaultDelimiters default-value="true"/>
</configuration>
[DEBUG]
-----------------------------------------------------------------------
[DEBUG] Goal:
org.apache.maven.plugins:maven-compiler-plugin:3.1:testCompile
(default-testCompile)
[DEBUG] Style:         Regular
[DEBUG] Configuration: <?xml version="1.0" encoding="UTF-8"?>
<configuration>
  <basedir default-value="${basedir}"/>
  <buildDirectory default-value="${project.build.directory}"/>
  <classpathElements default-value="${project.testClasspathElements}"/>
  <compileSourceRoots default-value="${project.testCompileSourceRoots}"/>
  <compilerId
default-value="javac">${maven.compiler.compilerId}</compilerId>
  <compilerReuseStrategy
default-value="${reuseCreated}">${maven.compiler.compilerReuseStrategy}</compilerReuseStrategy>
  <compilerVersion>${maven.compiler.compilerVersion}</compilerVersion>
  <debug default-value="true">${maven.compiler.debug}</debug>
  <debuglevel>${maven.compiler.debuglevel}</debuglevel>
  <encoding
default-value="${project.build.sourceEncoding}">${encoding}</encoding>
  <executable>${maven.compiler.executable}</executable>
  <failOnError
default-value="true">${maven.compiler.failOnError}</failOnError>
  <forceJavacCompilerUse
default-value="false">${maven.compiler.forceJavacCompilerUse}</forceJavacCompilerUse>
  <fork default-value="false">${maven.compiler.fork}</fork>
  <generatedTestSourcesDirectory
default-value="${project.build.directory}/generated-test-sources/test-annotations"/>
  <maxmem>${maven.compiler.maxmem}</maxmem>
  <meminitial>${maven.compiler.meminitial}</meminitial>
  <mojoExecution>${mojoExecution}</mojoExecution>
  <optimize default-value="false">${maven.compiler.optimize}</optimize>
  <outputDirectory default-value="${project.build.testOutputDirectory}"/>
  <showDeprecation
default-value="false">${maven.compiler.showDeprecation}</showDeprecation>
  <showWarnings
default-value="false">${maven.compiler.showWarnings}</showWarnings>
  <skip>${maven.test.skip}</skip>
  <skipMultiThreadWarning
default-value="false">${maven.compiler.skipMultiThreadWarning}</skipMultiThreadWarning>
  <source default-value="1.5">1.7</source>
  <staleMillis default-value="0">${lastModGranularityMs}</staleMillis>
  <target default-value="1.5">1.7</target>
  <testSource>${maven.compiler.testSource}</testSource>
  <testTarget>${maven.compiler.testTarget}</testTarget>
  <useIncrementalCompilation
default-value="true">${maven.compiler.useIncrementalCompilation}</useIncrementalCompilation>
  <verbose default-value="false">${maven.compiler.verbose}</verbose>
  <mavenSession default-value="${session}"/>
  <session default-value="${session}"/>
</configuration>
[DEBUG]
-----------------------------------------------------------------------
[DEBUG] Goal:
org.apache.maven.plugins:maven-surefire-plugin:2.12.4:test (default-test)
[DEBUG] Style:         Regular
[DEBUG] Configuration: <?xml version="1.0" encoding="UTF-8"?>
<configuration>
  <argLine>${argLine}</argLine>
  <basedir default-value="${basedir}"/>
  <childDelegation
default-value="false">${childDelegation}</childDelegation>
  <classesDirectory default-value="${project.build.outputDirectory}"/>
  <debugForkedProcess>${maven.surefire.debug}</debugForkedProcess>
  <disableXmlReport
default-value="false">${disableXmlReport}</disableXmlReport>
  <enableAssertions
default-value="true">${enableAssertions}</enableAssertions>
  <excludedGroups>${excludedGroups}</excludedGroups>

<failIfNoSpecifiedTests>${surefire.failIfNoSpecifiedTests}</failIfNoSpecifiedTests>
  <failIfNoTests>${failIfNoTests}</failIfNoTests>
  <forkMode default-value="once">${forkMode}</forkMode>

<forkedProcessTimeoutInSeconds>${surefire.timeout}</forkedProcessTimeoutInSeconds>
  <groups>${groups}</groups>
  <junitArtifactName
default-value="junit:junit">${junitArtifactName}</junitArtifactName>
  <jvm>${jvm}</jvm>
  <localRepository default-value="${localRepository}"/>
  <objectFactory>${objectFactory}</objectFactory>
  <parallel>${parallel}</parallel>
  <parallelMavenExecution default-value="${session.parallel}"/>
  <perCoreThreadCount
default-value="true">${perCoreThreadCount}</perCoreThreadCount>
  <pluginArtifactMap>${plugin.artifactMap}</pluginArtifactMap>
  <pluginDescriptor default-value="${plugin}"/>
  <printSummary default-value="true">${surefire.printSummary}</printSummary>
  <projectArtifactMap>${project.artifactMap}</projectArtifactMap>
  <redirectTestOutputToFile
default-value="false">${maven.test.redirectTestOutputToFile}</redirectTestOutputToFile>
  <remoteRepositories
default-value="${project.pluginArtifactRepositories}"/>
  <reportFormat
default-value="brief">${surefire.reportFormat}</reportFormat>
  <reportNameSuffix
default-value="">${surefire.reportNameSuffix}</reportNameSuffix>
  <reportsDirectory
default-value="${project.build.directory}/surefire-reports"/>
  <runOrder default-value="filesystem"/>
  <skip default-value="false">${maven.test.skip}</skip>
  <skipExec>${maven.test.skip.exec}</skipExec>
  <skipTests default-value="false">${skipTests}</skipTests>
  <test>${test}</test>
  <testClassesDirectory
default-value="${project.build.testOutputDirectory}"/>
  <testFailureIgnore
default-value="false">${maven.test.failure.ignore}</testFailureIgnore>
  <testNGArtifactName
default-value="org.testng:testng">${testNGArtifactName}</testNGArtifactName>
  <testSourceDirectory
default-value="${project.build.testSourceDirectory}"/>
  <threadCount>${threadCount}</threadCount>
  <trimStackTrace default-value="true">${trimStackTrace}</trimStackTrace>
  <useFile default-value="true">${surefire.useFile}</useFile>
  <useManifestOnlyJar
default-value="true">${surefire.useManifestOnlyJar}</useManifestOnlyJar>
  <useSystemClassLoader
default-value="true">${surefire.useSystemClassLoader}</useSystemClassLoader>
  <useUnlimitedThreads
default-value="false">${useUnlimitedThreads}</useUnlimitedThreads>
  <workingDirectory>${basedir}</workingDirectory>
  <project default-value="${project}"/>
  <session default-value="${session}"/>
</configuration>
[DEBUG]
-----------------------------------------------------------------------
[DEBUG] Goal:          org.apache.maven.plugins:maven-jar-plugin:2.4:jar
(default-jar)
[DEBUG] Style:         Regular
[DEBUG] Configuration: <?xml version="1.0" encoding="UTF-8"?>
<configuration>
  <classesDirectory default-value="${project.build.outputDirectory}"/>
  <defaultManifestFile
default-value="${project.build.outputDirectory}/META-INF/MANIFEST.MF"/>
  <finalName
default-value="${project.build.finalName}">${jar.finalName}</finalName>
  <forceCreation default-value="false">${jar.forceCreation}</forceCreation>
  <outputDirectory default-value="${project.build.directory}"/>
  <project default-value="${project}"/>
  <session default-value="${session}"/>
  <skipIfEmpty default-value="false">${jar.skipIfEmpty}</skipIfEmpty>
  <useDefaultManifestFile
default-value="false">${jar.useDefaultManifestFile}</useDefaultManifestFile>
</configuration>
[DEBUG]
-----------------------------------------------------------------------
[DEBUG] Goal:
org.apache.maven.plugins:maven-shade-plugin:2.4.1:shade (default)
[DEBUG] Style:         Regular
[DEBUG] Configuration: <?xml version="1.0" encoding="UTF-8"?>
<configuration>
  <artifactSet>
    <excludes>
      <exclude>org.apache.flink:flink-annotations</exclude>
      <exclude>org.apache.flink:flink-shaded-hadoop1_2.10</exclude>
      <exclude>org.apache.flink:flink-shaded-hadoop2</exclude>
      <exclude>org.apache.flink:flink-shaded-curator-recipes</exclude>
      <exclude>org.apache.flink:flink-core</exclude>
      <exclude>org.apache.flink:flink-java</exclude>
      <exclude>org.apache.flink:flink-scala_2.10</exclude>
      <exclude>org.apache.flink:flink-runtime_2.10</exclude>
      <exclude>org.apache.flink:flink-optimizer_2.10</exclude>
      <exclude>org.apache.flink:flink-clients_2.10</exclude>
      <exclude>org.apache.flink:flink-avro_2.10</exclude>
      <exclude>org.apache.flink:flink-examples-batch_2.10</exclude>
      <exclude>org.apache.flink:flink-examples-streaming_2.10</exclude>
      <exclude>org.apache.flink:flink-streaming-java_2.10</exclude>
      <exclude>org.scala-lang:scala-library</exclude>
      <exclude>org.scala-lang:scala-compiler</exclude>
      <exclude>org.scala-lang:scala-reflect</exclude>
      <exclude>com.typesafe.akka:akka-actor_*</exclude>
      <exclude>com.typesafe.akka:akka-remote_*</exclude>
      <exclude>com.typesafe.akka:akka-slf4j_*</exclude>
      <exclude>io.netty:netty-all</exclude>
      <exclude>io.netty:netty</exclude>
      <exclude>commons-fileupload:commons-fileupload</exclude>
      <exclude>org.apache.avro:avro</exclude>
      <exclude>commons-collections:commons-collections</exclude>
      <exclude>org.codehaus.jackson:jackson-core-asl</exclude>
      <exclude>org.codehaus.jackson:jackson-mapper-asl</exclude>
      <exclude>com.thoughtworks.paranamer:paranamer</exclude>
      <exclude>org.xerial.snappy:snappy-java</exclude>
      <exclude>org.apache.commons:commons-compress</exclude>
      <exclude>org.tukaani:xz</exclude>
      <exclude>com.esotericsoftware.kryo:kryo</exclude>
      <exclude>com.esotericsoftware.minlog:minlog</exclude>
      <exclude>org.objenesis:objenesis</exclude>
      <exclude>com.twitter:chill_*</exclude>
      <exclude>com.twitter:chill-java</exclude>
      <exclude>commons-lang:commons-lang</exclude>
      <exclude>junit:junit</exclude>
      <exclude>org.apache.commons:commons-lang3</exclude>
      <exclude>org.slf4j:slf4j-api</exclude>
      <exclude>org.slf4j:slf4j-log4j12</exclude>
      <exclude>log4j:log4j</exclude>
      <exclude>org.apache.commons:commons-math</exclude>
      <exclude>org.apache.sling:org.apache.sling.commons.json</exclude>
      <exclude>commons-logging:commons-logging</exclude>
      <exclude>commons-codec:commons-codec</exclude>
      <exclude>com.fasterxml.jackson.core:jackson-core</exclude>
      <exclude>com.fasterxml.jackson.core:jackson-databind</exclude>
      <exclude>com.fasterxml.jackson.core:jackson-annotations</exclude>
      <exclude>stax:stax-api</exclude>
      <exclude>com.typesafe:config</exclude>
      <exclude>org.uncommons.maths:uncommons-maths</exclude>
      <exclude>com.github.scopt:scopt_*</exclude>
      <exclude>commons-io:commons-io</exclude>
      <exclude>commons-cli:commons-cli</exclude>
    </excludes>
  </artifactSet>
  <createDependencyReducedPom
default-value="true">false</createDependencyReducedPom>
  <dependencyReducedPomLocation
default-value="${basedir}/dependency-reduced-pom.xml"/>
  <filters>
    <filter>
      <artifact>org.apache.flink:*</artifact>
      <excludes>
        <exclude>org/apache/flink/shaded/com/**</exclude>
        <exclude>web-docs/**</exclude>
      </excludes>
    </filter>
    <filter>
      <artifact>*:*</artifact>
      <excludes>
        <exclude>META-INF/*.SF</exclude>
        <exclude>META-INF/*.DSA</exclude>
        <exclude>META-INF/*.RSA</exclude>
      </excludes>
    </filter>
  </filters>
  <generateUniqueDependencyReducedPom default-value="false"/>
  <localRepository default-value="${localRepository}"/>
  <outputDirectory default-value="${project.build.directory}"/>
  <project default-value="${project}"/>
  <remoteArtifactRepositories
default-value="${project.remoteArtifactRepositories}"/>
  <session default-value="${session}"/>
  <shadeSourcesContent
default-value="false">${shadeSourcesContent}</shadeSourcesContent>
  <shadeTestJar default-value="false"/>
  <shadedArtifactId default-value="${project.artifactId}"/>
  <shadedClassifierName default-value="shaded"/>
  <useBaseVersion default-value="false"/>
</configuration>
[DEBUG]
=======================================================================
[DEBUG] Using transporter WagonTransporter with priority -1.0 for
https://repo.maven.apache.org/maven2
[DEBUG] Using connector BasicRepositoryConnector with priority 0.0 for
https://repo.maven.apache.org/maven2
Downloading:
https://repo.maven.apache.org/maven2/org/apache/flink/flink-contrib/1.1.3/flink-contrib-1.1.3.pom
Downloaded:
https://repo.maven.apache.org/maven2/org/apache/flink/flink-contrib/1.1.3/flink-contrib-1.1.3.pom
(2 KB at 5.2 KB/sec)
[DEBUG] Writing tracking file
C:\Users\juanrh\.m2\repository\org\apache\flink\flink-contrib\1.1.3\_remote.repositories
[DEBUG] Writing tracking file
C:\Users\juanrh\.m2\repository\org\apache\flink\flink-contrib\1.1.3\flink-contrib-1.1.3.pom.lastUpdated
[DEBUG] Dependency collection stats: {ConflictMarker.analyzeTime=1,
ConflictMarker.markTime=1, ConflictMarker.nodeCount=238,
ConflictIdSorter.graphTime=1, ConflictIdSorter.topsortTime=0,
ConflictIdSorter.conflictIdCount=84,
ConflictIdSorter.conflictIdCycleCount=0, ConflictResolver.totalTime=11,
ConflictResolver.conflictItemCount=210,
DefaultDependencyCollector.collectTime=1123,
DefaultDependencyCollector.transformTime=16}
[DEBUG] com.github.juanrh:flink-state-eviction:jar:1.0-SNAPSHOT
[DEBUG]    org.apache.flink:flink-java:jar:1.1.3:compile
[DEBUG]       org.apache.flink:flink-core:jar:1.1.3:compile
[DEBUG]          org.apache.flink:flink-annotations:jar:1.1.3:compile
[DEBUG]          org.apache.flink:flink-metrics-core:jar:1.1.3:compile
[DEBUG]          com.esotericsoftware.kryo:kryo:jar:2.24.0:compile
[DEBUG]             com.esotericsoftware.minlog:minlog:jar:1.2:compile
[DEBUG]             org.objenesis:objenesis:jar:2.1:compile
[DEBUG]          org.apache.avro:avro:jar:1.7.6:compile
[DEBUG]       org.apache.flink:flink-shaded-hadoop2:jar:1.1.3:compile
[DEBUG]          xmlenc:xmlenc:jar:0.52:compile
[DEBUG]          commons-codec:commons-codec:jar:1.4:compile
[DEBUG]          commons-io:commons-io:jar:2.4:compile
[DEBUG]          commons-net:commons-net:jar:3.1:compile
[DEBUG]          commons-collections:commons-collections:jar:3.2.1:compile
[DEBUG]          javax.servlet:servlet-api:jar:2.5:compile
[DEBUG]          org.mortbay.jetty:jetty-util:jar:6.1.26:compile
[DEBUG]          com.sun.jersey:jersey-core:jar:1.9:compile
[DEBUG]          commons-el:commons-el:jar:1.0:runtime
[DEBUG]          commons-logging:commons-logging:jar:1.1.3:compile
[DEBUG]          com.jamesmurty.utils:java-xmlbuilder:jar:0.4:compile
[DEBUG]          commons-lang:commons-lang:jar:2.6:compile
[DEBUG]          commons-configuration:commons-configuration:jar:1.7:compile
[DEBUG]          commons-digester:commons-digester:jar:1.8.1:compile
[DEBUG]          org.codehaus.jackson:jackson-core-asl:jar:1.8.8:compile
[DEBUG]          org.codehaus.jackson:jackson-mapper-asl:jar:1.8.8:compile
[DEBUG]          com.thoughtworks.paranamer:paranamer:jar:2.3:compile
[DEBUG]          org.xerial.snappy:snappy-java:jar:1.0.5:compile
[DEBUG]          com.jcraft:jsch:jar:0.1.42:compile
[DEBUG]          org.apache.zookeeper:zookeeper:jar:3.4.6:compile
[DEBUG]             io.netty:netty:jar:3.7.0.Final:compile
[DEBUG]          org.apache.commons:commons-compress:jar:1.4.1:compile
[DEBUG]          org.tukaani:xz:jar:1.0:compile
[DEBUG]
commons-beanutils:commons-beanutils-bean-collections:jar:1.8.3:compile
[DEBUG]          commons-daemon:commons-daemon:jar:1.0.13:compile
[DEBUG]          javax.xml.bind:jaxb-api:jar:2.2.2:compile
[DEBUG]          javax.xml.stream:stax-api:jar:1.0-2:compile
[DEBUG]          javax.activation:activation:jar:1.1:compile
[DEBUG]          com.google.inject:guice:jar:3.0:compile
[DEBUG]          javax.inject:javax.inject:jar:1:compile
[DEBUG]          aopalliance:aopalliance:jar:1.0:compile
[DEBUG]       org.apache.commons:commons-math3:jar:3.5:compile
[DEBUG]       com.google.code.findbugs:jsr305:jar:1.3.9:compile
[DEBUG]       org.apache.commons:commons-lang3:jar:3.3.2:compile
[DEBUG]       org.slf4j:slf4j-api:jar:1.7.7:compile
[DEBUG]       org.slf4j:slf4j-log4j12:jar:1.7.7:compile
[DEBUG]       log4j:log4j:jar:1.2.17:compile
[DEBUG]       org.apache.flink:force-shading:jar:1.1.3:compile
[DEBUG]    org.apache.flink:flink-streaming-java_2.10:jar:1.1.3:compile
[DEBUG]       org.apache.flink:flink-runtime_2.10:jar:1.1.3:compile
[DEBUG]          io.netty:netty-all:jar:4.0.27.Final:compile
[DEBUG]          org.javassist:javassist:jar:3.18.2-GA:compile
[DEBUG]          org.scala-lang:scala-library:jar:2.10.4:compile
[DEBUG]          com.typesafe.akka:akka-actor_2.10:jar:2.3.7:compile
[DEBUG]             com.typesafe:config:jar:1.2.1:compile
[DEBUG]          com.typesafe.akka:akka-remote_2.10:jar:2.3.7:compile
[DEBUG]             com.google.protobuf:protobuf-java:jar:2.5.0:compile
[DEBUG]             org.uncommons.maths:uncommons-maths:jar:1.2.2a:compile
[DEBUG]          com.typesafe.akka:akka-slf4j_2.10:jar:2.3.7:compile
[DEBUG]          org.clapper:grizzled-slf4j_2.10:jar:1.0.2:compile
[DEBUG]          com.github.scopt:scopt_2.10:jar:3.2.0:compile
[DEBUG]          io.dropwizard.metrics:metrics-core:jar:3.1.0:compile
[DEBUG]          io.dropwizard.metrics:metrics-jvm:jar:3.1.0:compile
[DEBUG]          io.dropwizard.metrics:metrics-json:jar:3.1.0:compile
[DEBUG]
com.fasterxml.jackson.core:jackson-databind:jar:2.4.2:compile
[DEBUG]
com.fasterxml.jackson.core:jackson-annotations:jar:2.4.0:compile
[DEBUG]
com.fasterxml.jackson.core:jackson-core:jar:2.4.2:compile
[DEBUG]          com.twitter:chill_2.10:jar:0.7.4:compile
[DEBUG]             com.twitter:chill-java:jar:0.7.4:compile
[DEBUG]
org.apache.sling:org.apache.sling.commons.json:jar:2.0.6:compile
[DEBUG]    org.apache.flink:flink-clients_2.10:jar:1.1.3:compile
[DEBUG]       org.apache.flink:flink-optimizer_2.10:jar:1.1.3:compile
[DEBUG]       commons-cli:commons-cli:jar:1.3.1:compile
[DEBUG]    org.apache.flink:flink-contrib:jar:1.1.3:compile
[DEBUG]    org.projectlombok:lombok:jar:1.16.10:provided
[DEBUG]    junit:junit:jar:4.12:test
[DEBUG]       org.hamcrest:hamcrest-core:jar:1.3:test
[DEBUG]    org.apache.flink:flink-test-utils_2.10:jar:1.1.3:compile
[DEBUG]       org.apache.flink:flink-test-utils-junit:jar:1.1.3:compile
[DEBUG]       org.apache.curator:curator-test:jar:2.8.0:compile
[DEBUG]          org.apache.commons:commons-math:jar:2.2:compile
[DEBUG]          com.google.guava:guava:jar:16.0.1:compile
[DEBUG] Using transporter WagonTransporter with priority -1.0 for
https://repo.maven.apache.org/maven2
[DEBUG] Using connector BasicRepositoryConnector with priority 0.0 for
https://repo.maven.apache.org/maven2
Downloading:
https://repo.maven.apache.org/maven2/org/apache/flink/flink-contrib/1.1.3/flink-contrib-1.1.3.jar
[DEBUG] Writing tracking file
C:\Users\juanrh\.m2\repository\org\apache\flink\flink-contrib\1.1.3\flink-contrib-1.1.3.jar.lastUpdated
[INFO]
------------------------------------------------------------------------
[INFO] BUILD FAILURE
[INFO]
------------------------------------------------------------------------
[INFO] Total time: 1.428 s
[INFO] Finished at: 2016-11-20T12:17:07-08:00
[INFO] Final Memory: 12M/366M
[INFO]
------------------------------------------------------------------------
[ERROR] Failed to execute goal on project flink-state-eviction: Could not
resolve dependencies for project
com.github.juanrh:flink-state-eviction:jar:1.0-SNAPSHOT: Could not find
artifact org.apache.flink:flink-contrib:jar:1.1.3 in central (
https://repo.maven.apache.org/maven2) -> [Help 1]
org.apache.maven.lifecycle.LifecycleExecutionException: Failed to execute
goal on project flink-state-eviction: Could not resolve dependencies for
project com.github.juanrh:flink-state-eviction:jar:1.0-SNAPSHOT: Could not
find artifact org.apache.flink:flink-contrib:jar:1.1.3 in central (
https://repo.maven.apache.org/maven2)
        at
org.apache.maven.lifecycle.internal.LifecycleDependencyResolver.getDependencies(LifecycleDependencyResolver.java:221)
        at
org.apache.maven.lifecycle.internal.LifecycleDependencyResolver.resolveProjectDependencies(LifecycleDependencyResolver.java:127)
        at
org.apache.maven.lifecycle.internal.MojoExecutor.ensureDependenciesAreResolved(MojoExecutor.java:245)
        at
org.apache.maven.lifecycle.internal.MojoExecutor.execute(MojoExecutor.java:199)
        at
org.apache.maven.lifecycle.internal.MojoExecutor.execute(MojoExecutor.java:153)
        at
org.apache.maven.lifecycle.internal.MojoExecutor.execute(MojoExecutor.java:145)
        at
org.apache.maven.lifecycle.internal.LifecycleModuleBuilder.buildProject(LifecycleModuleBuilder.java:116)
        at
org.apache.maven.lifecycle.internal.LifecycleModuleBuilder.buildProject(LifecycleModuleBuilder.java:80)
        at
org.apache.maven.lifecycle.internal.builder.singlethreaded.SingleThreadedBuilder.build(SingleThreadedBuilder.java:51)
        at
org.apache.maven.lifecycle.internal.LifecycleStarter.execute(LifecycleStarter.java:128)
        at org.apache.maven.DefaultMaven.doExecute(DefaultMaven.java:307)
        at org.apache.maven.DefaultMaven.doExecute(DefaultMaven.java:193)
        at org.apache.maven.DefaultMaven.execute(DefaultMaven.java:106)
        at org.apache.maven.cli.MavenCli.execute(MavenCli.java:863)
        at org.apache.maven.cli.MavenCli.doMain(MavenCli.java:288)
        at org.apache.maven.cli.MavenCli.main(MavenCli.java:199)
        at sun.reflect.NativeMethodAccessorImpl.invoke0(Native Method)
        at
sun.reflect.NativeMethodAccessorImpl.invoke(NativeMethodAccessorImpl.java:62)
        at
sun.reflect.DelegatingMethodAccessorImpl.invoke(DelegatingMethodAccessorImpl.java:43)
        at java.lang.reflect.Method.invoke(Method.java:497)
        at
org.codehaus.plexus.classworlds.launcher.Launcher.launchEnhanced(Launcher.java:289)
        at
org.codehaus.plexus.classworlds.launcher.Launcher.launch(Launcher.java:229)
        at
org.codehaus.plexus.classworlds.launcher.Launcher.mainWithExitCode(Launcher.java:415)
        at
org.codehaus.plexus.classworlds.launcher.Launcher.main(Launcher.java:356)
Caused by: org.apache.maven.project.DependencyResolutionException: Could
not resolve dependencies for project
com.github.juanrh:flink-state-eviction:jar:1.0-SNAPSHOT: Could not find
artifact org.apache.flink:flink-contrib:jar:1.1.3 in central (
https://repo.maven.apache.org/maven2)
        at
org.apache.maven.project.DefaultProjectDependenciesResolver.resolve(DefaultProjectDependenciesResolver.java:211)
        at
org.apache.maven.lifecycle.internal.LifecycleDependencyResolver.getDependencies(LifecycleDependencyResolver.java:195)
        ... 23 more
Caused by: org.eclipse.aether.resolution.DependencyResolutionException:
Could not find artifact org.apache.flink:flink-contrib:jar:1.1.3 in central
(https://repo.maven.apache.org/maven2)
        at
org.eclipse.aether.internal.impl.DefaultRepositorySystem.resolveDependencies(DefaultRepositorySystem.java:384)
        at
org.apache.maven.project.DefaultProjectDependenciesResolver.resolve(DefaultProjectDependenciesResolver.java:205)
        ... 24 more
Caused by: org.eclipse.aether.resolution.ArtifactResolutionException: Could
not find artifact org.apache.flink:flink-contrib:jar:1.1.3 in central (
https://repo.maven.apache.org/maven2)
        at
org.eclipse.aether.internal.impl.DefaultArtifactResolver.resolve(DefaultArtifactResolver.java:444)
        at
org.eclipse.aether.internal.impl.DefaultArtifactResolver.resolveArtifacts(DefaultArtifactResolver.java:246)
        at
org.eclipse.aether.internal.impl.DefaultRepositorySystem.resolveDependencies(DefaultRepositorySystem.java:367)
        ... 25 more
Caused by: org.eclipse.aether.transfer.ArtifactNotFoundException: Could not
find artifact org.apache.flink:flink-contrib:jar:1.1.3 in central (
https://repo.maven.apache.org/maven2)
        at
org.eclipse.aether.connector.basic.ArtifactTransportListener.transferFailed(ArtifactTransportListener.java:39)
        at
org.eclipse.aether.connector.basic.BasicRepositoryConnector$TaskRunner.run(BasicRepositoryConnector.java:355)
        at
org.eclipse.aether.util.concurrency.RunnableErrorForwarder$1.run(RunnableErrorForwarder.java:67)
        at
org.eclipse.aether.connector.basic.BasicRepositoryConnector$DirectExecutor.execute(BasicRepositoryConnector.java:581)
        at
org.eclipse.aether.connector.basic.BasicRepositoryConnector.get(BasicRepositoryConnector.java:249)
        at
org.eclipse.aether.internal.impl.DefaultArtifactResolver.performDownloads(DefaultArtifactResolver.java:520)
        at
org.eclipse.aether.internal.impl.DefaultArtifactResolver.resolve(DefaultArtifactResolver.java:421)
        ... 27 more
[ERROR]
[ERROR]
[ERROR] For more information about the errors and possible solutions,
please read the following articles:
[ERROR] [Help 1]
http://cwiki.apache.org/confluence/display/MAVEN/DependencyResolutionException

juanrh@juanyDell MINGW64 ~/git/flink-state-eviction (master)
$

Mime
View raw message