flink-issues mailing list archives

Site index · List index
Message view « Date » · « Thread »
Top « Date » · « Thread »
From "Arvid Heise (Jira)" <j...@apache.org>
Subject [jira] [Updated] (FLINK-23678) KafkaSinkITCase.testWriteRecordsToKafkaWithExactlyOnceGuarantee fails on azure
Date Thu, 12 Aug 2021 05:41:00 GMT

     [ https://issues.apache.org/jira/browse/FLINK-23678?page=com.atlassian.jira.plugin.system.issuetabpanels:all-tabpanel
]

Arvid Heise updated FLINK-23678:
--------------------------------
    Attachment: extracted.log

> KafkaSinkITCase.testWriteRecordsToKafkaWithExactlyOnceGuarantee fails on azure
> ------------------------------------------------------------------------------
>
>                 Key: FLINK-23678
>                 URL: https://issues.apache.org/jira/browse/FLINK-23678
>             Project: Flink
>          Issue Type: Bug
>          Components: Connectors / Kafka
>    Affects Versions: 1.14.0
>            Reporter: Xintong Song
>            Assignee: Fabian Paul
>            Priority: Critical
>              Labels: pull-request-available, test-stability
>             Fix For: 1.14.0
>
>         Attachments: extracted.log
>
>
> https://dev.azure.com/apache-flink/apache-flink/_build/results?buildId=21711&view=logs&j=b0097207-033c-5d9a-b48c-6d4796fbe60d&t=8338a7d2-16f7-52e5-f576-4b7b3071eb3d&l=6946
> {code}
> Aug 07 00:12:18 [ERROR] Tests run: 7, Failures: 1, Errors: 0, Skipped: 0, Time elapsed:
67.431 s <<< FAILURE! - in org.apache.flink.streaming.connectors.kafka.sink.KafkaSinkITCase
> Aug 07 00:12:18 [ERROR] testWriteRecordsToKafkaWithExactlyOnceGuarantee(org.apache.flink.streaming.connectors.kafka.sink.KafkaSinkITCase)
 Time elapsed: 7.001 s  <<< FAILURE!
> Aug 07 00:12:18 java.lang.AssertionError: expected:<407799> but was:<407798>
> Aug 07 00:12:18 	at org.junit.Assert.fail(Assert.java:89)
> Aug 07 00:12:18 	at org.junit.Assert.failNotEquals(Assert.java:835)
> Aug 07 00:12:18 	at org.junit.Assert.assertEquals(Assert.java:647)
> Aug 07 00:12:18 	at org.junit.Assert.assertEquals(Assert.java:633)
> Aug 07 00:12:18 	at org.apache.flink.streaming.connectors.kafka.sink.KafkaSinkITCase.writeRecordsToKafka(KafkaSinkITCase.java:334)
> Aug 07 00:12:18 	at org.apache.flink.streaming.connectors.kafka.sink.KafkaSinkITCase.testWriteRecordsToKafkaWithExactlyOnceGuarantee(KafkaSinkITCase.java:173)
> Aug 07 00:12:18 	at sun.reflect.NativeMethodAccessorImpl.invoke0(Native Method)
> Aug 07 00:12:18 	at sun.reflect.NativeMethodAccessorImpl.invoke(NativeMethodAccessorImpl.java:62)
> Aug 07 00:12:18 	at sun.reflect.DelegatingMethodAccessorImpl.invoke(DelegatingMethodAccessorImpl.java:43)
> Aug 07 00:12:18 	at java.lang.reflect.Method.invoke(Method.java:498)
> Aug 07 00:12:18 	at org.junit.runners.model.FrameworkMethod$1.runReflectiveCall(FrameworkMethod.java:59)
> Aug 07 00:12:18 	at org.junit.internal.runners.model.ReflectiveCallable.run(ReflectiveCallable.java:12)
> Aug 07 00:12:18 	at org.junit.runners.model.FrameworkMethod.invokeExplosively(FrameworkMethod.java:56)
> Aug 07 00:12:18 	at org.junit.internal.runners.statements.InvokeMethod.evaluate(InvokeMethod.java:17)
> Aug 07 00:12:18 	at org.junit.internal.runners.statements.RunBefores.evaluate(RunBefores.java:26)
> Aug 07 00:12:18 	at org.junit.internal.runners.statements.RunAfters.evaluate(RunAfters.java:27)
> Aug 07 00:12:18 	at org.junit.rules.ExternalResource$1.evaluate(ExternalResource.java:54)
> Aug 07 00:12:18 	at org.junit.rules.ExternalResource$1.evaluate(ExternalResource.java:54)
> Aug 07 00:12:18 	at org.apache.flink.util.TestNameProvider$1.evaluate(TestNameProvider.java:45)
> Aug 07 00:12:18 	at org.junit.rules.TestWatcher$1.evaluate(TestWatcher.java:61)
> Aug 07 00:12:18 	at org.junit.runners.ParentRunner$3.evaluate(ParentRunner.java:306)
> Aug 07 00:12:18 	at org.junit.runners.BlockJUnit4ClassRunner$1.evaluate(BlockJUnit4ClassRunner.java:100)
> Aug 07 00:12:18 	at org.junit.runners.ParentRunner.runLeaf(ParentRunner.java:366)
> Aug 07 00:12:18 	at org.junit.runners.BlockJUnit4ClassRunner.runChild(BlockJUnit4ClassRunner.java:103)
> Aug 07 00:12:18 	at org.junit.runners.BlockJUnit4ClassRunner.runChild(BlockJUnit4ClassRunner.java:63)
> Aug 07 00:12:18 	at org.junit.runners.ParentRunner$4.run(ParentRunner.java:331)
> Aug 07 00:12:18 	at org.junit.runners.ParentRunner$1.schedule(ParentRunner.java:79)
> Aug 07 00:12:18 	at org.junit.runners.ParentRunner.runChildren(ParentRunner.java:329)
> Aug 07 00:12:18 	at org.junit.runners.ParentRunner.access$100(ParentRunner.java:66)
> Aug 07 00:12:18 	at org.junit.runners.ParentRunner$2.evaluate(ParentRunner.java:293)
> Aug 07 00:12:18 	at org.testcontainers.containers.FailureDetectingExternalResource$1.evaluate(FailureDetectingExternalResource.java:30)
> Aug 07 00:12:18 	at org.junit.rules.RunRules.evaluate(RunRules.java:20)
> Aug 07 00:12:18 	at org.junit.runners.ParentRunner$3.evaluate(ParentRunner.java:306)
> Aug 07 00:12:18 	at org.junit.runners.ParentRunner.run(ParentRunner.java:413)
> Aug 07 00:12:18 	at org.apache.maven.surefire.junit4.JUnit4Provider.execute(JUnit4Provider.java:365)
> Aug 07 00:12:18 	at org.apache.maven.surefire.junit4.JUnit4Provider.executeWithRerun(JUnit4Provider.java:273)
> Aug 07 00:12:18 	at org.apache.maven.surefire.junit4.JUnit4Provider.executeTestSet(JUnit4Provider.java:238)
> Aug 07 00:12:18 	at org.apache.maven.surefire.junit4.JUnit4Provider.invoke(JUnit4Provider.java:159)
> Aug 07 00:12:18 	at org.apache.maven.surefire.booter.ForkedBooter.invokeProviderInSameClassLoader(ForkedBooter.java:384)
> Aug 07 00:12:18 	at org.apache.maven.surefire.booter.ForkedBooter.runSuitesInProcess(ForkedBooter.java:345)
> Aug 07 00:12:18 	at org.apache.maven.surefire.booter.ForkedBooter.execute(ForkedBooter.java:126)
> Aug 07 00:12:18 	at org.apache.maven.surefire.booter.ForkedBooter.main(ForkedBooter.java:418)
> {code}



--
This message was sent by Atlassian Jira
(v8.3.4#803005)

Mime
View raw message