flink-issues mailing list archives

Site index · List index
Message view « Date » · « Thread »
Top « Date » · « Thread »
From "Yun Gao (Jira)" <j...@apache.org>
Subject [jira] [Commented] (FLINK-23366) AkkaRpcActorTest. testOnStopFutureCompletionDirectlyTerminatesAkkaRpcActor fails on azure
Date Tue, 13 Jul 2021 03:36:00 GMT

    [ https://issues.apache.org/jira/browse/FLINK-23366?page=com.atlassian.jira.plugin.system.issuetabpanels:comment-tabpanel&focusedCommentId=17379556#comment-17379556
] 

Yun Gao commented on FLINK-23366:
---------------------------------

https://dev.azure.com/apache-flink/apache-flink/_build/results?buildId=20337&view=logs&j=a57e0635-3fad-5b08-57c7-a4142d7d6fa9&t=5360d54c-8d94-5d85-304e-a89267eb785a&l=6024

> AkkaRpcActorTest. testOnStopFutureCompletionDirectlyTerminatesAkkaRpcActor fails on azure
> -----------------------------------------------------------------------------------------
>
>                 Key: FLINK-23366
>                 URL: https://issues.apache.org/jira/browse/FLINK-23366
>             Project: Flink
>          Issue Type: Bug
>          Components: Runtime / Coordination
>    Affects Versions: 1.14.0
>            Reporter: Yun Gao
>            Priority: Major
>              Labels: test-stability
>
> https://dev.azure.com/apache-flink/apache-flink/_build/results?buildId=20343&view=logs&j=0da23115-68bb-5dcd-192c-bd4c8adebde1&t=05b74a19-4ee4-5036-c46f-ada307df6cf0&l=7388
> {code:java}
> Jul 12 18:40:57 [ERROR] Tests run: 22, Failures: 1, Errors: 0, Skipped: 0, Time elapsed:
0.208 s <<< FAILURE! - in org.apache.flink.runtime.rpc.akka.AkkaRpcActorTest
> Jul 12 18:40:57 [ERROR] testOnStopFutureCompletionDirectlyTerminatesAkkaRpcActor(org.apache.flink.runtime.rpc.akka.AkkaRpcActorTest)
 Time elapsed: 0.013 s  <<< FAILURE!
> Jul 12 18:40:57 java.lang.AssertionError: 
> Jul 12 18:40:57 
> Jul 12 18:40:57 Expected: is <false>
> Jul 12 18:40:57      but: was <true>
> Jul 12 18:40:57 	at org.hamcrest.MatcherAssert.assertThat(MatcherAssert.java:20)
> Jul 12 18:40:57 	at org.junit.Assert.assertThat(Assert.java:964)
> Jul 12 18:40:57 	at org.junit.Assert.assertThat(Assert.java:930)
> Jul 12 18:40:57 	at org.apache.flink.runtime.rpc.akka.AkkaRpcActorTest.testOnStopFutureCompletionDirectlyTerminatesAkkaRpcActor(AkkaRpcActorTest.java:375)
> Jul 12 18:40:57 	at sun.reflect.NativeMethodAccessorImpl.invoke0(Native Method)
> Jul 12 18:40:57 	at sun.reflect.NativeMethodAccessorImpl.invoke(NativeMethodAccessorImpl.java:62)
> Jul 12 18:40:57 	at sun.reflect.DelegatingMethodAccessorImpl.invoke(DelegatingMethodAccessorImpl.java:43)
> Jul 12 18:40:57 	at java.lang.reflect.Method.invoke(Method.java:498)
> Jul 12 18:40:57 	at org.junit.runners.model.FrameworkMethod$1.runReflectiveCall(FrameworkMethod.java:59)
> Jul 12 18:40:57 	at org.junit.internal.runners.model.ReflectiveCallable.run(ReflectiveCallable.java:12)
> Jul 12 18:40:57 	at org.junit.runners.model.FrameworkMethod.invokeExplosively(FrameworkMethod.java:56)
> Jul 12 18:40:57 	at org.junit.internal.runners.statements.InvokeMethod.evaluate(InvokeMethod.java:17)
> Jul 12 18:40:57 	at org.apache.flink.util.TestNameProvider$1.evaluate(TestNameProvider.java:45)
> Jul 12 18:40:57 	at org.junit.rules.TestWatcher$1.evaluate(TestWatcher.java:61)
> Jul 12 18:40:57 	at org.junit.runners.ParentRunner$3.evaluate(ParentRunner.java:306)
> Jul 12 18:40:57 	at org.junit.runners.BlockJUnit4ClassRunner$1.evaluate(BlockJUnit4ClassRunner.java:100)
> Jul 12 18:40:57 	at org.junit.runners.ParentRunner.runLeaf(ParentRunner.java:366)
> Jul 12 18:40:57 	at org.junit.runners.BlockJUnit4ClassRunner.runChild(BlockJUnit4ClassRunner.java:103)
> Jul 12 18:40:57 	at org.junit.runners.BlockJUnit4ClassRunner.runChild(BlockJUnit4ClassRunner.java:63)
> Jul 12 18:40:57 	at org.junit.runners.ParentRunner$4.run(ParentRunner.java:331)
> Jul 12 18:40:57 	at org.junit.runners.ParentRunner$1.schedule(ParentRunner.java:79)
> Jul 12 18:40:57 	at org.junit.runners.ParentRunner.runChildren(ParentRunner.java:329)
> Jul 12 18:40:57 	at org.junit.runners.ParentRunner.access$100(ParentRunner.java:66)
> Jul 12 18:40:57 	at org.junit.runners.ParentRunner$2.evaluate(ParentRunner.java:293)
> Jul 12 18:40:57 	at org.junit.internal.runners.statements.RunBefores.evaluate(RunBefores.java:26)
> Jul 12 18:40:57 	at org.junit.internal.runners.statements.RunAfters.evaluate(RunAfters.java:27)
> Jul 12 18:40:57 	at org.junit.runners.ParentRunner$3.evaluate(ParentRunner.java:306)
> Jul 12 18:40:57 	at org.junit.runners.ParentRunner.run(ParentRunner.java:413)
> Jul 12 18:40:57 	at org.apache.maven.surefire.junit4.JUnit4Provider.execute(JUnit4Provider.java:365)
> Jul 12 18:40:57 	at org.apache.maven.surefire.junit4.JUnit4Provider.executeWithRerun(JUnit4Provider.java:273)
> Jul 12 18:40:57 	at org.apache.maven.surefire.junit4.JUnit4Provider.executeTestSet(JUnit4Provider.java:238)
> Jul 12 18:40:57 	at org.apache.maven.surefire.junit4.JUnit4Provider.invoke(JUnit4Provider.java:159)
> Jul 12 18:40:57 	at org.apache.maven.surefire.booter.ForkedBooter.invokeProviderInSameClassLoader(ForkedBooter.java:384)
> Jul 12 18:40:57 	at org.apache.maven.surefire.booter.ForkedBooter.runSuitesInProcess(ForkedBooter.java:345)
> Jul 12 18:40:57 	at org.apache.maven.surefire.booter.ForkedBooter.execute(ForkedBooter.java:126)
> Jul 12 18:40:57 	at org.apache.maven.surefire.booter.ForkedBooter.main(ForkedBooter.java:418)
> Jul 12 18:40:57 
> Jul 12 18:40:57 [INFO] Running org.apache.flink.runtime.rpc.akka.TimeoutCallStackTest
> Jul 12 18:40:58 [INFO] Tests run: 1, Failures: 0, Errors: 0, Skipped: 0, Time elapsed:
0.076 s - in org.apache.flink.runtime.rpc.akka.TimeoutCallStackTest
> Jul 12 18:40:58 [INFO] Running org.apache.flink.runtime.rpc.akka.AkkaRpcActorOversizedResponseMessageTest
> Jul 12 18:40:58 [INFO] Tests run: 13, Failures: 0, Errors: 0, Skipped: 0, Time elapsed:
0.587 s - in org.apache.flink.runtime.rpc.akka.AkkaRpcServiceTest
> Jul 12 18:40:58 [INFO] Tests run: 6, Failures: 0, Errors: 0, Skipped: 0, Time elapsed:
0.159 s - in org.apache.flink.runtime.rpc.akka.AkkaRpcActorOversizedResponseMessageTest
> Jul 12 18:40:58 [INFO] 
> Jul 12 18:40:58 [INFO] Results:
> Jul 12 18:40:58 [INFO] 
> Jul 12 18:40:58 [ERROR] Failures: 
> Jul 12 18:40:58 [ERROR]   AkkaRpcActorTest.testOnStopFutureCompletionDirectlyTerminatesAkkaRpcActor:375

> Jul 12 18:40:58 Expected: is <false>
> Jul 12 18:40:58      but: was <true>
> {code}



--
This message was sent by Atlassian Jira
(v8.3.4#803005)

Mime
View raw message