flink-issues mailing list archives

Site index · List index
Message view « Date » · « Thread »
Top « Date » · « Thread »
From "Guowei Ma (Jira)" <j...@apache.org>
Subject [jira] [Created] (FLINK-22103) testNumberOfBuiltinFunctions fail
Date Fri, 02 Apr 2021 06:01:00 GMT
Guowei Ma created FLINK-22103:
---------------------------------

             Summary: testNumberOfBuiltinFunctions fail
                 Key: FLINK-22103
                 URL: https://issues.apache.org/jira/browse/FLINK-22103
             Project: Flink
          Issue Type: Bug
          Components: Connectors / Hive
    Affects Versions: 1.13.0
            Reporter: Guowei Ma


https://dev.azure.com/apache-flink/apache-flink/_build/results?buildId=15996&view=logs&j=8fd975ef-f478-511d-4997-6f15fe8a1fd3&t=ac0fa443-5d45-5a6b-3597-0310ecc1d2ab&l=24281

{code:java}
[ERROR] Tests run: 10, Failures: 1, Errors: 0, Skipped: 0, Time elapsed: 12.867 s <<<
FAILURE! - in org.apache.flink.table.module.hive.HiveModuleTest
[ERROR] testNumberOfBuiltinFunctions(org.apache.flink.table.module.hive.HiveModuleTest)  Time
elapsed: 0.006 s  <<< FAILURE!
java.lang.AssertionError: expected:<222> but was:<220>
	at org.junit.Assert.fail(Assert.java:88)
	at org.junit.Assert.failNotEquals(Assert.java:834)
	at org.junit.Assert.assertEquals(Assert.java:645)
	at org.junit.Assert.assertEquals(Assert.java:631)
	at org.apache.flink.table.module.hive.HiveModuleTest.verifyNumBuiltInFunctions(HiveModuleTest.java:89)
	at org.apache.flink.table.module.hive.HiveModuleTest.testNumberOfBuiltinFunctions(HiveModuleTest.java:60)
	at sun.reflect.NativeMethodAccessorImpl.invoke0(Native Method)
	at sun.reflect.NativeMethodAccessorImpl.invoke(NativeMethodAccessorImpl.java:62)
	at sun.reflect.DelegatingMethodAccessorImpl.invoke(DelegatingMethodAccessorImpl.java:43)
	at java.lang.reflect.Method.invoke(Method.java:498)
	at org.junit.runners.model.FrameworkMethod$1.runReflectiveCall(FrameworkMethod.java:50)
	at org.junit.internal.runners.model.ReflectiveCallable.run(ReflectiveCallable.java:12)
	at org.junit.runners.model.FrameworkMethod.invokeExplosively(FrameworkMethod.java:47)
	at org.junit.internal.runners.statements.InvokeMethod.evaluate(InvokeMethod.java:17)
	at org.junit.rules.ExternalResource$1.evaluate(ExternalResource.java:48)
	at org.junit.rules.RunRules.evaluate(RunRules.java:20)
	at org.junit.runners.ParentRunner.runLeaf(ParentRunner.java:325)
	at org.junit.runners.BlockJUnit4ClassRunner.runChild(BlockJUnit4ClassRunner.java:78)
	at org.junit.runners.BlockJUnit4ClassRunner.runChild(BlockJUnit4ClassRunner.java:57)
	at org.junit.runners.ParentRunner$3.run(ParentRunner.java:290)
	at org.junit.runners.ParentRunner$1.schedule(ParentRunner.java:71)
	at org.junit.runners.ParentRunner.runChildren(ParentRunner.java:288)
	at org.junit.runners.ParentRunner.access$000(ParentRunner.java:58)
	at org.junit.runners.ParentRunner$2.evaluate(ParentRunner.java:268)
	at org.junit.runners.ParentRunner.run(ParentRunner.java:363)
	at org.apache.maven.surefire.junit4.JUnit4Provider.execute(JUnit4Provider.java:365)
	at org.apache.maven.surefire.junit4.JUnit4Provider.executeWithRerun(JUnit4Provider.java:273)
	at org.apache.maven.surefire.junit4.JUnit4Provider.executeTestSet(JUnit4Provider.java:238)
	at org.apache.maven.surefire.junit4.JUnit4Provider.invoke(JUnit4Provider.java:159)

{code}




--
This message was sent by Atlassian Jira
(v8.3.4#803005)

Mime
View raw message