flink-issues mailing list archives

Site index · List index
Message view « Date » · « Thread »
Top « Date » · « Thread »
From "Juha Mynttinen (Jira)" <j...@apache.org>
Subject [jira] [Updated] (FLINK-19770) mvn clean verify - testConfigurePythonExecution failing
Date Thu, 22 Oct 2020 13:04:00 GMT

     [ https://issues.apache.org/jira/browse/FLINK-19770?page=com.atlassian.jira.plugin.system.issuetabpanels:all-tabpanel
]

Juha Mynttinen updated FLINK-19770:
-----------------------------------
    Component/s: Build System

> mvn clean verify - testConfigurePythonExecution failing
> -------------------------------------------------------
>
>                 Key: FLINK-19770
>                 URL: https://issues.apache.org/jira/browse/FLINK-19770
>             Project: Flink
>          Issue Type: Bug
>          Components: Build System
>    Affects Versions: 1.11.2
>            Reporter: Juha Mynttinen
>            Priority: Major
>
> The PR [https://github.com/apache/flink/pull/13322] lately added the test method 
testConfigurePythonExecution in org.apache.flink.client.cli.PythonProgramOptionsTest.
>  
> "mvn clean verify" fails for me in  testConfigurePythonExecution:
>  
> ...
> INFO] Running org.apache.flink.client.cli.PythonProgramOptionsTest
> [ERROR] Tests run: 3, Failures: 0, Errors: 1, Skipped: 0, Time elapsed: 0.433 s <<<
FAILURE! - in org.apache.flink.client.cli.PythonProgramOptionsTest
> [ERROR] testConfigurePythonExecution(org.apache.flink.client.cli.PythonProgramOptionsTest)
 Time elapsed: 0.019 s  <<< ERROR!
> java.nio.file.NoSuchFileException: target/dummy-job-jar
> at java.base/sun.nio.fs.UnixException.translateToIOException(UnixException.java:92)
> at java.base/sun.nio.fs.UnixException.rethrowAsIOException(UnixException.java:111)
> at java.base/sun.nio.fs.UnixException.rethrowAsIOException(UnixException.java:116)
> at java.base/sun.nio.fs.UnixFileAttributeViews$Basic.readAttributes(UnixFileAttributeViews.java:55)
> at java.base/sun.nio.fs.UnixFileSystemProvider.readAttributes(UnixFileSystemProvider.java:149)
> at java.base/sun.nio.fs.LinuxFileSystemProvider.readAttributes(LinuxFileSystemProvider.java:99)
> at java.base/java.nio.file.Files.readAttributes(Files.java:1763)
> at java.base/java.nio.file.FileTreeWalker.getAttributes(FileTreeWalker.java:219)
> at java.base/java.nio.file.FileTreeWalker.visit(FileTreeWalker.java:276)
> at java.base/java.nio.file.FileTreeWalker.walk(FileTreeWalker.java:322)
> at java.base/java.nio.file.Files.walkFileTree(Files.java:2716)
> at java.base/java.nio.file.Files.walkFileTree(Files.java:2796)
> at org.apache.flink.client.cli.PythonProgramOptionsTest.testConfigurePythonExecution(PythonProgramOptionsTest.java:131)
> at java.base/jdk.internal.reflect.NativeMethodAccessorImpl.invoke0(Native Method)
> at java.base/jdk.internal.reflect.NativeMethodAccessorImpl.invoke(NativeMethodAccessorImpl.java:62)
> at java.base/jdk.internal.reflect.DelegatingMethodAccessorImpl.invoke(DelegatingMethodAccessorImpl.java:43)
> at java.base/java.lang.reflect.Method.invoke(Method.java:566)
> at org.junit.runners.model.FrameworkMethod$1.runReflectiveCall(FrameworkMethod.java:50)
> at org.junit.internal.runners.model.ReflectiveCallable.run(ReflectiveCallable.java:12)
> at org.junit.runners.model.FrameworkMethod.invokeExplosively(FrameworkMethod.java:47)
> at org.junit.internal.runners.statements.InvokeMethod.evaluate(InvokeMethod.java:17)
> at org.junit.internal.runners.statements.RunBefores.evaluate(RunBefores.java:26)
> at org.junit.runners.ParentRunner.runLeaf(ParentRunner.java:325)
> at org.junit.runners.BlockJUnit4ClassRunner.runChild(BlockJUnit4ClassRunner.java:78)
> at org.junit.runners.BlockJUnit4ClassRunner.runChild(BlockJUnit4ClassRunner.java:57)
> at org.junit.runners.ParentRunner$3.run(ParentRunner.java:290)
> at org.junit.runners.ParentRunner$1.schedule(ParentRunner.java:71)
> at org.junit.runners.ParentRunner.runChildren(ParentRunner.java:288)
> at org.junit.runners.ParentRunner.access$000(ParentRunner.java:58)
> at org.junit.runners.ParentRunner$2.evaluate(ParentRunner.java:268)
> at org.junit.runners.ParentRunner.run(ParentRunner.java:363)
> at org.junit.runners.Suite.runChild(Suite.java:128)
> at org.junit.runners.Suite.runChild(Suite.java:27)
> at org.junit.runners.ParentRunner$3.run(ParentRunner.java:290)
> at org.junit.runners.ParentRunner$1.schedule(ParentRunner.java:71)
> at org.junit.runners.ParentRunner.runChildren(ParentRunner.java:288)
> at org.junit.runners.ParentRunner.access$000(ParentRunner.java:58)
> at org.junit.runners.ParentRunner$2.evaluate(ParentRunner.java:268)
> at org.junit.runners.ParentRunner.run(ParentRunner.java:363)
> at org.apache.maven.surefire.junitcore.JUnitCore.run(JUnitCore.java:55)
> at org.apache.maven.surefire.junitcore.JUnitCoreWrapper.createRequestAndRun(JUnitCoreWrapper.java:137)
> at org.apache.maven.surefire.junitcore.JUnitCoreWrapper.executeEager(JUnitCoreWrapper.java:107)
> at org.apache.maven.surefire.junitcore.JUnitCoreWrapper.execute(JUnitCoreWrapper.java:83)
> at org.apache.maven.surefire.junitcore.JUnitCoreWrapper.execute(JUnitCoreWrapper.java:75)
> at org.apache.maven.surefire.junitcore.JUnitCoreProvider.invoke(JUnitCoreProvider.java:158)
> at org.apache.maven.surefire.booter.ForkedBooter.invokeProviderInSameClassLoader(ForkedBooter.java:384)
> at org.apache.maven.surefire.booter.ForkedBooter.runSuitesInProcess(ForkedBooter.java:345)
> at org.apache.maven.surefire.booter.ForkedBooter.execute(ForkedBooter.java:126)
> at org.apache.maven.surefire.booter.ForkedBooter.main(ForkedBooter.java:418)
> ...
> [ERROR] Errors:
> [ERROR]   PythonProgramOptionsTest.testConfigurePythonExecution:131 » NoSuchFile target/...
>  
> The issue is that the test expects a file to exist in {{target}}, but it's not there.
This happens when running mvn in local env.
> The test passes in CI environment, because there the process first builds Flink creating
the file and then this test is run. 



--
This message was sent by Atlassian Jira
(v8.3.4#803005)

Mime
View raw message