flink-issues mailing list archives

Site index · List index
Message view « Date » · « Thread »
Top « Date » · « Thread »
From "Ufuk Celebi (JIRA)" <j...@apache.org>
Subject [jira] [Created] (FLINK-4995) YarnFlinkResourceManagerTest JobManager Lost Leadership test failed
Date Wed, 02 Nov 2016 14:23:59 GMT
Ufuk Celebi created FLINK-4995:
----------------------------------

             Summary: YarnFlinkResourceManagerTest JobManager Lost Leadership test failed
                 Key: FLINK-4995
                 URL: https://issues.apache.org/jira/browse/FLINK-4995
             Project: Flink
          Issue Type: Bug
          Components: YARN
    Affects Versions: 1.1.3
            Reporter: Ufuk Celebi


{code}
Running org.apache.flink.yarn.YarnFlinkResourceManagerTest
Tests run: 1, Failures: 1, Errors: 0, Skipped: 0, Time elapsed: 1.621 sec <<< FAILURE!
- in org.apache.flink.yarn.YarnFlinkResourceManagerTest
testYarnFlinkResourceManagerJobManagerLostLeadership(org.apache.flink.yarn.YarnFlinkResourceManagerTest)
 Time elapsed: 0.397 sec  <<< FAILURE!
java.lang.AssertionError: assertion failed: expected class org.apache.flink.runtime.messages.Acknowledge,
found class org.apache.flink.runtime.clusterframework.messages.RegisterResourceManager
	at scala.Predef$.assert(Predef.scala:165)
	at akka.testkit.TestKitBase$class.expectMsgClass_internal(TestKit.scala:424)
	at akka.testkit.TestKitBase$class.expectMsgClass(TestKit.scala:419)
	at akka.testkit.TestKit.expectMsgClass(TestKit.scala:718)
	at akka.testkit.JavaTestKit.expectMsgClass(JavaTestKit.java:408)
	at org.apache.flink.yarn.YarnFlinkResourceManagerTest$1.<init>(YarnFlinkResourceManagerTest.java:179)
	at org.apache.flink.yarn.YarnFlinkResourceManagerTest.testYarnFlinkResourceManagerJobManagerLostLeadership(YarnFlinkResourceManagerTest.java:90)
{code}

https://travis-ci.org/uce/flink/jobs/172552415

Failed in a branch with an unrelated change in TaskTest.



--
This message was sent by Atlassian JIRA
(v6.3.4#6332)

Mime
View raw message