flink-issues mailing list archives

Site index · List index
Message view « Date » · « Thread »
Top « Date » · « Thread »
From "Todd Lisonbee (JIRA)" <j...@apache.org>
Subject [jira] [Updated] (FLINK-3737) WikipediaEditsSourceTest.testWikipediaEditsSource() fails locally
Date Mon, 11 Apr 2016 18:39:25 GMT

     [ https://issues.apache.org/jira/browse/FLINK-3737?page=com.atlassian.jira.plugin.system.issuetabpanels:all-tabpanel
]

Todd Lisonbee updated FLINK-3737:
---------------------------------
    Description: 
This test fails for me locally from both Maven command line and IntelliJ.

This is on latest master as of 4/11/2016, apache-maven-3.1.1, openjdk version "1.8.0_51"

(It might be because I am behind a proxy).

Error message:

java.lang.NullPointerException
	at org.schwering.irc.lib.IRCConnection.send(IRCConnection.java:394)
	at org.apache.flink.streaming.connectors.wikiedits.WikipediaEditEventIrcStream.leave(WikipediaEditEventIrcStream.java:77)
	at org.apache.flink.streaming.connectors.wikiedits.WikipediaEditsSource.close(WikipediaEditsSource.java:84)
	at org.apache.flink.api.common.functions.util.FunctionUtils.closeFunction(FunctionUtils.java:45)
	at org.apache.flink.streaming.api.operators.AbstractUdfStreamOperator.dispose(AbstractUdfStreamOperator.java:107)
	at org.apache.flink.streaming.runtime.tasks.StreamTask.disposeAllOperators(StreamTask.java:347)
	at org.apache.flink.streaming.runtime.tasks.StreamTask.invoke(StreamTask.java:294)
	at org.apache.flink.runtime.taskmanager.Task.run(Task.java:579)
	at java.lang.Thread.run(Thread.java:745)
Tests run: 1, Failures: 1, Errors: 0, Skipped: 0, Time elapsed: 64.749 sec <<< FAILURE!
- in org.apache.flink.streaming.connectors.wikiedits.WikipediaEditsSourceTest
testWikipediaEditsSource(org.apache.flink.streaming.connectors.wikiedits.WikipediaEditsSourceTest)
 Time elapsed: 64.744 sec  <<< FAILURE!
org.junit.ComparisonFailure: expected:<[Expected test exception]> but was:<[Connection
timed out]>
	at org.junit.Assert.assertEquals(Assert.java:115)
	at org.junit.Assert.assertEquals(Assert.java:144)
	at org.apache.flink.streaming.connectors.wikiedits.WikipediaEditsSourceTest.testWikipediaEditsSource(WikipediaEditsSourceTest.java:53)


  was:
This test fails for me locally.  It might be because I am behind a proxy.

This is on latest master as of 4/11/2016, apache-maven-3.1.1, openjdk version "1.8.0_51"

Error message:

java.lang.NullPointerException
	at org.schwering.irc.lib.IRCConnection.send(IRCConnection.java:394)
	at org.apache.flink.streaming.connectors.wikiedits.WikipediaEditEventIrcStream.leave(WikipediaEditEventIrcStream.java:77)
	at org.apache.flink.streaming.connectors.wikiedits.WikipediaEditsSource.close(WikipediaEditsSource.java:84)
	at org.apache.flink.api.common.functions.util.FunctionUtils.closeFunction(FunctionUtils.java:45)
	at org.apache.flink.streaming.api.operators.AbstractUdfStreamOperator.dispose(AbstractUdfStreamOperator.java:107)
	at org.apache.flink.streaming.runtime.tasks.StreamTask.disposeAllOperators(StreamTask.java:347)
	at org.apache.flink.streaming.runtime.tasks.StreamTask.invoke(StreamTask.java:294)
	at org.apache.flink.runtime.taskmanager.Task.run(Task.java:579)
	at java.lang.Thread.run(Thread.java:745)
Tests run: 1, Failures: 1, Errors: 0, Skipped: 0, Time elapsed: 64.749 sec <<< FAILURE!
- in org.apache.flink.streaming.connectors.wikiedits.WikipediaEditsSourceTest
testWikipediaEditsSource(org.apache.flink.streaming.connectors.wikiedits.WikipediaEditsSourceTest)
 Time elapsed: 64.744 sec  <<< FAILURE!
org.junit.ComparisonFailure: expected:<[Expected test exception]> but was:<[Connection
timed out]>
	at org.junit.Assert.assertEquals(Assert.java:115)
	at org.junit.Assert.assertEquals(Assert.java:144)
	at org.apache.flink.streaming.connectors.wikiedits.WikipediaEditsSourceTest.testWikipediaEditsSource(WikipediaEditsSourceTest.java:53)



> WikipediaEditsSourceTest.testWikipediaEditsSource() fails locally
> -----------------------------------------------------------------
>
>                 Key: FLINK-3737
>                 URL: https://issues.apache.org/jira/browse/FLINK-3737
>             Project: Flink
>          Issue Type: Bug
>          Components: Tests
>            Reporter: Todd Lisonbee
>            Priority: Minor
>              Labels: test-stability
>
> This test fails for me locally from both Maven command line and IntelliJ.
> This is on latest master as of 4/11/2016, apache-maven-3.1.1, openjdk version "1.8.0_51"
> (It might be because I am behind a proxy).
> Error message:
> java.lang.NullPointerException
> 	at org.schwering.irc.lib.IRCConnection.send(IRCConnection.java:394)
> 	at org.apache.flink.streaming.connectors.wikiedits.WikipediaEditEventIrcStream.leave(WikipediaEditEventIrcStream.java:77)
> 	at org.apache.flink.streaming.connectors.wikiedits.WikipediaEditsSource.close(WikipediaEditsSource.java:84)
> 	at org.apache.flink.api.common.functions.util.FunctionUtils.closeFunction(FunctionUtils.java:45)
> 	at org.apache.flink.streaming.api.operators.AbstractUdfStreamOperator.dispose(AbstractUdfStreamOperator.java:107)
> 	at org.apache.flink.streaming.runtime.tasks.StreamTask.disposeAllOperators(StreamTask.java:347)
> 	at org.apache.flink.streaming.runtime.tasks.StreamTask.invoke(StreamTask.java:294)
> 	at org.apache.flink.runtime.taskmanager.Task.run(Task.java:579)
> 	at java.lang.Thread.run(Thread.java:745)
> Tests run: 1, Failures: 1, Errors: 0, Skipped: 0, Time elapsed: 64.749 sec <<<
FAILURE! - in org.apache.flink.streaming.connectors.wikiedits.WikipediaEditsSourceTest
> testWikipediaEditsSource(org.apache.flink.streaming.connectors.wikiedits.WikipediaEditsSourceTest)
 Time elapsed: 64.744 sec  <<< FAILURE!
> org.junit.ComparisonFailure: expected:<[Expected test exception]> but was:<[Connection
timed out]>
> 	at org.junit.Assert.assertEquals(Assert.java:115)
> 	at org.junit.Assert.assertEquals(Assert.java:144)
> 	at org.apache.flink.streaming.connectors.wikiedits.WikipediaEditsSourceTest.testWikipediaEditsSource(WikipediaEditsSourceTest.java:53)



--
This message was sent by Atlassian JIRA
(v6.3.4#6332)

Mime
View raw message