flink-issues mailing list archives

Site index · List index
Message view « Date » · « Thread »
Top « Date » · « Thread »
From "ASF GitHub Bot (JIRA)" <j...@apache.org>
Subject [jira] [Commented] (FLINK-2180) Streaming iterate test fails spuriously
Date Tue, 09 Jun 2015 07:28:00 GMT

    [ https://issues.apache.org/jira/browse/FLINK-2180?page=com.atlassian.jira.plugin.system.issuetabpanels:comment-tabpanel&focusedCommentId=14578479#comment-14578479
] 

ASF GitHub Bot commented on FLINK-2180:
---------------------------------------

Github user mbalassi commented on the pull request:

    https://github.com/apache/flink/pull/802#issuecomment-110258888
  
    Please properly rebase this branch, so we will not see the "noise" commits from others.


> Streaming iterate test fails spuriously
> ---------------------------------------
>
>                 Key: FLINK-2180
>                 URL: https://issues.apache.org/jira/browse/FLINK-2180
>             Project: Flink
>          Issue Type: Bug
>          Components: Streaming
>    Affects Versions: 0.9
>            Reporter: Márton Balassi
>            Assignee: Gábor Hermann
>
> Following output seen occasionally: 
> Tests run: 3, Failures: 1, Errors: 0, Skipped: 0, Time elapsed: 3.667 sec <<<
FAILURE! - in org.apache.flink.streaming.api.IterateTest
> test(org.apache.flink.streaming.api.IterateTest)  Time elapsed: 3.662 sec  <<<
FAILURE!
> java.lang.AssertionError: null
> 	at org.junit.Assert.fail(Assert.java:86)
> 	at org.junit.Assert.assertTrue(Assert.java:41)
> 	at org.junit.Assert.assertTrue(Assert.java:52)
> 	at org.apache.flink.streaming.api.IterateTest.test(IterateTest.java:154)
> See: https://travis-ci.org/mbalassi/flink/jobs/65803465



--
This message was sent by Atlassian JIRA
(v6.3.4#6332)

Mime
View raw message