flink-issues mailing list archives

Site index · List index
Message view « Date » · « Thread »
Top « Date » · « Thread »
From "Robert Metzger (JIRA)" <j...@apache.org>
Subject [jira] [Created] (FLINK-1575) JobManagerConnectionTest.testResolveUnreachableActorRemoteHost times out on travis
Date Tue, 17 Feb 2015 18:04:12 GMT
Robert Metzger created FLINK-1575:
-------------------------------------

             Summary: JobManagerConnectionTest.testResolveUnreachableActorRemoteHost times
out on travis
                 Key: FLINK-1575
                 URL: https://issues.apache.org/jira/browse/FLINK-1575
             Project: Flink
          Issue Type: Bug
            Reporter: Robert Metzger


This might be related to FLINK-1529.

I saw this issue now at least twice on travis:
https://travis-ci.org/rmetzger/flink/jobs/51108554

{code}
Tests run: 2, Failures: 0, Errors: 2, Skipped: 0, Time elapsed: 200.266 sec <<< FAILURE!
- in org.apache.flink.runtime.jobmanager.JobManagerConnectionTest
testResolveUnreachableActorRemoteHost(org.apache.flink.runtime.jobmanager.JobManagerConnectionTest)
 Time elapsed: 100.215 sec  <<< ERROR!
java.util.concurrent.TimeoutException: Futures timed out after [100000 milliseconds]
	at scala.concurrent.impl.Promise$DefaultPromise.ready(Promise.scala:219)
	at scala.concurrent.impl.Promise$DefaultPromise.result(Promise.scala:223)
	at scala.concurrent.Await$$anonfun$result$1.apply(package.scala:107)
	at scala.concurrent.BlockContext$DefaultBlockContext$.blockOn(BlockContext.scala:53)
	at scala.concurrent.Await$.result(package.scala:107)
	at akka.remote.Remoting.start(Remoting.scala:173)
	at akka.remote.RemoteActorRefProvider.init(RemoteActorRefProvider.scala:184)
	at akka.actor.ActorSystemImpl._start$lzycompute(ActorSystem.scala:579)
	at akka.actor.ActorSystemImpl._start(ActorSystem.scala:577)
	at akka.actor.ActorSystemImpl.start(ActorSystem.scala:588)
	at akka.actor.ActorSystem$.apply(ActorSystem.scala:111)
	at akka.actor.ActorSystem$.apply(ActorSystem.scala:104)
	at akka.actor.ActorSystem$.create(ActorSystem.scala:66)
	at org.apache.flink.runtime.akka.AkkaUtils$.createActorSystem(AkkaUtils.scala:71)
	at org.apache.flink.runtime.akka.AkkaUtils$.createActorSystem(AkkaUtils.scala:61)
	at org.apache.flink.runtime.jobmanager.JobManagerConnectionTest.testResolveUnreachableActorRemoteHost(JobManagerConnectionTest.scala:88)

testResolveUnreachableActorLocalHost(org.apache.flink.runtime.jobmanager.JobManagerConnectionTest)
 Time elapsed: 100.031 sec  <<< ERROR!
java.util.concurrent.TimeoutException: Futures timed out after [100000 milliseconds]
	at scala.concurrent.impl.Promise$DefaultPromise.ready(Promise.scala:219)
	at scala.concurrent.impl.Promise$DefaultPromise.result(Promise.scala:223)
	at scala.concurrent.Await$$anonfun$result$1.apply(package.scala:107)
	at scala.concurrent.BlockContext$DefaultBlockContext$.blockOn(BlockContext.scala:53)
	at scala.concurrent.Await$.result(package.scala:107)
	at akka.remote.Remoting.start(Remoting.scala:173)
	at akka.remote.RemoteActorRefProvider.init(RemoteActorRefProvider.scala:184)
	at akka.actor.ActorSystemImpl._start$lzycompute(ActorSystem.scala:579)
	at akka.actor.ActorSystemImpl._start(ActorSystem.scala:577)
	at akka.actor.ActorSystemImpl.start(ActorSystem.scala:588)
	at akka.actor.ActorSystem$.apply(ActorSystem.scala:111)
	at akka.actor.ActorSystem$.apply(ActorSystem.scala:104)
	at akka.actor.ActorSystem$.create(ActorSystem.scala:66)
	at org.apache.flink.runtime.akka.AkkaUtils$.createActorSystem(AkkaUtils.scala:71)
	at org.apache.flink.runtime.akka.AkkaUtils$.createActorSystem(AkkaUtils.scala:61)
	at org.apache.flink.runtime.jobmanager.JobManagerConnectionTest.testResolveUnreachableActorLocalHost(JobManagerConnectionTest.scala:45)

Running org.apache.flink.runtime.operators.hash.MemoryHashTableTest
[ERROR] [02/17/2015 17:38:04.250] [main] [Remoting] Remoting error: [Startup timed out] [
akka.remote.RemoteTransportException: Startup timed out
	at akka.remote.Remoting.akka$remote$Remoting$$notifyError(Remoting.scala:129)
	at akka.remote.Remoting.start(Remoting.scala:191)
	at akka.remote.RemoteActorRefProvider.init(RemoteActorRefProvider.scala:184)
	at akka.actor.ActorSystemImpl._start$lzycompute(ActorSystem.scala:579)
	at akka.actor.ActorSystemImpl._start(ActorSystem.scala:577)
	at akka.actor.ActorSystemImpl.start(ActorSystem.scala:588)
	at akka.actor.ActorSystem$.apply(ActorSystem.scala:111)
	at akka.actor.ActorSystem$.apply(ActorSystem.scala:104)
	at akka.actor.ActorSystem$.create(ActorSystem.scala:66)
	at org.apache.flink.runtime.akka.AkkaUtils$.createActorSystem(AkkaUtils.scala:71)
	at org.apache.flink.runtime.akka.AkkaUtils$.createActorSystem(AkkaUtils.scala:61)
	at org.apache.flink.runtime.jobmanager.JobManager$.runJobManager(JobManager.scala:605)
	at org.apache.flink.runtime.jobmanager.JobManager.runJobManager(JobManager.scala)
	at org.apache.flink.runtime.jobmanager.JobManagerStartupTest.testJobManagerStartupFails(JobManagerStartupTest.java:86)
	at sun.reflect.NativeMethodAccessorImpl.invoke0(Native Method)
	at sun.reflect.NativeMethodAccessorImpl.invoke(NativeMethodAccessorImpl.java:57)
	at sun.reflect.DelegatingMethodAccessorImpl.invoke(DelegatingMethodAccessorImpl.java:43)
	at java.lang.reflect.Method.invoke(Method.java:622)
	at org.junit.runners.model.FrameworkMethod$1.runReflectiveCall(FrameworkMethod.java:47)
	at org.junit.internal.runners.model.ReflectiveCallable.run(ReflectiveCallable.java:12)
	at org.junit.runners.model.FrameworkMethod.invokeExplosively(FrameworkMethod.java:44)
	at org.junit.internal.runners.statements.InvokeMethod.evaluate(InvokeMethod.java:17)
	at org.junit.runners.ParentRunner.runLeaf(ParentRunner.java:271)
	at org.junit.runners.BlockJUnit4ClassRunner.runChild(BlockJUnit4ClassRunner.java:70)
	at org.junit.runners.BlockJUnit4ClassRunner.runChild(BlockJUnit4ClassRunner.java:50)
	at org.junit.runners.ParentRunner$3.run(ParentRunner.java:238)
	at org.junit.runners.ParentRunner$1.schedule(ParentRunner.java:63)
	at org.junit.runners.ParentRunner.runChildren(ParentRunner.java:236)
	at org.junit.runners.ParentRunner.access$000(ParentRunner.java:53)
	at org.junit.runners.ParentRunner$2.evaluate(ParentRunner.java:229)
	at org.junit.runners.ParentRunner.run(ParentRunner.java:309)
	at org.apache.maven.surefire.junit4.JUnit4Provider.execute(JUnit4Provider.java:264)
	at org.apache.maven.surefire.junit4.JUnit4Provider.executeTestSet(JUnit4Provider.java:153)
	at org.apache.maven.surefire.junit4.JUnit4Provider.invoke(JUnit4Provider.java:124)
	at org.apache.maven.surefire.booter.ForkedBooter.invokeProviderInSameClassLoader(ForkedBooter.java:200)
	at org.apache.maven.surefire.booter.ForkedBooter.runSuitesInProcess(ForkedBooter.java:153)
	at org.apache.maven.surefire.booter.ForkedBooter.main(ForkedBooter.java:103)
Caused by: java.util.concurrent.TimeoutException: Futures timed out after [100000 milliseconds]
	at scala.concurrent.impl.Promise$DefaultPromise.ready(Promise.scala:219)
	at scala.concurrent.impl.Promise$DefaultPromise.result(Promise.scala:223)
	at scala.concurrent.Await$$anonfun$result$1.apply(package.scala:107)
	at scala.concurrent.BlockContext$DefaultBlockContext$.blockOn(BlockContext.scala:53)
	at scala.concurrent.Await$.result(package.scala:107)
	at akka.remote.Remoting.start(Remoting.scala:173)
	... 35 more
]
Tests run: 2, Failures: 1, Errors: 0, Skipped: 0, Time elapsed: 200.128 sec <<< FAILURE!
- in org.apache.flink.runtime.jobmanager.JobManagerStartupTest
testStartupWithPortInUse(org.apache.flink.runtime.jobmanager.JobManagerStartupTest)  Time
elapsed: 100.099 sec  <<< FAILURE!
java.lang.AssertionError: Received wrong exception
	at org.junit.Assert.fail(Assert.java:88)
	at org.apache.flink.runtime.jobmanager.JobManagerStartupTest.testStartupWithPortInUse(JobManagerStartupTest.java:60)
{code}




--
This message was sent by Atlassian JIRA
(v6.3.4#6332)

Mime
View raw message