flink-dev mailing list archives

Site index · List index
Message view « Date » · « Thread »
Top « Date » · « Thread »
From "Chesnay Schepler (JIRA)" <j...@apache.org>
Subject [jira] [Created] (FLINK-5415) ContinuousFileProcessingTest failed on travis
Date Thu, 05 Jan 2017 16:42:58 GMT
Chesnay Schepler created FLINK-5415:
---------------------------------------

             Summary: ContinuousFileProcessingTest failed on travis
                 Key: FLINK-5415
                 URL: https://issues.apache.org/jira/browse/FLINK-5415
             Project: Flink
          Issue Type: Improvement
    Affects Versions: 1.3.0
            Reporter: Chesnay Schepler


https://s3.amazonaws.com/archive.travis-ci.org/jobs/189171123/log.txt

testFunctionRestore(org.apache.flink.hdfstests.ContinuousFileProcessingTest)  Time elapsed:
0.162 sec  <<< FAILURE!
java.lang.AssertionError: expected:<1483623669528> but was:<-9223372036854775808>
	at org.junit.Assert.fail(Assert.java:88)
	at org.junit.Assert.failNotEquals(Assert.java:834)
	at org.junit.Assert.assertEquals(Assert.java:645)
	at org.junit.Assert.assertEquals(Assert.java:631)
	at org.apache.flink.hdfstests.ContinuousFileProcessingTest.testFunctionRestore(ContinuousFileProcessingTest.java:761)

testProcessOnce(org.apache.flink.hdfstests.ContinuousFileProcessingTest)  Time elapsed: 0.045
sec  <<< FAILURE!
java.lang.AssertionError: null
	at org.junit.Assert.fail(Assert.java:86)
	at org.junit.Assert.assertTrue(Assert.java:41)
	at org.junit.Assert.assertFalse(Assert.java:64)
	at org.junit.Assert.assertFalse(Assert.java:74)
	at org.apache.flink.hdfstests.ContinuousFileProcessingTest.createFileAndFillWithData(ContinuousFileProcessingTest.java:958)
	at org.apache.flink.hdfstests.ContinuousFileProcessingTest.testProcessOnce(ContinuousFileProcessingTest.java:675)

testFileReadingOperatorWithIngestionTime(org.apache.flink.hdfstests.ContinuousFileProcessingTest)
 Time elapsed: 0.002 sec  <<< FAILURE!
java.lang.AssertionError: null
	at org.junit.Assert.fail(Assert.java:86)
	at org.junit.Assert.assertTrue(Assert.java:41)
	at org.junit.Assert.assertFalse(Assert.java:64)
	at org.junit.Assert.assertFalse(Assert.java:74)
	at org.apache.flink.hdfstests.ContinuousFileProcessingTest.createFileAndFillWithData(ContinuousFileProcessingTest.java:958)
	at org.apache.flink.hdfstests.ContinuousFileProcessingTest.testFileReadingOperatorWithIngestionTime(ContinuousFileProcessingTest.java:150)

testSortingOnModTime(org.apache.flink.hdfstests.ContinuousFileProcessingTest)  Time elapsed:
0.002 sec  <<< FAILURE!
java.lang.AssertionError: null
	at org.junit.Assert.fail(Assert.java:86)
	at org.junit.Assert.assertTrue(Assert.java:41)
	at org.junit.Assert.assertFalse(Assert.java:64)
	at org.junit.Assert.assertFalse(Assert.java:74)
	at org.apache.flink.hdfstests.ContinuousFileProcessingTest.createFileAndFillWithData(ContinuousFileProcessingTest.java:958)
	at org.apache.flink.hdfstests.ContinuousFileProcessingTest.testSortingOnModTime(ContinuousFileProcessingTest.java:596)

testFileReadingOperatorWithEventTime(org.apache.flink.hdfstests.ContinuousFileProcessingTest)
 Time elapsed: 0.001 sec  <<< FAILURE!
java.lang.AssertionError: null
	at org.junit.Assert.fail(Assert.java:86)
	at org.junit.Assert.assertTrue(Assert.java:41)
	at org.junit.Assert.assertFalse(Assert.java:64)
	at org.junit.Assert.assertFalse(Assert.java:74)
	at org.apache.flink.hdfstests.ContinuousFileProcessingTest.createFileAndFillWithData(ContinuousFileProcessingTest.java:958)
	at org.apache.flink.hdfstests.ContinuousFileProcessingTest.testFileReadingOperatorWithEventTime(ContinuousFileProcessingTest.java:308)

testProcessContinuously(org.apache.flink.hdfstests.ContinuousFileProcessingTest)  Time elapsed:
0.001 sec  <<< FAILURE!
java.lang.AssertionError: null
	at org.junit.Assert.fail(Assert.java:86)
	at org.junit.Assert.assertTrue(Assert.java:41)
	at org.junit.Assert.assertFalse(Assert.java:64)
	at org.junit.Assert.assertFalse(Assert.java:74)
	at org.apache.flink.hdfstests.ContinuousFileProcessingTest.createFileAndFillWithData(ContinuousFileProcessingTest.java:958)
	at org.apache.flink.hdfstests.ContinuousFileProcessingTest.testProcessContinuously(ContinuousFileProcessingTest.java:771)


Results :

Failed tests: 
  ContinuousFileProcessingTest.testFileReadingOperatorWithEventTime:308->createFileAndFillWithData:958
null
  ContinuousFileProcessingTest.testFileReadingOperatorWithIngestionTime:150->createFileAndFillWithData:958
null
  ContinuousFileProcessingTest.testFunctionRestore:761 expected:<1483623669528> but
was:<-9223372036854775808>
  ContinuousFileProcessingTest.testProcessContinuously:771->createFileAndFillWithData:958
null
  ContinuousFileProcessingTest.testProcessOnce:675->createFileAndFillWithData:958 null
  ContinuousFileProcessingTest.testSortingOnModTime:596->createFileAndFillWithData:958
null

Tests run: 36, Failures: 6, Errors: 0, Skipped: 0



--
This message was sent by Atlassian JIRA
(v6.3.4#6332)

Mime
View raw message