flink-dev mailing list archives

Site index · List index
Message view « Date » · « Thread »
Top « Date » · « Thread »
From "Chesnay Schepler (JIRA)" <j...@apache.org>
Subject [jira] [Created] (FLINK-3425) DataSinkTaskTest.Failing[Sorting]DataSinkTask fails on Windows
Date Wed, 17 Feb 2016 09:44:18 GMT
Chesnay Schepler created FLINK-3425:
---------------------------------------

             Summary: DataSinkTaskTest.Failing[Sorting]DataSinkTask fails on Windows
                 Key: FLINK-3425
                 URL: https://issues.apache.org/jira/browse/FLINK-3425
             Project: Flink
          Issue Type: Bug
          Components: Tests
    Affects Versions: 1.0.0
            Reporter: Chesnay Schepler
             Fix For: 1.0.0


Tests run: 7, Failures: 2, Errors: 0, Skipped: 0, Time elapsed: 60.362 sec <<< FAILURE!
- in org.apache.flink.runtime.operators.DataSinkTaskTest
testFailingDataSinkTask(org.apache.flink.runtime.operators.DataSinkTaskTest)  Time elapsed:
4.314 sec  <<< FAILURE!
java.lang.AssertionError: Temp output file has not been removed
        at org.junit.Assert.fail(Assert.java:88)
        at org.junit.Assert.assertTrue(Assert.java:41)
        at org.junit.Assert.assertFalse(Assert.java:64)
        at org.apache.flink.runtime.operators.DataSinkTaskTest.testFailingDataSinkTask(DataSinkTaskTest.java:322)

testFailingSortingDataSinkTask(org.apache.flink.runtime.operators.DataSinkTaskTest)  Time
elapsed: 1.769 sec  <<< FAILURE!
java.lang.AssertionError: Temp output file has not been removed
        at org.junit.Assert.fail(Assert.java:88)
        at org.junit.Assert.assertTrue(Assert.java:41)
        at org.junit.Assert.assertFalse(Assert.java:64)
        at org.apache.flink.runtime.operators.DataSinkTaskTest.testFailingSortingDataSinkTask(DataSinkTaskTest.java:362)




--
This message was sent by Atlassian JIRA
(v6.3.4#6332)

Mime
View raw message