flink-dev mailing list archives

Site index · List index
Message view « Date » · « Thread »
Top « Date » · « Thread »
From "Matthias J. Sax (JIRA)" <j...@apache.org>
Subject [jira] [Created] (FLINK-2599) Failing Test: SlotCountExceedingParallelismTest
Date Mon, 31 Aug 2015 07:42:46 GMT
Matthias J. Sax created FLINK-2599:
--------------------------------------

             Summary: Failing Test: SlotCountExceedingParallelismTest
                 Key: FLINK-2599
                 URL: https://issues.apache.org/jira/browse/FLINK-2599
             Project: Flink
          Issue Type: Bug
          Components: Tests
            Reporter: Matthias J. Sax
            Priority: Critical


{noformat}
Tests run: 2, Failures: 0, Errors: 2, Skipped: 0, Time elapsed: 200.355 sec <<< FAILURE!
- in org.apache.flink.runtime.jobmanager.SlotCountExceedingParallelismTest
org.apache.flink.runtime.jobmanager.SlotCountExceedingParallelismTest Time elapsed: 200.355
sec <<< ERROR!
java.util.concurrent.TimeoutException: Futures timed out after [200000 milliseconds]
at scala.concurrent.impl.Promise$DefaultPromise.ready(Promise.scala:219)
at scala.concurrent.impl.Promise$DefaultPromise.ready(Promise.scala:153)
at scala.concurrent.Await$$anonfun$ready$1.apply(package.scala:95)
at scala.concurrent.Await$$anonfun$ready$1.apply(package.scala:95)
at scala.concurrent.BlockContext$DefaultBlockContext$.blockOn(BlockContext.scala:53)
at scala.concurrent.Await$.ready(package.scala:95)
at org.apache.flink.runtime.minicluster.FlinkMiniCluster.waitForTaskManagersToBeRegistered(FlinkMiniCluster.scala:237)
at org.apache.flink.runtime.minicluster.FlinkMiniCluster.<init>(FlinkMiniCluster.scala:95)
at org.apache.flink.runtime.testingUtils.TestingCluster.<init>(TestingCluster.scala:43)
at org.apache.flink.runtime.testingUtils.TestingCluster.<init>(TestingCluster.scala:51)
at org.apache.flink.runtime.testingUtils.TestingCluster.<init>(TestingCluster.scala:56)
at org.apache.flink.runtime.testingUtils.TestingUtils$.startTestingCluster(TestingUtils.scala:65)
at org.apache.flink.runtime.testingUtils.TestingUtils.startTestingCluster(TestingUtils.scala)
at org.apache.flink.runtime.jobmanager.SlotCountExceedingParallelismTest.setUp(SlotCountExceedingParallelismTest.java:49)
org.apache.flink.runtime.jobmanager.SlotCountExceedingParallelismTest Time elapsed: 200.355
sec <<< ERROR!

java.lang.NullPointerException: null
at org.apache.flink.runtime.jobmanager.SlotCountExceedingParallelismTest.tearDown(SlotCountExceedingParallelismTest.java:57)
{noformat}

https://travis-ci.org/apache/flink/jobs/77887433



--
This message was sent by Atlassian JIRA
(v6.3.4#6332)

Mime
View raw message