flink-dev mailing list archives

Site index · List index
Message view « Date » · « Thread »
Top « Date » · « Thread »
From "Robert Metzger (JIRA)" <j...@apache.org>
Subject [jira] [Created] (FLINK-1804) flink-quickstart-scala tests fail on scala-2.11 build profile on travis
Date Mon, 30 Mar 2015 13:36:53 GMT
Robert Metzger created FLINK-1804:
-------------------------------------

             Summary: flink-quickstart-scala tests fail on scala-2.11 build profile on travis
                 Key: FLINK-1804
                 URL: https://issues.apache.org/jira/browse/FLINK-1804
             Project: Flink
          Issue Type: Task
          Components: Build System, Quickstarts
    Affects Versions: 0.9
            Reporter: Robert Metzger


Travis builds on master started failing after the Scala 2.11 profile has been added to Flink.
For example: https://travis-ci.org/apache/flink/jobs/56312734

The error:

{code}
[INFO] [INFO] --- scala-maven-plugin:3.1.4:compile (default) @ testArtifact ---
[INFO] [INFO] artifact joda-time:joda-time: checking for updates from sonatype
[INFO] [INFO] artifact joda-time:joda-time: checking for updates from sonatype-apache
[INFO] [INFO] artifact joda-time:joda-time: checking for updates from sonatype
[INFO] [INFO] artifact joda-time:joda-time: checking for updates from sonatype-apache
[INFO] [WARNING]  Expected all dependencies to require Scala version: 2.10.4
[INFO] [WARNING]  com.twitter:chill_2.10:0.5.2 requires scala version: 2.10.4
[INFO] [WARNING]  com.twitter:chill-avro_2.10:0.5.2 requires scala version: 2.10.4
[INFO] [WARNING]  com.twitter:chill-bijection_2.10:0.5.2 requires scala version: 2.10.4
[INFO] [WARNING]  com.twitter:bijection-core_2.10:0.7.2 requires scala version: 2.10.4
[INFO] [WARNING]  com.twitter:bijection-avro_2.10:0.7.2 requires scala version: 2.10.4
[INFO] [WARNING]  org.scala-lang:scala-reflect:2.10.4 requires scala version: 2.10.4
[INFO] [WARNING]  org.apache.flink:flink-scala:0.9-SNAPSHOT requires scala version: 2.10.4
[INFO] [WARNING]  org.apache.flink:flink-scala:0.9-SNAPSHOT requires scala version: 2.10.4
[INFO] [WARNING]  org.scala-lang:scala-compiler:2.10.4 requires scala version: 2.10.4
[INFO] [WARNING]  org.scalamacros:quasiquotes_2.10:2.0.1 requires scala version: 2.10.4
[INFO] [WARNING]  org.apache.flink:flink-streaming-scala:0.9-SNAPSHOT requires scala version:
2.11.4
[INFO] [WARNING] Multiple versions of scala libraries detected!
[INFO] [INFO] /home/travis/build/apache/flink/flink-quickstart/flink-quickstart-scala/target/test-classes/projects/testArtifact/project/testArtifact/src/main/scala:-1:
info: compiling
[INFO] [INFO] Compiling 3 source files to /home/travis/build/apache/flink/flink-quickstart/flink-quickstart-scala/target/test-classes/projects/testArtifact/project/testArtifact/target/classes
at 1427650524446
[INFO] [ERROR] error: 
[INFO] [INFO]      while compiling: /home/travis/build/apache/flink/flink-quickstart/flink-quickstart-scala/target/test-classes/projects/testArtifact/project/testArtifact/src/main/scala/org/apache/flink/archetypetest/SocketTextStreamWordCount.scala
[INFO] [INFO]         during phase: typer
[INFO] [INFO]      library version: version 2.10.4
[INFO] [INFO]     compiler version: version 2.10.4
[INFO] [INFO]   reconstructed args: -d /home/travis/build/apache/flink/flink-quickstart/flink-quickstart-scala/target/test-classes/projects/testArtifact/project/testArtifact/target/classes
-classpath /home/travis/.m2/repository/org/apache/flink/flink-scala/0.9-SNAPSHOT/flink-scala-0.9-SNAPSHOT.jar:/home/travis/.m2/repository/org/apache/flink/flink-core/0.9-SNAPSHOT/flink-core-0.9-SNAPSHOT.jar:/home/travis/.m2/repository/org/apache/flink/flink-shaded-include-yarn/0.9-SNAPSHOT/flink-shaded-include-yarn-0.9-SNAPSHOT.jar:/home/travis/.m2/repository/commons-collections/commons-collections/3.2.1/commons-collections-3.2.1.jar:/home/travis/.m2/repository/com/esotericsoftware/kryo/kryo/2.24.0/kryo-2.24.0.jar:/home/travis/.m2/repository/com/esotericsoftware/minlog/minlog/1.2/minlog-1.2.jar:/home/travis/.m2/repository/org/objenesis/objenesis/2.1/objenesis-2.1.jar:/home/travis/.m2/repository/com/twitter/chill_2.10/0.5.2/chill_2.10-0.5.2.jar:/home/travis/.m2/repository/com/twitter/chill-java/0.5.2/chill-java-0.5.2.jar:/home/travis/.m2/repository/org/apache/flink/flink-java/0.9-SNAPSHOT/flink-java-0.9-SNAPSHOT.jar:/home/travis/.m2/repository/org/apache/avro/avro/1.7.6/avro-1.7.6.jar:/home/travis/.m2/repository/org/codehaus/jackson/jackson-core-asl/1.9.13/jackson-core-asl-1.9.13.jar:/home/travis/.m2/repository/org/codehaus/jackson/jackson-mapper-asl/1.9.13/jackson-mapper-asl-1.9.13.jar:/home/travis/.m2/repository/com/thoughtworks/paranamer/paranamer/2.3/paranamer-2.3.jar:/home/travis/.m2/repository/org/xerial/snappy/snappy-java/1.0.5/snappy-java-1.0.5.jar:/home/travis/.m2/repository/org/apache/commons/commons-compress/1.4.1/commons-compress-1.4.1.jar:/home/travis/.m2/repository/org/tukaani/xz/1.0/xz-1.0.jar:/home/travis/.m2/repository/com/twitter/chill-avro_2.10/0.5.2/chill-avro_2.10-0.5.2.jar:/home/travis/.m2/repository/com/twitter/chill-bijection_2.10/0.5.2/chill-bijection_2.10-0.5.2.jar:/home/travis/.m2/repository/com/twitter/bijection-core_2.10/0.7.2/bijection-core_2.10-0.7.2.jar:/home/travis/.m2/repository/com/twitter/bijection-avro_2.10/0.7.2/bijection-avro_2.10-0.7.2.jar:/home/travis/.m2/repository/com/twitter/chill-protobuf/0.5.2/chill-protobuf-0.5.2.jar:/home/travis/.m2/repository/com/google/protobuf/protobuf-java/2.5.0/protobuf-java-2.5.0.jar:/home/travis/.m2/repository/com/twitter/chill-thrift/0.5.2/chill-thrift-0.5.2.jar:/home/travis/.m2/repository/org/apache/thrift/libthrift/0.6.1/libthrift-0.6.1.jar:/home/travis/.m2/repository/commons-lang/commons-lang/2.5/commons-lang-2.5.jar:/home/travis/.m2/repository/junit/junit/4.4/junit-4.4.jar:/home/travis/.m2/repository/de/javakaffee/kryo-serializers/0.27/kryo-serializers-0.27.jar:/home/travis/.m2/repository/joda-time/joda-time/2.5/joda-time-2.5.jar:/home/travis/.m2/repository/org/apache/flink/flink-optimizer/0.9-SNAPSHOT/flink-optimizer-0.9-SNAPSHOT.jar:/home/travis/.m2/repository/org/scala-lang/scala-reflect/2.10.4/scala-reflect-2.10.4.jar:/home/travis/.m2/repository/org/scala-lang/scala-library/2.10.4/scala-library-2.10.4.jar:/home/travis/.m2/repository/org/scala-lang/scala-compiler/2.10.4/scala-compiler-2.10.4.jar:/home/travis/.m2/repository/org/scalamacros/quasiquotes_2.10/2.0.1/quasiquotes_2.10-2.0.1.jar:/home/travis/.m2/repository/org/apache/commons/commons-lang3/3.3.2/commons-lang3-3.3.2.jar:/home/travis/.m2/repository/org/slf4j/slf4j-api/1.7.7/slf4j-api-1.7.7.jar:/home/travis/.m2/repository/org/slf4j/slf4j-log4j12/1.7.7/slf4j-log4j12-1.7.7.jar:/home/travis/.m2/repository/log4j/log4j/1.2.17/log4j-1.2.17.jar:/home/travis/.m2/repository/org/apache/flink/flink-streaming-scala/0.9-SNAPSHOT/flink-streaming-scala-0.9-SNAPSHOT.jar:/home/travis/.m2/repository/org/apache/flink/flink-streaming-core/0.9-SNAPSHOT/flink-streaming-core-0.9-SNAPSHOT.jar:/home/travis/.m2/repository/org/apache/commons/commons-math/2.2/commons-math-2.2.jar:/home/travis/.m2/repository/org/apache/sling/org.apache.sling.commons.json/2.0.6/org.apache.sling.commons.json-2.0.6.jar:/home/travis/.m2/repository/org/apache/flink/flink-runtime/0.9-SNAPSHOT/flink-runtime-0.9-SNAPSHOT.jar:/home/travis/.m2/repository/com/amazonaws/aws-java-sdk/1.8.1/aws-java-sdk-1.8.1.jar:/home/travis/.m2/repository/commons-logging/commons-logging/1.1.1/commons-logging-1.1.1.jar:/home/travis/.m2/repository/org/apache/httpcomponents/httpclient/4.2/httpclient-4.2.jar:/home/travis/.m2/repository/org/apache/httpcomponents/httpcore/4.2/httpcore-4.2.jar:/home/travis/.m2/repository/commons-codec/commons-codec/1.3/commons-codec-1.3.jar:/home/travis/.m2/repository/com/fasterxml/jackson/core/jackson-core/2.1.1/jackson-core-2.1.1.jar:/home/travis/.m2/repository/com/fasterxml/jackson/core/jackson-databind/2.1.1/jackson-databind-2.1.1.jar:/home/travis/.m2/repository/com/fasterxml/jackson/core/jackson-annotations/2.1.1/jackson-annotations-2.1.1.jar:/home/travis/.m2/repository/io/netty/netty-all/4.0.26.Final/netty-all-4.0.26.Final.jar:/home/travis/.m2/repository/org/codehaus/jettison/jettison/1.1/jettison-1.1.jar:/home/travis/.m2/repository/stax/stax-api/1.0.1/stax-api-1.0.1.jar:/home/travis/.m2/repository/com/typesafe/akka/akka-actor_2.10/2.3.9/akka-actor_2.10-2.3.9.jar:/home/travis/.m2/repository/com/typesafe/config/1.2.1/config-1.2.1.jar:/home/travis/.m2/repository/com/typesafe/akka/akka-remote_2.10/2.3.9/akka-remote_2.10-2.3.9.jar:/home/travis/.m2/repository/io/netty/netty/3.8.0.Final/netty-3.8.0.Final.jar:/home/travis/.m2/repository/org/uncommons/maths/uncommons-maths/1.2.2a/uncommons-maths-1.2.2a.jar:/home/travis/.m2/repository/com/typesafe/akka/akka-slf4j_2.10/2.3.9/akka-slf4j_2.10-2.3.9.jar:/home/travis/.m2/repository/com/github/scopt/scopt_2.10/3.2.0/scopt_2.10-3.2.0.jar:/home/travis/.m2/repository/io/dropwizard/metrics/metrics-core/3.1.0/metrics-core-3.1.0.jar:/home/travis/.m2/repository/io/dropwizard/metrics/metrics-jvm/3.1.0/metrics-jvm-3.1.0.jar:/home/travis/.m2/repository/io/dropwizard/metrics/metrics-json/3.1.0/metrics-json-3.1.0.jar:/home/travis/.m2/repository/org/apache/flink/flink-clients/0.9-SNAPSHOT/flink-clients-0.9-SNAPSHOT.jar:/home/travis/.m2/repository/org/eclipse/jetty/jetty-server/8.0.0.M1/jetty-server-8.0.0.M1.jar:/home/travis/.m2/repository/org/mortbay/jetty/servlet-api/3.0.20100224/servlet-api-3.0.20100224.jar:/home/travis/.m2/repository/org/eclipse/jetty/jetty-continuation/8.0.0.M1/jetty-continuation-8.0.0.M1.jar:/home/travis/.m2/repository/org/eclipse/jetty/jetty-http/8.0.0.M1/jetty-http-8.0.0.M1.jar:/home/travis/.m2/repository/org/eclipse/jetty/jetty-io/8.0.0.M1/jetty-io-8.0.0.M1.jar:/home/travis/.m2/repository/org/eclipse/jetty/jetty-util/8.0.0.M1/jetty-util-8.0.0.M1.jar:/home/travis/.m2/repository/org/eclipse/jetty/jetty-security/8.0.0.M1/jetty-security-8.0.0.M1.jar:/home/travis/.m2/repository/org/eclipse/jetty/jetty-servlet/8.0.0.M1/jetty-servlet-8.0.0.M1.jar:/home/travis/.m2/repository/commons-fileupload/commons-fileupload/1.3.1/commons-fileupload-1.3.1.jar:/home/travis/.m2/repository/commons-io/commons-io/2.4/commons-io-2.4.jar:/home/travis/.m2/repository/commons-cli/commons-cli/1.2/commons-cli-1.2.jar:/home/travis/build/apache/flink/flink-quickstart/flink-quickstart-scala/target/test-classes/projects/testArtifact/project/testArtifact/target/classes
[INFO] [INFO] 
[INFO] [INFO]   last tree to typer: Select(Select(Select(Select(Select(Ident(org), apache),
flink), streaming), api), scala)
[INFO] [INFO]               symbol: package scala in package api (flags: final <module>
<package> <java> <triedcooking>)
[INFO] [INFO]    symbol definition: final package scala
[INFO] [INFO]                  tpe: org.apache.flink.streaming.api.scala.type
[INFO] [INFO]        symbol owners: package scala -> package api
[INFO] [INFO]       context owners: value counts -> method main -> object SocketTextStreamWordCount
-> package archetypetest
[INFO] [INFO] 
[INFO] [INFO] == Enclosing template or block ==
[INFO] [INFO] 
[INFO] [INFO] Block(
[INFO] [INFO]   // 6 statements
[INFO] [INFO]   ValDef( // val hostName: String
[INFO] [INFO]     <triedcooking>
[INFO] [INFO]     "hostName"
[INFO] [INFO]     <tpt> // tree.tpe=String
[INFO] [INFO]     Apply( // args: Array[String]
[INFO] [INFO]       "args" // args: Array[String], tree.tpe=args.type
[INFO] [INFO]       0
[INFO] [INFO]     )
[INFO] [INFO]   )
[INFO] [INFO]   ValDef( // val port: Int
[INFO] [INFO]     <triedcooking>
[INFO] [INFO]     "port"
[INFO] [INFO]     <tpt> // tree.tpe=Int
[INFO] [INFO]     args(1)."toInt"
[INFO] [INFO]   )
[INFO] [INFO]   ValDef( // val env: org.apache.flink.streaming.api.scala.StreamExecutionEnvironment
[INFO] [INFO]     <triedcooking>
[INFO] [INFO]     "env"
[INFO] [INFO]     <tpt> // tree.tpe=org.apache.flink.streaming.api.scala.StreamExecutionEnvironment
[INFO] [INFO]     "StreamExecutionEnvironment"."getExecutionEnvironment"
[INFO] [INFO]   )
[INFO] [INFO]   ValDef( // val text: org.apache.flink.streaming.api.scala.DataStream[String]
[INFO] [INFO]     <triedcooking>
[INFO] [INFO]     "text"
[INFO] [INFO]     <tpt> // tree.tpe=org.apache.flink.streaming.api.scala.DataStream[String]
[INFO] [INFO]     Apply( // def socketTextStream(hostname: String,port: Int): org.apache.flink.streaming.api.scala.DataStream[String]
in class StreamExecutionEnvironment, tree.tpe=org.apache.flink.streaming.api.scala.DataStream[String]
[INFO] [INFO]       "env"."socketTextStream" // def socketTextStream(hostname: String,port:
Int): org.apache.flink.streaming.api.scala.DataStream[String] in class StreamExecutionEnvironment,
tree.tpe=(hostname: String, port: Int)org.apache.flink.streaming.api.scala.DataStream[String]
[INFO] [INFO]       // 2 arguments
[INFO] [INFO]       "hostName" // val hostName: String, tree.tpe=String
[INFO] [INFO]       "port" // val port: Int, tree.tpe=Int
[INFO] [INFO]     )
[INFO] [INFO]   )
[INFO] [INFO]   ValDef( // val counts: <?>
[INFO] [INFO]     0
[INFO] [INFO]     "counts"
[INFO] [INFO]     <tpt>
[INFO] [INFO]     Apply(
[INFO] [INFO]       text.flatMap(((x$1: String) => x$1.toLowerCase.split("\\W+").filter(((x$2:
String) => x$2.nonEmpty)))).map(((x$3) => scala.Tuple2(x$3, 1))).groupBy(0)."sum"
[INFO] [INFO]       1
[INFO] [INFO]     )
[INFO] [INFO]   )
[INFO] [INFO]   "counts"."print"
[INFO] [INFO]   Apply(
[INFO] [INFO]     "env"."execute"
[INFO] [INFO]     "Scala SocketTextStreamWordCount Example"
[INFO] [INFO]   )
[INFO] [INFO] )
[INFO] [INFO] 
[INFO] [INFO] == Expanded type of tree ==
[INFO] [INFO] 
[INFO] [INFO] SingleType(
[INFO] [INFO]   pre = SingleType(
[INFO] [INFO]     pre = SingleType(
[INFO] [INFO]       pre = SingleType(
[INFO] [INFO]         pre = SingleType(
[INFO] [INFO]           pre = SingleType(
[INFO] [INFO]             pre = ThisType(package <root>)
[INFO] [INFO]             package org
[INFO] [INFO]           )
[INFO] [INFO]           package apache
[INFO] [INFO]         )
[INFO] [INFO]         package flink
[INFO] [INFO]       )
[INFO] [INFO]       package streaming
[INFO] [INFO]     )
[INFO] [INFO]     package api
[INFO] [INFO]   )
[INFO] [INFO]   package scala
[INFO] [INFO] )
[INFO] [INFO] 
[INFO] [ERROR] uncaught exception during compilation: scala.MatchError
[INFO] [ERROR] error: scala.MatchError: false (of class scala.reflect.internal.Trees$Literal)
[INFO] [INFO] 	at scala.tools.nsc.typechecker.Macros$MacroImplBinding$.unpickleAtom(Macros.scala:118)
[INFO] [INFO] 	at scala.tools.nsc.typechecker.Macros$MacroImplBinding$$anonfun$6.apply(Macros.scala:186)
[INFO] [INFO] 	at scala.tools.nsc.typechecker.Macros$MacroImplBinding$$anonfun$6.apply(Macros.scala:186)
[INFO] [INFO] 	at scala.collection.TraversableLike$$anonfun$map$1.apply(TraversableLike.scala:244)
[INFO] [INFO] 	at scala.collection.TraversableLike$$anonfun$map$1.apply(TraversableLike.scala:244)
[INFO] [INFO] 	at scala.collection.immutable.List.foreach(List.scala:318)
[INFO] [INFO] 	at scala.collection.TraversableLike$class.map(TraversableLike.scala:244)
[INFO] [INFO] 	at scala.collection.AbstractTraversable.map(Traversable.scala:105)
[INFO] [INFO] 	at scala.tools.nsc.typechecker.Macros$MacroImplBinding$.unpickle(Macros.scala:186)
[INFO] [INFO] 	at scala.tools.nsc.typechecker.Macros$class.scala$tools$nsc$typechecker$Macros$$loadMacroImplBinding(Macros.scala:205)
[INFO] [INFO] 	at scala.tools.nsc.typechecker.Macros$$anonfun$scala$tools$nsc$typechecker$Macros$$macroRuntime$3.apply(Macros.scala:522)
[INFO] [INFO] 	at scala.tools.nsc.typechecker.Macros$$anonfun$scala$tools$nsc$typechecker$Macros$$macroRuntime$3.apply(Macros.scala:521)
[INFO] [INFO] 	at scala.collection.mutable.MapLike$class.getOrElseUpdate(MapLike.scala:189)
[INFO] [INFO] 	at scala.collection.mutable.AbstractMap.getOrElseUpdate(Map.scala:91)
[INFO] [INFO] 	at scala.tools.nsc.typechecker.Macros$class.scala$tools$nsc$typechecker$Macros$$macroRuntime(Macros.scala:521)
[INFO] [INFO] 	at scala.tools.nsc.typechecker.Macros$$anonfun$scala$tools$nsc$typechecker$Macros$$macroExpand1$1.apply(Macros.scala:795)
[INFO] [INFO] 	at scala.tools.nsc.typechecker.Macros$$anonfun$scala$tools$nsc$typechecker$Macros$$macroExpand1$1.apply(Macros.scala:787)
[INFO] [INFO] 	at scala.tools.nsc.Global.withInfoLevel(Global.scala:190)
[INFO] [INFO] 	at scala.tools.nsc.typechecker.Macros$class.scala$tools$nsc$typechecker$Macros$$macroExpand1(Macros.scala:787)
[INFO] [INFO] 	at scala.tools.nsc.typechecker.Macros$class.macroExpand(Macros.scala:701)
[INFO] [INFO] 	at scala.tools.nsc.Global$$anon$1.macroExpand(Global.scala:493)
[INFO] [INFO] 	at scala.tools.nsc.typechecker.Typers$Typer.adapt(Typers.scala:1152)
[INFO] [INFO] 	at scala.tools.nsc.typechecker.Typers$Typer.adapt(Typers.scala:1102)
[INFO] [INFO] 	at scala.tools.nsc.typechecker.Typers$Typer.adapt(Typers.scala:1124)
[INFO] [INFO] 	at scala.tools.nsc.typechecker.Implicits$ImplicitSearch.typedImplicit1(Implicits.scala:679)
[INFO] [INFO] 	at scala.tools.nsc.typechecker.Implicits$ImplicitSearch.typedImplicit0(Implicits.scala:631)
[INFO] [INFO] 	at scala.tools.nsc.typechecker.Implicits$ImplicitSearch.pre211DivergenceLogic$1(Implicits.scala:468)
[INFO] [INFO] 	at scala.tools.nsc.typechecker.Implicits$ImplicitSearch.scala$tools$nsc$typechecker$Implicits$ImplicitSearch$$typedImplicit(Implicits.scala:499)
[INFO] [INFO] 	at scala.tools.nsc.typechecker.Implicits$ImplicitSearch$ImplicitComputation.pre211tryImplicitInfo$1(Implicits.scala:932)
[INFO] [INFO] 	at scala.tools.nsc.typechecker.Implicits$ImplicitSearch$ImplicitComputation.rankImplicits(Implicits.scala:940)
[INFO] [INFO] 	at scala.tools.nsc.typechecker.Implicits$ImplicitSearch$ImplicitComputation.findBest(Implicits.scala:979)
[INFO] [INFO] 	at scala.tools.nsc.typechecker.Implicits$ImplicitSearch.searchImplicit(Implicits.scala:1040)
[INFO] [INFO] 	at scala.tools.nsc.typechecker.Implicits$ImplicitSearch.bestImplicit(Implicits.scala:1409)
[INFO] [INFO] 	at scala.tools.nsc.typechecker.Implicits$class.inferImplicit(Implicits.scala:82)
[INFO] [INFO] 	at scala.tools.nsc.Global$$anon$1.inferImplicit(Global.scala:493)
[INFO] [INFO] 	at scala.tools.nsc.typechecker.Implicits$class.inferImplicit(Implicits.scala:37)
[INFO] [INFO] 	at scala.tools.nsc.Global$$anon$1.inferImplicit(Global.scala:493)
[INFO] [INFO] 	at scala.tools.nsc.typechecker.Typers$Typer.applyImplicitArgs(Typers.scala:127)
[INFO] [INFO] 	at scala.tools.nsc.typechecker.Typers$Typer.adaptToImplicitMethod$1(Typers.scala:869)
[INFO] [INFO] 	at scala.tools.nsc.typechecker.Typers$Typer.adapt(Typers.scala:1126)
[INFO] [INFO] 	at scala.tools.nsc.typechecker.Typers$Typer.typed(Typers.scala:5660)
[INFO] [INFO] 	at scala.tools.nsc.typechecker.Typers$Typer.typedQualifier(Typers.scala:5727)
[INFO] [INFO] 	at scala.tools.nsc.typechecker.Typers$Typer.typedQualifier(Typers.scala:5733)
[INFO] [INFO] 	at scala.tools.nsc.typechecker.Typers$Typer.typedSelectOrSuperCall$1(Typers.scala:4913)
[INFO] [INFO] 	at scala.tools.nsc.typechecker.Typers$Typer.typed1(Typers.scala:5563)
[INFO] [INFO] 	at scala.tools.nsc.typechecker.Typers$Typer.typed(Typers.scala:5642)
[INFO] [INFO] 	at scala.tools.nsc.typechecker.Typers$Typer$$anonfun$93.apply(Typers.scala:4608)
[INFO] [INFO] 	at scala.tools.nsc.typechecker.Typers$Typer$$anonfun$93.apply(Typers.scala:4608)
[INFO] [INFO] 	at scala.tools.nsc.typechecker.Typers$Typer.silent(Typers.scala:727)
[INFO] [INFO] 	at scala.tools.nsc.typechecker.Typers$Typer.normalTypedApply$1(Typers.scala:4608)
[INFO] [INFO] 	at scala.tools.nsc.typechecker.Typers$Typer.typedApply$1(Typers.scala:4659)
[INFO] [INFO] 	at scala.tools.nsc.typechecker.Typers$Typer.typed1(Typers.scala:5564)
[INFO] [INFO] 	at scala.tools.nsc.typechecker.Typers$Typer.typed(Typers.scala:5642)
[INFO] [INFO] 	at scala.tools.nsc.typechecker.Typers$Typer.typedQualifier(Typers.scala:5727)
[INFO] [INFO] 	at scala.tools.nsc.typechecker.Typers$Typer.typedQualifier(Typers.scala:5733)
[INFO] [INFO] 	at scala.tools.nsc.typechecker.Typers$Typer.typedSelectOrSuperCall$1(Typers.scala:4913)
[INFO] [INFO] 	at scala.tools.nsc.typechecker.Typers$Typer.typed1(Typers.scala:5563)
[INFO] [INFO] 	at scala.tools.nsc.typechecker.Typers$Typer.typed(Typers.scala:5642)
[INFO] [INFO] 	at scala.tools.nsc.typechecker.Typers$Typer$$anonfun$93.apply(Typers.scala:4608)
[INFO] [INFO] 	at scala.tools.nsc.typechecker.Typers$Typer$$anonfun$93.apply(Typers.scala:4608)
[INFO] [INFO] 	at scala.tools.nsc.typechecker.Typers$Typer.silent(Typers.scala:727)
[INFO] [INFO] 	at scala.tools.nsc.typechecker.Typers$Typer.normalTypedApply$1(Typers.scala:4608)
[INFO] [INFO] 	at scala.tools.nsc.typechecker.Typers$Typer.typedApply$1(Typers.scala:4659)
[INFO] [INFO] 	at scala.tools.nsc.typechecker.Typers$Typer.typed1(Typers.scala:5564)
[INFO] [INFO] 	at scala.tools.nsc.typechecker.Typers$Typer.typed(Typers.scala:5642)
[INFO] [INFO] 	at scala.tools.nsc.typechecker.Typers$Typer.typedQualifier(Typers.scala:5727)
[INFO] [INFO] 	at scala.tools.nsc.typechecker.Typers$Typer.typedQualifier(Typers.scala:5733)
[INFO] [INFO] 	at scala.tools.nsc.typechecker.Typers$Typer.typedSelectOrSuperCall$1(Typers.scala:4913)
[INFO] [INFO] 	at scala.tools.nsc.typechecker.Typers$Typer.typed1(Typers.scala:5563)
[INFO] [INFO] 	at scala.tools.nsc.typechecker.Typers$Typer.typed(Typers.scala:5642)
[INFO] [INFO] 	at scala.tools.nsc.typechecker.Typers$Typer$$anonfun$93.apply(Typers.scala:4608)
[INFO] [INFO] 	at scala.tools.nsc.typechecker.Typers$Typer$$anonfun$93.apply(Typers.scala:4608)
[INFO] [INFO] 	at scala.tools.nsc.typechecker.Typers$Typer.silent(Typers.scala:727)
[INFO] [INFO] 	at scala.tools.nsc.typechecker.Typers$Typer.normalTypedApply$1(Typers.scala:4608)
[INFO] [INFO] 	at scala.tools.nsc.typechecker.Typers$Typer.typedApply$1(Typers.scala:4659)
[INFO] [INFO] 	at scala.tools.nsc.typechecker.Typers$Typer.typed1(Typers.scala:5564)
[INFO] [INFO] 	at scala.tools.nsc.typechecker.Typers$Typer.typed(Typers.scala:5642)
[INFO] [INFO] 	at scala.tools.nsc.typechecker.Typers$Typer.typed(Typers.scala:5721)
[INFO] [INFO] 	at scala.tools.nsc.typechecker.Typers$Typer.computeType(Typers.scala:5808)
[INFO] [INFO] 	at scala.tools.nsc.typechecker.Namers$Namer.assignTypeToTree(Namers.scala:834)
[INFO] [INFO] 	at scala.tools.nsc.typechecker.Namers$Namer.valDefSig(Namers.scala:1315)
[INFO] [INFO] 	at scala.tools.nsc.typechecker.Namers$Namer.getSig$1(Namers.scala:1457)
[INFO] [INFO] 	at scala.tools.nsc.typechecker.Namers$Namer.typeSig(Namers.scala:1466)
[INFO] [INFO] 	at scala.tools.nsc.typechecker.Namers$Namer$$anonfun$monoTypeCompleter$1$$anonfun$apply$1.apply$mcV$sp(Namers.scala:731)
[INFO] [INFO] 	at scala.tools.nsc.typechecker.Namers$Namer$$anonfun$monoTypeCompleter$1$$anonfun$apply$1.apply(Namers.scala:730)
[INFO] [INFO] 	at scala.tools.nsc.typechecker.Namers$Namer$$anonfun$monoTypeCompleter$1$$anonfun$apply$1.apply(Namers.scala:730)
[INFO] [INFO] 	at scala.tools.nsc.typechecker.Namers$Namer.scala$tools$nsc$typechecker$Namers$Namer$$logAndValidate(Namers.scala:1499)
[INFO] [INFO] 	at scala.tools.nsc.typechecker.Namers$Namer$$anonfun$monoTypeCompleter$1.apply(Namers.scala:730)
[INFO] [INFO] 	at scala.tools.nsc.typechecker.Namers$Namer$$anonfun$monoTypeCompleter$1.apply(Namers.scala:729)
[INFO] [INFO] 	at scala.tools.nsc.typechecker.Namers$$anon$1.completeImpl(Namers.scala:1614)
[INFO] [INFO] 	at scala.tools.nsc.typechecker.Namers$LockingTypeCompleter$class.complete(Namers.scala:1622)
[INFO] [INFO] 	at scala.tools.nsc.typechecker.Namers$$anon$1.complete(Namers.scala:1612)
[INFO] [INFO] 	at scala.reflect.internal.Symbols$Symbol.info(Symbols.scala:1231)
[INFO] [INFO] 	at scala.reflect.internal.Symbols$Symbol.initialize(Symbols.scala:1374)
[INFO] [INFO] 	at scala.tools.nsc.typechecker.Typers$Typer.typed1(Typers.scala:5295)
[INFO] [INFO] 	at scala.tools.nsc.typechecker.Typers$Typer.typed(Typers.scala:5642)
[INFO] [INFO] 	at scala.tools.nsc.typechecker.Typers$Typer.scala$tools$nsc$typechecker$Typers$Typer$$typedStat$1(Typers.scala:2928)
[INFO] [INFO] 	at scala.tools.nsc.typechecker.Typers$Typer$$anonfun$61.apply(Typers.scala:3032)
[INFO] [INFO] 	at scala.tools.nsc.typechecker.Typers$Typer$$anonfun$61.apply(Typers.scala:3032)
[INFO] [INFO] 	at scala.collection.immutable.List.loop$1(List.scala:170)
[INFO] [INFO] 	at scala.collection.immutable.List.mapConserve(List.scala:186)
[INFO] [INFO] 	at scala.tools.nsc.typechecker.Typers$Typer.typedStats(Typers.scala:3032)
[INFO] [INFO] 	at scala.tools.nsc.typechecker.Typers$Typer.typedBlock(Typers.scala:2432)
[INFO] [INFO] 	at scala.tools.nsc.typechecker.Typers$Typer.typed1(Typers.scala:5570)
[INFO] [INFO] 	at scala.tools.nsc.typechecker.Typers$Typer.typed(Typers.scala:5642)
[INFO] [INFO] 	at scala.tools.nsc.typechecker.Typers$Typer.transformedOrTyped(Typers.scala:5845)
[INFO] [INFO] 	at scala.tools.nsc.typechecker.Typers$Typer.typedDefDef(Typers.scala:2257)
[INFO] [INFO] 	at scala.tools.nsc.typechecker.Typers$Typer.typed1(Typers.scala:5569)
[INFO] [INFO] 	at scala.tools.nsc.typechecker.Typers$Typer.typed(Typers.scala:5642)
[INFO] [INFO] 	at scala.tools.nsc.typechecker.Typers$Typer.scala$tools$nsc$typechecker$Typers$Typer$$typedStat$1(Typers.scala:2928)
[INFO] [INFO] 	at scala.tools.nsc.typechecker.Typers$Typer$$anonfun$61.apply(Typers.scala:3032)
[INFO] [INFO] 	at scala.tools.nsc.typechecker.Typers$Typer$$anonfun$61.apply(Typers.scala:3032)
[INFO] [INFO] 	at scala.collection.immutable.List.loop$1(List.scala:170)
[INFO] [INFO] 	at scala.collection.immutable.List.mapConserve(List.scala:186)
[INFO] [INFO] 	at scala.tools.nsc.typechecker.Typers$Typer.typedStats(Typers.scala:3032)
[INFO] [INFO] 	at scala.tools.nsc.typechecker.Typers$Typer.typedTemplate(Typers.scala:1919)
[INFO] [INFO] 	at scala.tools.nsc.typechecker.Typers$Typer.typedModuleDef(Typers.scala:1800)
[INFO] [INFO] 	at scala.tools.nsc.typechecker.Typers$Typer.typed1(Typers.scala:5584)
[INFO] [INFO] 	at scala.tools.nsc.typechecker.Typers$Typer.typed(Typers.scala:5642)
[INFO] [INFO] 	at scala.tools.nsc.typechecker.Typers$Typer.scala$tools$nsc$typechecker$Typers$Typer$$typedStat$1(Typers.scala:2928)
[INFO] [INFO] 	at scala.tools.nsc.typechecker.Typers$Typer$$anonfun$61.apply(Typers.scala:3032)
[INFO] [INFO] 	at scala.tools.nsc.typechecker.Typers$Typer$$anonfun$61.apply(Typers.scala:3032)
[INFO] [INFO] 	at scala.collection.immutable.List.loop$1(List.scala:170)
[INFO] [INFO] 	at scala.collection.immutable.List.mapConserve(List.scala:186)
[INFO] [INFO] 	at scala.tools.nsc.typechecker.Typers$Typer.typedStats(Typers.scala:3032)
[INFO] [INFO] 	at scala.tools.nsc.typechecker.Typers$Typer.typedPackageDef$1(Typers.scala:5301)
[INFO] [INFO] 	at scala.tools.nsc.typechecker.Typers$Typer.typed1(Typers.scala:5587)
[INFO] [INFO] 	at scala.tools.nsc.typechecker.Typers$Typer.typed(Typers.scala:5642)
[INFO] [INFO] 	at scala.tools.nsc.typechecker.Typers$Typer.typed(Typers.scala:5704)
[INFO] [INFO] 	at scala.tools.nsc.typechecker.Analyzer$typerFactory$$anon$3.apply(Analyzer.scala:99)
[INFO] [INFO] 	at scala.tools.nsc.Global$GlobalPhase.applyPhase(Global.scala:464)
[INFO] [INFO] 	at scala.tools.nsc.typechecker.Analyzer$typerFactory$$anon$3$$anonfun$run$1.apply(Analyzer.scala:91)
[INFO] [INFO] 	at scala.tools.nsc.typechecker.Analyzer$typerFactory$$anon$3$$anonfun$run$1.apply(Analyzer.scala:91)
[INFO] [INFO] 	at scala.collection.Iterator$class.foreach(Iterator.scala:727)
[INFO] [INFO] 	at scala.collection.AbstractIterator.foreach(Iterator.scala:1157)
[INFO] [INFO] 	at scala.tools.nsc.typechecker.Analyzer$typerFactory$$anon$3.run(Analyzer.scala:91)
[INFO] [INFO] 	at scala.tools.nsc.Global$Run.compileUnitsInternal(Global.scala:1583)
[INFO] [INFO] 	at scala.tools.nsc.Global$Run.compileUnits(Global.scala:1557)
[INFO] [INFO] 	at scala.tools.nsc.Global$Run.compileSources(Global.scala:1553)
[INFO] [INFO] 	at scala.tools.nsc.Global$Run.compile(Global.scala:1662)
[INFO] [INFO] 	at scala.tools.nsc.Driver.doCompile(Driver.scala:33)
[INFO] [INFO] 	at scala.tools.nsc.Main$.doCompile(Main.scala:79)
[INFO] [INFO] 	at scala.tools.nsc.Driver.process(Driver.scala:54)
[INFO] [INFO] 	at scala.tools.nsc.Driver.main(Driver.scala:67)
[INFO] [INFO] 	at scala.tools.nsc.Main.main(Main.scala)
[INFO] [INFO] 	at sun.reflect.NativeMethodAccessorImpl.invoke0(Native Method)
[INFO] [INFO] 	at sun.reflect.NativeMethodAccessorImpl.invoke(NativeMethodAccessorImpl.java:62)
[INFO] [INFO] 	at sun.reflect.DelegatingMethodAccessorImpl.invoke(DelegatingMethodAccessorImpl.java:43)
[INFO] [INFO] 	at java.lang.reflect.Method.invoke(Method.java:483)
[INFO] [INFO] 	at scala_maven_executions.MainHelper.runMain(MainHelper.java:164)
[INFO] [INFO] 	at scala_maven_executions.MainWithArgsInFile.main(MainWithArgsInFile.java:26)
[INFO] [INFO] 
[INFO] [INFO] java.lang.reflect.InvocationTargetException
[INFO] [INFO] 	at sun.reflect.NativeMethodAccessorImpl.invoke0(Native Method)
[INFO] [INFO] 	at sun.reflect.NativeMethodAccessorImpl.invoke(NativeMethodAccessorImpl.java:62)
[INFO] [INFO] 	at sun.reflect.DelegatingMethodAccessorImpl.invoke(DelegatingMethodAccessorImpl.java:43)
[INFO] [INFO] 	at java.lang.reflect.Method.invoke(Method.java:483)
[INFO] [INFO] 	at scala_maven_executions.MainHelper.runMain(MainHelper.java:164)
[INFO] [INFO] 	at scala_maven_executions.MainWithArgsInFile.main(MainWithArgsInFile.java:26)
[INFO] [ERROR] Caused by: scala.MatchError: false (of class scala.reflect.internal.Trees$Literal)
[INFO] [INFO] 	at scala.tools.nsc.typechecker.Macros$MacroImplBinding$.unpickleAtom(Macros.scala:118)
[INFO] [INFO] 	at scala.tools.nsc.typechecker.Macros$MacroImplBinding$$anonfun$6.apply(Macros.scala:186)
[INFO] [INFO] 	at scala.tools.nsc.typechecker.Macros$MacroImplBinding$$anonfun$6.apply(Macros.scala:186)
[INFO] [INFO] 	at scala.collection.TraversableLike$$anonfun$map$1.apply(TraversableLike.scala:244)
[INFO] [INFO] 	at scala.collection.TraversableLike$$anonfun$map$1.apply(TraversableLike.scala:244)
[INFO] [INFO] 	at scala.collection.immutable.List.foreach(List.scala:318)
[INFO] [INFO] 	at scala.collection.TraversableLike$class.map(TraversableLike.scala:244)
[INFO] [INFO] 	at scala.collection.AbstractTraversable.map(Traversable.scala:105)
[INFO] [INFO] 	at scala.tools.nsc.typechecker.Macros$MacroImplBinding$.unpickle(Macros.scala:186)
[INFO] [INFO] 	at scala.tools.nsc.typechecker.Macros$class.scala$tools$nsc$typechecker$Macros$$loadMacroImplBinding(Macros.scala:205)
[INFO] [INFO] 	at scala.tools.nsc.typechecker.Macros$$anonfun$scala$tools$nsc$typechecker$Macros$$macroRuntime$3.apply(Macros.scala:522)
[INFO] [INFO] 	at scala.tools.nsc.typechecker.Macros$$anonfun$scala$tools$nsc$typechecker$Macros$$macroRuntime$3.apply(Macros.scala:521)
[INFO] [INFO] 	at scala.collection.mutable.MapLike$class.getOrElseUpdate(MapLike.scala:189)
[INFO] [INFO] 	at scala.collection.mutable.AbstractMap.getOrElseUpdate(Map.scala:91)
[INFO] [INFO] 	at scala.tools.nsc.typechecker.Macros$class.scala$tools$nsc$typechecker$Macros$$macroRuntime(Macros.scala:521)
[INFO] [INFO] 	at scala.tools.nsc.typechecker.Macros$$anonfun$scala$tools$nsc$typechecker$Macros$$macroExpand1$1.apply(Macros.scala:795)
[INFO] [INFO] 	at scala.tools.nsc.typechecker.Macros$$anonfun$scala$tools$nsc$typechecker$Macros$$macroExpand1$1.apply(Macros.scala:787)
[INFO] [INFO] 	at scala.tools.nsc.Global.withInfoLevel(Global.scala:190)
[INFO] [INFO] 	at scala.tools.nsc.typechecker.Macros$class.scala$tools$nsc$typechecker$Macros$$macroExpand1(Macros.scala:787)
[INFO] [INFO] 	at scala.tools.nsc.typechecker.Macros$class.macroExpand(Macros.scala:701)
[INFO] [INFO] 	at scala.tools.nsc.Global$$anon$1.macroExpand(Global.scala:493)
[INFO] [INFO] 	at scala.tools.nsc.typechecker.Typers$Typer.adapt(Typers.scala:1152)
[INFO] [INFO] 	at scala.tools.nsc.typechecker.Typers$Typer.adapt(Typers.scala:1102)
[INFO] [INFO] 	at scala.tools.nsc.typechecker.Typers$Typer.adapt(Typers.scala:1124)
[INFO] [INFO] 	at scala.tools.nsc.typechecker.Implicits$ImplicitSearch.typedImplicit1(Implicits.scala:679)
[INFO] [INFO] 	at scala.tools.nsc.typechecker.Implicits$ImplicitSearch.typedImplicit0(Implicits.scala:631)
[INFO] [INFO] 	at scala.tools.nsc.typechecker.Implicits$ImplicitSearch.pre211DivergenceLogic$1(Implicits.scala:468)
[INFO] [INFO] 	at scala.tools.nsc.typechecker.Implicits$ImplicitSearch.scala$tools$nsc$typechecker$Implicits$ImplicitSearch$$typedImplicit(Implicits.scala:499)
[INFO] [INFO] 	at scala.tools.nsc.typechecker.Implicits$ImplicitSearch$ImplicitComputation.pre211tryImplicitInfo$1(Implicits.scala:932)
[INFO] [INFO] 	at scala.tools.nsc.typechecker.Implicits$ImplicitSearch$ImplicitComputation.rankImplicits(Implicits.scala:940)
[INFO] [INFO] 	at scala.tools.nsc.typechecker.Implicits$ImplicitSearch$ImplicitComputation.findBest(Implicits.scala:979)
[INFO] [INFO] 	at scala.tools.nsc.typechecker.Implicits$ImplicitSearch.searchImplicit(Implicits.scala:1040)
[INFO] [INFO] 	at scala.tools.nsc.typechecker.Implicits$ImplicitSearch.bestImplicit(Implicits.scala:1409)
[INFO] [INFO] 	at scala.tools.nsc.typechecker.Implicits$class.inferImplicit(Implicits.scala:82)
[INFO] [INFO] 	at scala.tools.nsc.Global$$anon$1.inferImplicit(Global.scala:493)
[INFO] [INFO] 	at scala.tools.nsc.typechecker.Implicits$class.inferImplicit(Implicits.scala:37)
[INFO] [INFO] 	at scala.tools.nsc.Global$$anon$1.inferImplicit(Global.scala:493)
[INFO] [INFO] 	at scala.tools.nsc.typechecker.Typers$Typer.applyImplicitArgs(Typers.scala:127)
[INFO] [INFO] 	at scala.tools.nsc.typechecker.Typers$Typer.adaptToImplicitMethod$1(Typers.scala:869)
[INFO] [INFO] 	at scala.tools.nsc.typechecker.Typers$Typer.adapt(Typers.scala:1126)
[INFO] [INFO] 	at scala.tools.nsc.typechecker.Typers$Typer.typed(Typers.scala:5660)
[INFO] [INFO] 	at scala.tools.nsc.typechecker.Typers$Typer.typedQualifier(Typers.scala:5727)
[INFO] [INFO] 	at scala.tools.nsc.typechecker.Typers$Typer.typedQualifier(Typers.scala:5733)
[INFO] [INFO] 	at scala.tools.nsc.typechecker.Typers$Typer.typedSelectOrSuperCall$1(Typers.scala:4913)
[INFO] [INFO] 	at scala.tools.nsc.typechecker.Typers$Typer.typed1(Typers.scala:5563)
[INFO] [INFO] 	at scala.tools.nsc.typechecker.Typers$Typer.typed(Typers.scala:5642)
[INFO] [INFO] 	at scala.tools.nsc.typechecker.Typers$Typer$$anonfun$93.apply(Typers.scala:4608)
[INFO] [INFO] 	at scala.tools.nsc.typechecker.Typers$Typer$$anonfun$93.apply(Typers.scala:4608)
[INFO] [INFO] 	at scala.tools.nsc.typechecker.Typers$Typer.silent(Typers.scala:727)
[INFO] [INFO] 	at scala.tools.nsc.typechecker.Typers$Typer.normalTypedApply$1(Typers.scala:4608)
[INFO] [INFO] 	at scala.tools.nsc.typechecker.Typers$Typer.typedApply$1(Typers.scala:4659)
[INFO] [INFO] 	at scala.tools.nsc.typechecker.Typers$Typer.typed1(Typers.scala:5564)
[INFO] [INFO] 	at scala.tools.nsc.typechecker.Typers$Typer.typed(Typers.scala:5642)
[INFO] [INFO] 	at scala.tools.nsc.typechecker.Typers$Typer.typedQualifier(Typers.scala:5727)
[INFO] [INFO] 	at scala.tools.nsc.typechecker.Typers$Typer.typedQualifier(Typers.scala:5733)
[INFO] [INFO] 	at scala.tools.nsc.typechecker.Typers$Typer.typedSelectOrSuperCall$1(Typers.scala:4913)
[INFO] [INFO] 	at scala.tools.nsc.typechecker.Typers$Typer.typed1(Typers.scala:5563)
[INFO] [INFO] 	at scala.tools.nsc.typechecker.Typers$Typer.typed(Typers.scala:5642)
[INFO] [INFO] 	at scala.tools.nsc.typechecker.Typers$Typer$$anonfun$93.apply(Typers.scala:4608)
[INFO] [INFO] 	at scala.tools.nsc.typechecker.Typers$Typer$$anonfun$93.apply(Typers.scala:4608)
[INFO] [INFO] 	at scala.tools.nsc.typechecker.Typers$Typer.silent(Typers.scala:727)
[INFO] [INFO] 	at scala.tools.nsc.typechecker.Typers$Typer.normalTypedApply$1(Typers.scala:4608)
[INFO] [INFO] 	at scala.tools.nsc.typechecker.Typers$Typer.typedApply$1(Typers.scala:4659)
[INFO] [INFO] 	at scala.tools.nsc.typechecker.Typers$Typer.typed1(Typers.scala:5564)
[INFO] [INFO] 	at scala.tools.nsc.typechecker.Typers$Typer.typed(Typers.scala:5642)
[INFO] [INFO] 	at scala.tools.nsc.typechecker.Typers$Typer.typedQualifier(Typers.scala:5727)
[INFO] [INFO] 	at scala.tools.nsc.typechecker.Typers$Typer.typedQualifier(Typers.scala:5733)
[INFO] [INFO] 	at scala.tools.nsc.typechecker.Typers$Typer.typedSelectOrSuperCall$1(Typers.scala:4913)
[INFO] [INFO] 	at scala.tools.nsc.typechecker.Typers$Typer.typed1(Typers.scala:5563)
[INFO] [INFO] 	at scala.tools.nsc.typechecker.Typers$Typer.typed(Typers.scala:5642)
[INFO] [INFO] 	at scala.tools.nsc.typechecker.Typers$Typer$$anonfun$93.apply(Typers.scala:4608)
[INFO] [INFO] 	at scala.tools.nsc.typechecker.Typers$Typer$$anonfun$93.apply(Typers.scala:4608)
[INFO] [INFO] 	at scala.tools.nsc.typechecker.Typers$Typer.silent(Typers.scala:727)
[INFO] [INFO] 	at scala.tools.nsc.typechecker.Typers$Typer.normalTypedApply$1(Typers.scala:4608)
[INFO] [INFO] 	at scala.tools.nsc.typechecker.Typers$Typer.typedApply$1(Typers.scala:4659)
[INFO] [INFO] 	at scala.tools.nsc.typechecker.Typers$Typer.typed1(Typers.scala:5564)
[INFO] [INFO] 	at scala.tools.nsc.typechecker.Typers$Typer.typed(Typers.scala:5642)
[INFO] [INFO] 	at scala.tools.nsc.typechecker.Typers$Typer.typed(Typers.scala:5721)
[INFO] [INFO] 	at scala.tools.nsc.typechecker.Typers$Typer.computeType(Typers.scala:5808)
[INFO] [INFO] 	at scala.tools.nsc.typechecker.Namers$Namer.assignTypeToTree(Namers.scala:834)
[INFO] [INFO] 	at scala.tools.nsc.typechecker.Namers$Namer.valDefSig(Namers.scala:1315)
[INFO] [INFO] 	at scala.tools.nsc.typechecker.Namers$Namer.getSig$1(Namers.scala:1457)
[INFO] [INFO] 	at scala.tools.nsc.typechecker.Namers$Namer.typeSig(Namers.scala:1466)
[INFO] [INFO] 	at scala.tools.nsc.typechecker.Namers$Namer$$anonfun$monoTypeCompleter$1$$anonfun$apply$1.apply$mcV$sp(Namers.scala:731)
[INFO] [INFO] 	at scala.tools.nsc.typechecker.Namers$Namer$$anonfun$monoTypeCompleter$1$$anonfun$apply$1.apply(Namers.scala:730)
[INFO] [INFO] 	at scala.tools.nsc.typechecker.Namers$Namer$$anonfun$monoTypeCompleter$1$$anonfun$apply$1.apply(Namers.scala:730)
[INFO] [INFO] 	at scala.tools.nsc.typechecker.Namers$Namer.scala$tools$nsc$typechecker$Namers$Namer$$logAndValidate(Namers.scala:1499)
[INFO] [INFO] 	at scala.tools.nsc.typechecker.Namers$Namer$$anonfun$monoTypeCompleter$1.apply(Namers.scala:730)
[INFO] [INFO] 	at scala.tools.nsc.typechecker.Namers$Namer$$anonfun$monoTypeCompleter$1.apply(Namers.scala:729)
[INFO] [INFO] 	at scala.tools.nsc.typechecker.Namers$$anon$1.completeImpl(Namers.scala:1614)
[INFO] [INFO] 	at scala.tools.nsc.typechecker.Namers$LockingTypeCompleter$class.complete(Namers.scala:1622)
[INFO] [INFO] 	at scala.tools.nsc.typechecker.Namers$$anon$1.complete(Namers.scala:1612)
[INFO] [INFO] 	at scala.reflect.internal.Symbols$Symbol.info(Symbols.scala:1231)
[INFO] [INFO] 	at scala.reflect.internal.Symbols$Symbol.initialize(Symbols.scala:1374)
[INFO] [INFO] 	at scala.tools.nsc.typechecker.Typers$Typer.typed1(Typers.scala:5295)
[INFO] [INFO] 	at scala.tools.nsc.typechecker.Typers$Typer.typed(Typers.scala:5642)
[INFO] [INFO] 	at scala.tools.nsc.typechecker.Typers$Typer.scala$tools$nsc$typechecker$Typers$Typer$$typedStat$1(Typers.scala:2928)
[INFO] [INFO] 	at scala.tools.nsc.typechecker.Typers$Typer$$anonfun$61.apply(Typers.scala:3032)
[INFO] [INFO] 	at scala.tools.nsc.typechecker.Typers$Typer$$anonfun$61.apply(Typers.scala:3032)
[INFO] [INFO] 	at scala.collection.immutable.List.loop$1(List.scala:170)
[INFO] [INFO] 	at scala.collection.immutable.List.mapConserve(List.scala:186)
[INFO] [INFO] 	at scala.tools.nsc.typechecker.Typers$Typer.typedStats(Typers.scala:3032)
[INFO] [INFO] 	at scala.tools.nsc.typechecker.Typers$Typer.typedBlock(Typers.scala:2432)
[INFO] [INFO] 	at scala.tools.nsc.typechecker.Typers$Typer.typed1(Typers.scala:5570)
[INFO] [INFO] 	at scala.tools.nsc.typechecker.Typers$Typer.typed(Typers.scala:5642)
[INFO] [INFO] 	at scala.tools.nsc.typechecker.Typers$Typer.transformedOrTyped(Typers.scala:5845)
[INFO] [INFO] 	at scala.tools.nsc.typechecker.Typers$Typer.typedDefDef(Typers.scala:2257)
[INFO] [INFO] 	at scala.tools.nsc.typechecker.Typers$Typer.typed1(Typers.scala:5569)
[INFO] [INFO] 	at scala.tools.nsc.typechecker.Typers$Typer.typed(Typers.scala:5642)
[INFO] [INFO] 	at scala.tools.nsc.typechecker.Typers$Typer.scala$tools$nsc$typechecker$Typers$Typer$$typedStat$1(Typers.scala:2928)
[INFO] [INFO] 	at scala.tools.nsc.typechecker.Typers$Typer$$anonfun$61.apply(Typers.scala:3032)
[INFO] [INFO] 	at scala.tools.nsc.typechecker.Typers$Typer$$anonfun$61.apply(Typers.scala:3032)
[INFO] [INFO] 	at scala.collection.immutable.List.loop$1(List.scala:170)
[INFO] [INFO] 	at scala.collection.immutable.List.mapConserve(List.scala:186)
[INFO] [INFO] 	at scala.tools.nsc.typechecker.Typers$Typer.typedStats(Typers.scala:3032)
[INFO] [INFO] 	at scala.tools.nsc.typechecker.Typers$Typer.typedTemplate(Typers.scala:1919)
[INFO] [INFO] 	at scala.tools.nsc.typechecker.Typers$Typer.typedModuleDef(Typers.scala:1800)
[INFO] [INFO] 	at scala.tools.nsc.typechecker.Typers$Typer.typed1(Typers.scala:5584)
[INFO] [INFO] 	at scala.tools.nsc.typechecker.Typers$Typer.typed(Typers.scala:5642)
[INFO] [INFO] 	at scala.tools.nsc.typechecker.Typers$Typer.scala$tools$nsc$typechecker$Typers$Typer$$typedStat$1(Typers.scala:2928)
[INFO] [INFO] 	at scala.tools.nsc.typechecker.Typers$Typer$$anonfun$61.apply(Typers.scala:3032)
[INFO] [INFO] 	at scala.tools.nsc.typechecker.Typers$Typer$$anonfun$61.apply(Typers.scala:3032)
[INFO] [INFO] 	at scala.collection.immutable.List.loop$1(List.scala:170)
[INFO] [INFO] 	at scala.collection.immutable.List.mapConserve(List.scala:186)
[INFO] [INFO] 	at scala.tools.nsc.typechecker.Typers$Typer.typedStats(Typers.scala:3032)
[INFO] [INFO] 	at scala.tools.nsc.typechecker.Typers$Typer.typedPackageDef$1(Typers.scala:5301)
[INFO] [INFO] 	at scala.tools.nsc.typechecker.Typers$Typer.typed1(Typers.scala:5587)
[INFO] [INFO] 	at scala.tools.nsc.typechecker.Typers$Typer.typed(Typers.scala:5642)
[INFO] [INFO] 	at scala.tools.nsc.typechecker.Typers$Typer.typed(Typers.scala:5704)
[INFO] [INFO] 	at scala.tools.nsc.typechecker.Analyzer$typerFactory$$anon$3.apply(Analyzer.scala:99)
[INFO] [INFO] 	at scala.tools.nsc.Global$GlobalPhase.applyPhase(Global.scala:464)
[INFO] [INFO] 	at scala.tools.nsc.typechecker.Analyzer$typerFactory$$anon$3$$anonfun$run$1.apply(Analyzer.scala:91)
[INFO] [INFO] 	at scala.tools.nsc.typechecker.Analyzer$typerFactory$$anon$3$$anonfun$run$1.apply(Analyzer.scala:91)
[INFO] [INFO] 	at scala.collection.Iterator$class.foreach(Iterator.scala:727)
[INFO] [INFO] 	at scala.collection.AbstractIterator.foreach(Iterator.scala:1157)
[INFO] [INFO] 	at scala.tools.nsc.typechecker.Analyzer$typerFactory$$anon$3.run(Analyzer.scala:91)
[INFO] [INFO] 	at scala.tools.nsc.Global$Run.compileUnitsInternal(Global.scala:1583)
[INFO] [INFO] 	at scala.tools.nsc.Global$Run.compileUnits(Global.scala:1557)
[INFO] [INFO] 	at scala.tools.nsc.Global$Run.compileSources(Global.scala:1553)
[INFO] [INFO] 	at scala.tools.nsc.Global$Run.compile(Global.scala:1662)
[INFO] [INFO] 	at scala.tools.nsc.Driver.doCompile(Driver.scala:33)
[INFO] [INFO] 	at scala.tools.nsc.Main$.doCompile(Main.scala:79)
[INFO] [INFO] 	at scala.tools.nsc.Driver.process(Driver.scala:54)
[INFO] [INFO] 	at scala.tools.nsc.Driver.main(Driver.scala:67)
[INFO] [INFO] 	at scala.tools.nsc.Main.main(Main.scala)
[INFO] [INFO] 	... 6 more
[INFO] [INFO] ------------------------------------------------------------------------
[INFO] [INFO] BUILD FAILURE
[INFO] [INFO] ------------------------------------------------------------------------
[INFO] [INFO] Total time: 03:37 min
[INFO] [INFO] Finished at: 2015-03-29T17:35:31+00:00
[INFO] [INFO] Final Memory: 17M/299M
[INFO] [INFO] ------------------------------------------------------------------------
[INFO] [ERROR] Failed to execute goal net.alchim31.maven:scala-maven-plugin:3.1.4:compile
(default) on project testArtifact: wrap: org.apache.commons.exec.ExecuteException: Process
exited with an error: 240 (Exit value: 240) -> [Help 1]
[INFO] org.apache.maven.lifecycle.LifecycleExecutionException: Failed to execute goal net.alchim31.maven:scala-maven-plugin:3.1.4:compile
(default) on project testArtifact: wrap: org.apache.commons.exec.ExecuteException: Process
exited with an error: 240 (Exit value: 240)
[INFO] 	at org.apache.maven.lifecycle.internal.MojoExecutor.execute(MojoExecutor.java:216)
[INFO] 	at org.apache.maven.lifecycle.internal.MojoExecutor.execute(MojoExecutor.java:153)
[INFO] 	at org.apache.maven.lifecycle.internal.MojoExecutor.execute(MojoExecutor.java:145)
[INFO] 	at org.apache.maven.lifecycle.internal.LifecycleModuleBuilder.buildProject(LifecycleModuleBuilder.java:116)
[INFO] 	at org.apache.maven.lifecycle.internal.LifecycleModuleBuilder.buildProject(LifecycleModuleBuilder.java:80)
[INFO] 	at org.apache.maven.lifecycle.internal.builder.singlethreaded.SingleThreadedBuilder.build(SingleThreadedBuilder.java:51)
[INFO] 	at org.apache.maven.lifecycle.internal.LifecycleStarter.execute(LifecycleStarter.java:120)
[INFO] 	at org.apache.maven.DefaultMaven.doExecute(DefaultMaven.java:355)
[INFO] 	at org.apache.maven.DefaultMaven.execute(DefaultMaven.java:155)
[INFO] 	at org.apache.maven.cli.MavenCli.execute(MavenCli.java:584)
[INFO] 	at org.apache.maven.cli.MavenCli.doMain(MavenCli.java:216)
[INFO] 	at org.apache.maven.cli.MavenCli.main(MavenCli.java:160)
[INFO] 	at sun.reflect.NativeMethodAccessorImpl.invoke0(Native Method)
[INFO] 	at sun.reflect.NativeMethodAccessorImpl.invoke(NativeMethodAccessorImpl.java:62)
[INFO] 	at sun.reflect.DelegatingMethodAccessorImpl.invoke(DelegatingMethodAccessorImpl.java:43)
[INFO] 	at java.lang.reflect.Method.invoke(Method.java:483)
[INFO] 	at org.codehaus.plexus.classworlds.launcher.Launcher.launchEnhanced(Launcher.java:289)
[INFO] 	at org.codehaus.plexus.classworlds.launcher.Launcher.launch(Launcher.java:229)
[INFO] 	at org.codehaus.plexus.classworlds.launcher.Launcher.mainWithExitCode(Launcher.java:415)
[INFO] 	at org.codehaus.plexus.classworlds.launcher.Launcher.main(Launcher.java:356)
[INFO] Caused by: org.apache.maven.plugin.MojoExecutionException: wrap: org.apache.commons.exec.ExecuteException:
Process exited with an error: 240 (Exit value: 240)
[INFO] 	at scala_maven.ScalaMojoSupport.execute(ScalaMojoSupport.java:468)
[INFO] 	at org.apache.maven.plugin.DefaultBuildPluginManager.executeMojo(DefaultBuildPluginManager.java:132)
[INFO] 	at org.apache.maven.lifecycle.internal.MojoExecutor.execute(MojoExecutor.java:208)
[INFO] 	... 19 more
[INFO] Caused by: org.apache.commons.exec.ExecuteException: Process exited with an error:
240 (Exit value: 240)
[INFO] 	at org.apache.commons.exec.DefaultExecutor.executeInternal(DefaultExecutor.java:377)
[INFO] 	at org.apache.commons.exec.DefaultExecutor.execute(DefaultExecutor.java:160)
[INFO] 	at org.apache.commons.exec.DefaultExecutor.execute(DefaultExecutor.java:147)
[INFO] 	at scala_maven_executions.JavaMainCallerByFork.run(JavaMainCallerByFork.java:100)
[INFO] 	at scala_maven.ScalaCompilerSupport.compile(ScalaCompilerSupport.java:154)
[INFO] 	at scala_maven.ScalaCompilerSupport.doExecute(ScalaCompilerSupport.java:104)
[INFO] 	at scala_maven.ScalaMojoSupport.execute(ScalaMojoSupport.java:460)
[INFO] 	... 21 more
[INFO] [ERROR] 
[INFO] [ERROR] Re-run Maven using the -X switch to enable full debug logging.
[INFO] [ERROR] 
[INFO] [ERROR] For more information about the errors and possible solutions, please read the
following articles:
[INFO] [ERROR] [Help 1] http://cwiki.apache.org/confluence/display/MAVEN/MojoExecutionException
[INFO] Post-archetype-generation invoker exit code: 1
{code}



--
This message was sent by Atlassian JIRA
(v6.3.4#6332)

Mime
View raw message