flink-dev mailing list archives

Site index · List index
Message view « Date » · « Thread »
Top « Date » · « Thread »
From Henry Saputra <henry.sapu...@gmail.com>
Subject Re: YARN ITCases fail, master broken?
Date Sat, 24 Jan 2015 00:47:08 GMT
Hmm, I think there could be some weird dependencies to get the Flink
YARN uber jar.

If you do "mvn clean install -DskipTests" then call "mvn test" all the
tests passed.

But if you directly call "mvn clean test" then you see the stack I
have seen before.

- Henry


On Fri, Jan 23, 2015 at 3:35 PM, Henry Saputra <henry.saputra@gmail.com> wrote:
> Did not see that trace but do see this:
>
> -------------------------------------------------------
>
>  T E S T S
>
> -------------------------------------------------------
>
> Running org.apache.flink.yarn.UtilsTest
>
> log4j:WARN No such property [append] in org.apache.log4j.ConsoleAppender.
>
> Tests run: 1, Failures: 1, Errors: 0, Skipped: 0, Time elapsed: 0.476
> sec <<< FAILURE! - in org.apache.flink.yarn.UtilsTest
>
> testUberjarLocator(org.apache.flink.yarn.UtilsTest)  Time elapsed:
> 0.405 sec  <<< FAILURE!
>
> java.lang.AssertionError: null
>
> at org.junit.Assert.fail(Assert.java:86)
>
> at org.junit.Assert.assertTrue(Assert.java:41)
>
> at org.junit.Assert.assertNotNull(Assert.java:621)
>
> at org.junit.Assert.assertNotNull(Assert.java:631)
>
> at org.apache.flink.yarn.UtilsTest.testUberjarLocator(UtilsTest.java:32)
>
>
>
> Results :
>
>
> Failed tests:
>
>   UtilsTest.testUberjarLocator:32 null
>
>
> Tests run: 1, Failures: 1, Errors: 0, Skipped: 0
>
>
> - Henry
>
> On Fri, Jan 23, 2015 at 2:16 PM, Fabian Hueske <fhueske@gmail.com> wrote:
>> Hi all,
>>
>> I tried to build the current master (mvn clean install) and some tests in
>> the flink-yarn-tests module fail:
>>
>> Failed tests:
>>
>>
>> YARNSessionCapacitySchedulerITCase.testClientStartup:50->YarnTestBase.runWithArgs:314
>> During the timeout period of 60 seconds the expected string did not show up
>>
>>   YARNSessionCapacitySchedulerITCase>YarnTestBase.checkClusterEmpty:146
>> There is at least one application on the cluster is not finished
>>
>>   YARNSessionFIFOITCase.perJobYarnCluster:184->YarnTestBase.runWithArgs:314
>> During the timeout period of 60 seconds the expected string did not show up
>>
>>   YARNSessionFIFOITCase>YarnTestBase.checkClusterEmpty:146 There is at
>> least one application on the cluster is not finished
>>
>>   YARNSessionFIFOITCase>YarnTestBase.checkClusterEmpty:146 There is at
>> least one application on the cluster is not finished
>>
>>   YARNSessionFIFOITCase>YarnTestBase.checkClusterEmpty:146 There is at
>> least one application on the cluster is not finished
>>
>>   YARNSessionFIFOITCase>YarnTestBase.checkClusterEmpty:146 There is at
>> least one application on the cluster is not finished
>>
>>   YARNSessionFIFOITCase>YarnTestBase.checkClusterEmpty:146 There is at
>> least one application on the cluster is not finished
>>
>>   YARNSessionFIFOITCase>YarnTestBase.checkClusterEmpty:146 There is at
>> least one application on the cluster is not finished
>>
>>   YARNSessionFIFOITCase>YarnTestBase.checkClusterEmpty:146 There is at
>> least one application on the cluster is not finished
>>
>>
>> Tests run: 10, Failures: 10, Errors: 0, Skipped: 0
>>
>> Anybody else got this problem?
>>
>> Cheers, Fabian

Mime
View raw message