flink-commits mailing list archives

Site index · List index
Message view « Date » · « Thread »
Top « Date » · « Thread »
From Apache Jenkins Server <jenk...@builds.apache.org>
Subject Build failed in Jenkins: flink-snapshot-deployment #547
Date Tue, 01 Aug 2017 03:41:12 GMT
See <https://builds.apache.org/job/flink-snapshot-deployment/547/display/redirect>

------------------------------------------
[...truncated 234.53 KB...]
[ERROR] public static void tryRethrowIOException(Throwable t) throws IOException {
[ERROR] ^
[ERROR] <https://builds.apache.org/job/flink-snapshot-deployment/ws/flink-core/src/main/java/org/apache/flink/util/ExceptionUtils.java>:262:
warning: no @throws for java.io.IOException
[ERROR] public static void rethrowIOException(Throwable t) throws IOException {
[ERROR] ^
[ERROR] <https://builds.apache.org/job/flink-snapshot-deployment/ws/flink-core/src/main/java/org/apache/flink/util/InstantiationUtil.java>:342:
warning: no description for @throws
[ERROR] * @throws IOException
[ERROR] ^
[ERROR] <https://builds.apache.org/job/flink-snapshot-deployment/ws/flink-core/src/main/java/org/apache/flink/util/InstantiationUtil.java>:343:
warning: no description for @throws
[ERROR] * @throws ClassNotFoundException
[ERROR] ^
[ERROR] <https://builds.apache.org/job/flink-snapshot-deployment/ws/flink-core/src/main/java/org/apache/flink/util/InstantiationUtil.java>:363:
warning: no description for @throws
[ERROR] * @throws IOException
[ERROR] ^
[ERROR] <https://builds.apache.org/job/flink-snapshot-deployment/ws/flink-core/src/main/java/org/apache/flink/util/InstantiationUtil.java>:364:
warning: no description for @throws
[ERROR] * @throws ClassNotFoundException
[ERROR] ^
[ERROR] <https://builds.apache.org/job/flink-snapshot-deployment/ws/flink-core/src/main/java/org/apache/flink/util/IOUtils.java>:248:
warning: no @param for closeables
[ERROR] public static void closeAllQuietly(Iterable<? extends AutoCloseable> closeables)
{
[ERROR] ^
[ERROR] <https://builds.apache.org/job/flink-snapshot-deployment/ws/flink-core/src/main/java/org/apache/flink/util/IOUtils.java>:259:
warning: no @param for closeable
[ERROR] public static void closeQuietly(AutoCloseable closeable) {
[ERROR] ^
[ERROR] <https://builds.apache.org/job/flink-snapshot-deployment/ws/flink-core/src/main/java/org/apache/flink/util/NetUtils.java>:77:
warning: no @param for hostPort
[ERROR] public static URL getCorrectHostnamePort(String hostPort) {
[ERROR] ^
[ERROR] <https://builds.apache.org/job/flink-snapshot-deployment/ws/flink-core/src/main/java/org/apache/flink/util/Preconditions.java>:56:
warning: no @param for <T>
[ERROR] public static <T> T checkNotNull(T reference) {
[ERROR] ^
[ERROR] <https://builds.apache.org/job/flink-snapshot-deployment/ws/flink-core/src/main/java/org/apache/flink/util/Preconditions.java>:73:
warning: no @param for <T>
[ERROR] public static <T> T checkNotNull(T reference, @Nullable String errorMessage)
{
[ERROR] ^
[ERROR] <https://builds.apache.org/job/flink-snapshot-deployment/ws/flink-core/src/main/java/org/apache/flink/util/Preconditions.java>:99:
warning: no @param for <T>
[ERROR] public static <T> T checkNotNull(T reference,
[ERROR] ^
[ERROR] <https://builds.apache.org/job/flink-snapshot-deployment/ws/flink-core/src/main/java/org/apache/flink/util/PropertiesUtil.java>:37:
warning: no description for @throws
[ERROR] * @throws IllegalArgumentException
[ERROR] ^
[ERROR] <https://builds.apache.org/job/flink-snapshot-deployment/ws/flink-core/src/main/java/org/apache/flink/util/PropertiesUtil.java>:61:
warning: no description for @throws
[ERROR] * @throws IllegalArgumentException
[ERROR] ^
[ERROR] <https://builds.apache.org/job/flink-snapshot-deployment/ws/flink-core/src/main/java/org/apache/flink/util/PropertiesUtil.java>:85:
warning: no description for @throws
[ERROR] * @throws IllegalArgumentException
[ERROR] ^
[ERROR] <https://builds.apache.org/job/flink-snapshot-deployment/ws/flink-core/src/main/java/org/apache/flink/util/PropertiesUtil.java>:87:
warning: no @param for logger
[ERROR] public static long getLong(Properties config, String key, long defaultValue, Logger
logger) {
[ERROR] ^
[ERROR] <https://builds.apache.org/job/flink-snapshot-deployment/ws/flink-core/src/main/java/org/apache/flink/util/StringBasedID.java>:39:
warning: no @param for keyString
[ERROR] protected StringBasedID(String keyString) {
[ERROR] ^
[ERROR] <https://builds.apache.org/job/flink-snapshot-deployment/ws/flink-core/src/main/java/org/apache/flink/util/Visitor.java>:32:
warning: no description for @param
[ERROR] * @param visitable
[ERROR] ^
[ERROR] <https://builds.apache.org/job/flink-snapshot-deployment/ws/flink-core/src/main/java/org/apache/flink/util/Visitor.java>:39:
warning: no description for @param
[ERROR] * @param visitable
[ERROR] ^
[ERROR] <https://builds.apache.org/job/flink-snapshot-deployment/ws/flink-core/src/main/java/org/apache/flink/core/fs/AbstractMultiFSDataInputStream.java>:112:
warning: no description for @throws
[ERROR] * @throws IOException
[ERROR] ^
[ERROR] <https://builds.apache.org/job/flink-snapshot-deployment/ws/flink-core/src/main/java/org/apache/flink/core/fs/FileSystem.java>:271:
warning: no @throws for java.io.IOException
[ERROR] public static void setDefaultScheme(Configuration config) throws IOException {
[ERROR] ^
[ERROR] <https://builds.apache.org/job/flink-snapshot-deployment/ws/flink-core/src/main/java/org/apache/flink/core/fs/FileSystem.java>:472:
warning: no @throws for java.io.IOException
[ERROR] public abstract void initialize(URI name) throws IOException;
[ERROR] ^
[ERROR] <https://builds.apache.org/job/flink-snapshot-deployment/ws/flink-core/src/main/java/org/apache/flink/core/fs/FileSystem.java>:494:
warning: no @param for file
[ERROR] public abstract BlockLocation[] getFileBlockLocations(FileStatus file, long start,
long len) throws IOException;
[ERROR] ^
[ERROR] <https://builds.apache.org/job/flink-snapshot-deployment/ws/flink-core/src/main/java/org/apache/flink/core/fs/FileSystem.java>:494:
warning: no @param for start
[ERROR] public abstract BlockLocation[] getFileBlockLocations(FileStatus file, long start,
long len) throws IOException;
[ERROR] ^
[ERROR] <https://builds.apache.org/job/flink-snapshot-deployment/ws/flink-core/src/main/java/org/apache/flink/core/fs/FileSystem.java>:494:
warning: no @param for len
[ERROR] public abstract BlockLocation[] getFileBlockLocations(FileStatus file, long start,
long len) throws IOException;
[ERROR] ^
[ERROR] <https://builds.apache.org/job/flink-snapshot-deployment/ws/flink-core/src/main/java/org/apache/flink/core/fs/FileSystem.java>:494:
warning: no @return
[ERROR] public abstract BlockLocation[] getFileBlockLocations(FileStatus file, long start,
long len) throws IOException;
[ERROR] ^
[ERROR] <https://builds.apache.org/job/flink-snapshot-deployment/ws/flink-core/src/main/java/org/apache/flink/core/fs/FileSystem.java>:494:
warning: no @throws for java.io.IOException
[ERROR] public abstract BlockLocation[] getFileBlockLocations(FileStatus file, long start,
long len) throws IOException;
[ERROR] ^
[ERROR] <https://builds.apache.org/job/flink-snapshot-deployment/ws/flink-core/src/main/java/org/apache/flink/core/fs/FileSystem.java>:504:
warning: no @return
[ERROR] public abstract FSDataInputStream open(Path f, int bufferSize) throws IOException;
[ERROR] ^
[ERROR] <https://builds.apache.org/job/flink-snapshot-deployment/ws/flink-core/src/main/java/org/apache/flink/core/fs/FileSystem.java>:504:
warning: no @throws for java.io.IOException
[ERROR] public abstract FSDataInputStream open(Path f, int bufferSize) throws IOException;
[ERROR] ^
[ERROR] <https://builds.apache.org/job/flink-snapshot-deployment/ws/flink-core/src/main/java/org/apache/flink/core/fs/FileSystem.java>:512:
warning: no @return
[ERROR] public abstract FSDataInputStream open(Path f) throws IOException;
[ERROR] ^
[ERROR] <https://builds.apache.org/job/flink-snapshot-deployment/ws/flink-core/src/main/java/org/apache/flink/core/fs/FileSystem.java>:512:
warning: no @throws for java.io.IOException
[ERROR] public abstract FSDataInputStream open(Path f) throws IOException;
[ERROR] ^
[ERROR] <https://builds.apache.org/job/flink-snapshot-deployment/ws/flink-core/src/main/java/org/apache/flink/core/fs/FileSystem.java>:530:
warning: no description for @throws
[ERROR] * @throws IOException
[ERROR] ^
[ERROR] <https://builds.apache.org/job/flink-snapshot-deployment/ws/flink-core/src/main/java/org/apache/flink/core/fs/FileSystem.java>:540:
warning: no @return
[ERROR] public boolean exists(final Path f) throws IOException {
[ERROR] ^
[ERROR] <https://builds.apache.org/job/flink-snapshot-deployment/ws/flink-core/src/main/java/org/apache/flink/core/fs/FileSystem.java>:540:
warning: no @throws for java.io.IOException
[ERROR] public boolean exists(final Path f) throws IOException {
[ERROR] ^
[ERROR] <https://builds.apache.org/job/flink-snapshot-deployment/ws/flink-core/src/main/java/org/apache/flink/core/fs/FileSystem.java>:557:
warning: no description for @throws
[ERROR] * @throws IOException
[ERROR] ^
[ERROR] <https://builds.apache.org/job/flink-snapshot-deployment/ws/flink-core/src/main/java/org/apache/flink/core/fs/FileSystem.java>:601:
warning: no @return
[ERROR] public abstract FSDataOutputStream create(Path f, boolean overwrite, int bufferSize,
short replication,
[ERROR] ^
[ERROR] <https://builds.apache.org/job/flink-snapshot-deployment/ws/flink-core/src/main/java/org/apache/flink/core/fs/FileSystem.java>:620:
warning: no @return
[ERROR] public FSDataOutputStream create(Path f, boolean overwrite) throws IOException {
[ERROR] ^
[ERROR] <https://builds.apache.org/job/flink-snapshot-deployment/ws/flink-core/src/main/java/org/apache/flink/core/fs/FileSystem.java>:649:
warning: no description for @throws
[ERROR] * @throws IOException
[ERROR] ^
[ERROR] <https://builds.apache.org/job/flink-snapshot-deployment/ws/flink-core/src/main/java/org/apache/flink/core/fs/FileSystemSafetyNet.java>:115:
warning: no @return
[ERROR] public static SafetyNetCloseableRegistry getSafetyNetCloseableRegistryForThread()
{
[ERROR] ^
[ERROR] <https://builds.apache.org/job/flink-snapshot-deployment/ws/flink-core/src/main/java/org/apache/flink/api/java/typeutils/InputTypeConfigurable.java>:29:
error: unterminated inline tag
[ERROR] * will be called when the output format is used with an output API method.
[ERROR] ^
[ERROR] <https://builds.apache.org/job/flink-snapshot-deployment/ws/flink-core/src/main/java/org/apache/flink/api/java/typeutils/TypeExtractor.java>:529:
error: malformed HTML
[ERROR] * OUT apply(Map<String, List<IN>> value)
[ERROR] ^
[ERROR] <https://builds.apache.org/job/flink-snapshot-deployment/ws/flink-core/src/main/java/org/apache/flink/api/java/typeutils/TypeExtractor.java>:529:
error: unknown tag: IN
[ERROR] * OUT apply(Map<String, List<IN>> value)
[ERROR] ^
[ERROR] <https://builds.apache.org/job/flink-snapshot-deployment/ws/flink-core/src/main/java/org/apache/flink/api/java/typeutils/TypeExtractor.java>:529:
error: bad use of '>'
[ERROR] * OUT apply(Map<String, List<IN>> value)
[ERROR] ^
[ERROR] <https://builds.apache.org/job/flink-snapshot-deployment/ws/flink-core/src/main/java/org/apache/flink/api/java/typeutils/TypeExtractor.java>:642:
error: malformed HTML
[ERROR] * OUT apply(Map<String, List<IN1>> value1, List<IN2> value2)
[ERROR] ^
[ERROR] <https://builds.apache.org/job/flink-snapshot-deployment/ws/flink-core/src/main/java/org/apache/flink/api/java/typeutils/TypeExtractor.java>:642:
error: unknown tag: IN1
[ERROR] * OUT apply(Map<String, List<IN1>> value1, List<IN2> value2)
[ERROR] ^
[ERROR] <https://builds.apache.org/job/flink-snapshot-deployment/ws/flink-core/src/main/java/org/apache/flink/api/java/typeutils/TypeExtractor.java>:642:
error: bad use of '>'
[ERROR] * OUT apply(Map<String, List<IN1>> value1, List<IN2> value2)
[ERROR] ^
[ERROR] <https://builds.apache.org/job/flink-snapshot-deployment/ws/flink-core/src/main/java/org/apache/flink/api/java/typeutils/TypeExtractor.java>:642:
error: unknown tag: IN2
[ERROR] * OUT apply(Map<String, List<IN1>> value1, List<IN2> value2)
[ERROR] ^
[ERROR] <https://builds.apache.org/job/flink-snapshot-deployment/ws/flink-core/src/main/java/org/apache/flink/api/java/tuple/Tuple1.java>:45:
error: unexpected end tag: </p>
[ERROR] * </ul></p>
[ERROR] ^
[ERROR] <https://builds.apache.org/job/flink-snapshot-deployment/ws/flink-core/src/main/java/org/apache/flink/api/java/tuple/Tuple10.java>:45:
error: unexpected end tag: </p>
[ERROR] * </ul></p>
[ERROR] ^
[ERROR] <https://builds.apache.org/job/flink-snapshot-deployment/ws/flink-core/src/main/java/org/apache/flink/api/java/tuple/Tuple11.java>:45:
error: unexpected end tag: </p>
[ERROR] * </ul></p>
[ERROR] ^
[ERROR] <https://builds.apache.org/job/flink-snapshot-deployment/ws/flink-core/src/main/java/org/apache/flink/api/java/tuple/Tuple12.java>:45:
error: unexpected end tag: </p>
[ERROR] * </ul></p>
[ERROR] ^
[ERROR] <https://builds.apache.org/job/flink-snapshot-deployment/ws/flink-core/src/main/java/org/apache/flink/api/java/tuple/Tuple13.java>:45:
error: unexpected end tag: </p>
[ERROR] * </ul></p>
[ERROR] ^
[ERROR] <https://builds.apache.org/job/flink-snapshot-deployment/ws/flink-core/src/main/java/org/apache/flink/api/java/tuple/Tuple14.java>:45:
error: unexpected end tag: </p>
[ERROR] * </ul></p>
[ERROR] ^
[ERROR] <https://builds.apache.org/job/flink-snapshot-deployment/ws/flink-core/src/main/java/org/apache/flink/api/java/tuple/Tuple15.java>:45:
error: unexpected end tag: </p>
[ERROR] * </ul></p>
[ERROR] ^
[ERROR] <https://builds.apache.org/job/flink-snapshot-deployment/ws/flink-core/src/main/java/org/apache/flink/api/java/tuple/Tuple16.java>:45:
error: unexpected end tag: </p>
[ERROR] * </ul></p>
[ERROR] ^
[ERROR] <https://builds.apache.org/job/flink-snapshot-deployment/ws/flink-core/src/main/java/org/apache/flink/api/java/tuple/Tuple17.java>:45:
error: unexpected end tag: </p>
[ERROR] * </ul></p>
[ERROR] ^
[ERROR] <https://builds.apache.org/job/flink-snapshot-deployment/ws/flink-core/src/main/java/org/apache/flink/api/java/tuple/Tuple18.java>:45:
error: unexpected end tag: </p>
[ERROR] * </ul></p>
[ERROR] ^
[ERROR] <https://builds.apache.org/job/flink-snapshot-deployment/ws/flink-core/src/main/java/org/apache/flink/api/java/tuple/Tuple19.java>:45:
error: unexpected end tag: </p>
[ERROR] * </ul></p>
[ERROR] ^
[ERROR] <https://builds.apache.org/job/flink-snapshot-deployment/ws/flink-core/src/main/java/org/apache/flink/api/java/tuple/Tuple2.java>:45:
error: unexpected end tag: </p>
[ERROR] * </ul></p>
[ERROR] ^
[ERROR] <https://builds.apache.org/job/flink-snapshot-deployment/ws/flink-core/src/main/java/org/apache/flink/api/java/tuple/Tuple20.java>:45:
error: unexpected end tag: </p>
[ERROR] * </ul></p>
[ERROR] ^
[ERROR] <https://builds.apache.org/job/flink-snapshot-deployment/ws/flink-core/src/main/java/org/apache/flink/api/java/tuple/Tuple21.java>:45:
error: unexpected end tag: </p>
[ERROR] * </ul></p>
[ERROR] ^
[ERROR] <https://builds.apache.org/job/flink-snapshot-deployment/ws/flink-core/src/main/java/org/apache/flink/api/java/tuple/Tuple22.java>:45:
error: unexpected end tag: </p>
[ERROR] * </ul></p>
[ERROR] ^
[ERROR] <https://builds.apache.org/job/flink-snapshot-deployment/ws/flink-core/src/main/java/org/apache/flink/api/java/tuple/Tuple23.java>:45:
error: unexpected end tag: </p>
[ERROR] * </ul></p>
[ERROR] ^
[ERROR] <https://builds.apache.org/job/flink-snapshot-deployment/ws/flink-core/src/main/java/org/apache/flink/api/java/tuple/Tuple24.java>:45:
error: unexpected end tag: </p>
[ERROR] * </ul></p>
[ERROR] ^
[ERROR] <https://builds.apache.org/job/flink-snapshot-deployment/ws/flink-core/src/main/java/org/apache/flink/api/java/tuple/Tuple25.java>:45:
error: unexpected end tag: </p>
[ERROR] * </ul></p>
[ERROR] ^
[ERROR] <https://builds.apache.org/job/flink-snapshot-deployment/ws/flink-core/src/main/java/org/apache/flink/api/java/tuple/Tuple3.java>:45:
error: unexpected end tag: </p>
[ERROR] * </ul></p>
[ERROR] ^
[ERROR] <https://builds.apache.org/job/flink-snapshot-deployment/ws/flink-core/src/main/java/org/apache/flink/api/java/tuple/Tuple4.java>:45:
error: unexpected end tag: </p>
[ERROR] * </ul></p>
[ERROR] ^
[ERROR] <https://builds.apache.org/job/flink-snapshot-deployment/ws/flink-core/src/main/java/org/apache/flink/api/java/tuple/Tuple5.java>:45:
error: unexpected end tag: </p>
[ERROR] * </ul></p>
[ERROR] ^
[ERROR] <https://builds.apache.org/job/flink-snapshot-deployment/ws/flink-core/src/main/java/org/apache/flink/api/java/tuple/Tuple6.java>:45:
error: unexpected end tag: </p>
[ERROR] * </ul></p>
[ERROR] ^
[ERROR] <https://builds.apache.org/job/flink-snapshot-deployment/ws/flink-core/src/main/java/org/apache/flink/api/java/tuple/Tuple7.java>:45:
error: unexpected end tag: </p>
[ERROR] * </ul></p>
[ERROR] ^
[ERROR] <https://builds.apache.org/job/flink-snapshot-deployment/ws/flink-core/src/main/java/org/apache/flink/api/java/tuple/Tuple8.java>:45:
error: unexpected end tag: </p>
[ERROR] * </ul></p>
[ERROR] ^
[ERROR] <https://builds.apache.org/job/flink-snapshot-deployment/ws/flink-core/src/main/java/org/apache/flink/api/java/tuple/Tuple9.java>:45:
error: unexpected end tag: </p>
[ERROR] * </ul></p>
[ERROR] ^
[ERROR] <https://builds.apache.org/job/flink-snapshot-deployment/ws/flink-core/src/main/java/org/apache/flink/api/common/ExecutionConfig.java>:233:
error: malformed HTML
[ERROR] * Setting a tracking interval <= 0 disables the latency tracking.
[ERROR] ^
[ERROR] <https://builds.apache.org/job/flink-snapshot-deployment/ws/flink-core/src/main/java/org/apache/flink/api/common/state/FoldingStateDescriptor.java>:50:
error: reference not found
[ERROR] * consider using the {@link #FoldingStateDescriptor(String, ACC, FoldFunction, TypeInformation)}
constructor.
[ERROR] ^
[ERROR] <https://builds.apache.org/job/flink-snapshot-deployment/ws/flink-core/src/main/java/org/apache/flink/api/common/typeutils/TypeSerializerConfigSnapshot.java>:27:
error: unexpected text
[ERROR] * A {@code TypeSerializerConfigSnapshot} is a point-in-time view of a {@link TypeSerializer's}
configuration.
[ERROR] ^
[ERROR] <https://builds.apache.org/job/flink-snapshot-deployment/ws/flink-core/src/main/java/org/apache/flink/api/common/functions/GroupReduceFunction.java>:44:
error: type arguments not allowed here
[ERROR] * Implement the {@link GroupCombineFunction<T, T>} interface to enable partial
computations, i.e.,
[ERROR] ^
[ERROR] <https://builds.apache.org/job/flink-snapshot-deployment/ws/flink-core/src/main/java/org/apache/flink/api/common/functions/RichGroupReduceFunction.java>:32:
error: type arguments not allowed here
[ERROR] * Implement the {@link GroupCombineFunction<IN, IN>} interface to enable partial
computation, i.e.,
[ERROR] ^
[ERROR] <https://builds.apache.org/job/flink-snapshot-deployment/ws/flink-core/src/main/java/org/apache/flink/api/common/io/CheckpointableInputFormat.java>:52:
error: self-closing element not allowed
[ERROR] * <p/>
[ERROR] ^
[ERROR] 
[ERROR] Command line was: /usr/local/asfpackages/java/jdk1.8.0_144/jre/../bin/javadoc @options
@packages
[ERROR] 
[ERROR] Refer to the generated Javadoc files in '<https://builds.apache.org/job/flink-snapshot-deployment/ws/flink-core/target/apidocs'>
dir.
[ERROR] -> [Help 1]
[ERROR] 
[ERROR] To see the full stack trace of the errors, re-run Maven with the -e switch.
[ERROR] Re-run Maven using the -X switch to enable full debug logging.
[ERROR] 
[ERROR] For more information about the errors and possible solutions, please read the following
articles:
[ERROR] [Help 1] http://cwiki.apache.org/confluence/display/MAVEN/MojoExecutionException
[ERROR] 
[ERROR] After correcting the problems, you can resume the build with the command
[ERROR]   mvn <goals> -rf :flink-core
Build step 'Execute shell' marked build as failure
Setting MAVEN_3_2_5_HOME=/home/jenkins/tools/maven/apache-maven-3.2.5

Mime
View raw message