flink-commits mailing list archives

Site index · List index
Message view « Date » · « Thread »
Top « Date » · « Thread »
From Apache Jenkins Server <jenk...@builds.apache.org>
Subject Build failed in Jenkins: flink-snapshot-deployment #444
Date Thu, 27 Apr 2017 16:20:20 GMT
See <https://builds.apache.org/job/flink-snapshot-deployment/444/display/redirect>

------------------------------------------
[...truncated 433.20 KB...]
  required: org.apache.flink.streaming.runtime.operators.windowing.EvictingWindowOperator<java.lang.String,org.apache.flink.api.java.tuple.Tuple2<java.lang.String,java.lang.Integer>,?,?>
  found:    org.apache.flink.streaming.api.operators.OneInputStreamOperator<org.apache.flink.api.java.tuple.Tuple2<java.lang.String,java.lang.Integer>,org.apache.flink.api.java.tuple.Tuple2<java.lang.String,java.lang.Integer>>
[WARNING] <https://builds.apache.org/job/flink-snapshot-deployment/ws/flink-streaming-java/src/test/java/org/apache/flink/streaming/util/AbstractStreamOperatorTestHarness.java>:[223,159]
unchecked cast
  required: java.util.Collection<org.apache.flink.runtime.state.OperatorStateHandle>
  found:    java.lang.Object
[WARNING] <https://builds.apache.org/job/flink-snapshot-deployment/ws/flink-streaming-java/src/test/java/org/apache/flink/streaming/util/AbstractStreamOperatorTestHarness.java>:[238,69]
unchecked method invocation: method createOperatorStateBackend in class org.apache.flink.streaming.runtime.tasks.StreamTask
is applied to given types
  required: org.apache.flink.streaming.api.operators.StreamOperator<?>,java.util.Collection<org.apache.flink.runtime.state.OperatorStateHandle>
  found: org.apache.flink.streaming.api.operators.StreamOperator,java.util.Collection
[WARNING] <https://builds.apache.org/job/flink-snapshot-deployment/ws/flink-streaming-java/src/test/java/org/apache/flink/streaming/util/AbstractStreamOperatorTestHarness.java>:[238,100]
unchecked conversion
  required: java.util.Collection<org.apache.flink.runtime.state.OperatorStateHandle>
  found:    java.util.Collection
[WARNING] <https://builds.apache.org/job/flink-snapshot-deployment/ws/flink-streaming-java/src/test/java/org/apache/flink/streaming/util/AbstractStreamOperatorTestHarness.java>:[313,17]
org.apache.flink.migration.streaming.runtime.tasks.StreamTaskState in org.apache.flink.migration.streaming.runtime.tasks
has been deprecated
[WARNING] <https://builds.apache.org/job/flink-snapshot-deployment/ws/flink-streaming-java/src/test/java/org/apache/flink/streaming/util/AbstractStreamOperatorTestHarness.java>:[668,96]
unchecked call to copy(T) as a member of the raw type org.apache.flink.api.common.typeutils.TypeSerializer
[WARNING] <https://builds.apache.org/job/flink-snapshot-deployment/ws/flink-streaming-java/src/test/java/org/apache/flink/streaming/util/AbstractStreamOperatorTestHarness.java>:[670,96]
unchecked call to copy(T) as a member of the raw type org.apache.flink.api.common.typeutils.TypeSerializer
[WARNING] <https://builds.apache.org/job/flink-snapshot-deployment/ws/flink-streaming-java/src/test/java/org/apache/flink/streaming/util/KeyedTwoInputStreamOperatorTestHarness.java>:[98,97]
unchecked method invocation: method createKeyedStateBackend in class org.apache.flink.runtime.state.AbstractStateBackend
is applied to given types
  required: org.apache.flink.runtime.execution.Environment,org.apache.flink.api.common.JobID,java.lang.String,org.apache.flink.api.common.typeutils.TypeSerializer<K>,int,org.apache.flink.runtime.state.KeyGroupRange,org.apache.flink.runtime.query.TaskKvStateRegistry
  found: org.apache.flink.runtime.execution.Environment,org.apache.flink.api.common.JobID,java.lang.String,org.apache.flink.api.common.typeutils.TypeSerializer,int,org.apache.flink.runtime.state.KeyGroupRange,org.apache.flink.runtime.query.TaskKvStateRegistry
[WARNING] <https://builds.apache.org/job/flink-snapshot-deployment/ws/flink-streaming-java/src/test/java/org/apache/flink/streaming/util/KeyedTwoInputStreamOperatorTestHarness.java>:[102,57]
unchecked conversion
  required: org.apache.flink.api.common.typeutils.TypeSerializer<K>
  found:    org.apache.flink.api.common.typeutils.TypeSerializer
[WARNING] <https://builds.apache.org/job/flink-snapshot-deployment/ws/flink-streaming-java/src/test/java/org/apache/flink/streaming/util/KeyedTwoInputStreamOperatorTestHarness.java>:[111,66]
unchecked method invocation: method createKeyedStateBackend in class org.apache.flink.streaming.runtime.tasks.StreamTask
is applied to given types
  required: org.apache.flink.api.common.typeutils.TypeSerializer<K>,int,org.apache.flink.runtime.state.KeyGroupRange
  found: org.apache.flink.api.common.typeutils.TypeSerializer,int,org.apache.flink.runtime.state.KeyGroupRange
[WARNING] <https://builds.apache.org/job/flink-snapshot-deployment/ws/flink-streaming-java/src/test/java/org/apache/flink/streaming/util/KeyedTwoInputStreamOperatorTestHarness.java>:[111,70]
unchecked conversion
  required: org.apache.flink.api.common.typeutils.TypeSerializer<K>
  found:    org.apache.flink.api.common.typeutils.TypeSerializer
[WARNING] <https://builds.apache.org/job/flink-snapshot-deployment/ws/flink-streaming-java/src/test/java/org/apache/flink/streaming/runtime/operators/windowing/EventTimeSessionWindowsTest.java>:[70,38]
unchecked method invocation: method mergeWindows in class org.apache.flink.streaming.api.windowing.assigners.EventTimeSessionWindows
is applied to given types
  required: java.util.Collection<org.apache.flink.streaming.api.windowing.windows.TimeWindow>,org.apache.flink.streaming.api.windowing.assigners.MergingWindowAssigner.MergeCallback<org.apache.flink.streaming.api.windowing.windows.TimeWindow>
  found: java.util.ArrayList<org.apache.flink.streaming.api.windowing.windows.TimeWindow>,org.apache.flink.streaming.api.windowing.assigners.MergingWindowAssigner.MergeCallback
[WARNING] <https://builds.apache.org/job/flink-snapshot-deployment/ws/flink-streaming-java/src/test/java/org/apache/flink/streaming/runtime/operators/windowing/EventTimeSessionWindowsTest.java>:[70,81]
unchecked conversion
  required: org.apache.flink.streaming.api.windowing.assigners.MergingWindowAssigner.MergeCallback<org.apache.flink.streaming.api.windowing.windows.TimeWindow>
  found:    org.apache.flink.streaming.api.windowing.assigners.MergingWindowAssigner.MergeCallback
[WARNING] <https://builds.apache.org/job/flink-snapshot-deployment/ws/flink-streaming-java/src/test/java/org/apache/flink/streaming/runtime/operators/windowing/EventTimeSessionWindowsTest.java>:[72,48]
unchecked call to merge(java.util.Collection<W>,W) as a member of the raw type org.apache.flink.streaming.api.windowing.assigners.MergingWindowAssigner.MergeCallback
[WARNING] <https://builds.apache.org/job/flink-snapshot-deployment/ws/flink-streaming-java/src/test/java/org/apache/flink/streaming/runtime/operators/windowing/EventTimeSessionWindowsTest.java>:[81,38]
unchecked method invocation: method mergeWindows in class org.apache.flink.streaming.api.windowing.assigners.EventTimeSessionWindows
is applied to given types
  required: java.util.Collection<org.apache.flink.streaming.api.windowing.windows.TimeWindow>,org.apache.flink.streaming.api.windowing.assigners.MergingWindowAssigner.MergeCallback<org.apache.flink.streaming.api.windowing.windows.TimeWindow>
  found: java.util.ArrayList<org.apache.flink.streaming.api.windowing.windows.TimeWindow>,org.apache.flink.streaming.api.windowing.assigners.MergingWindowAssigner.MergeCallback
[WARNING] <https://builds.apache.org/job/flink-snapshot-deployment/ws/flink-streaming-java/src/test/java/org/apache/flink/streaming/runtime/operators/windowing/EventTimeSessionWindowsTest.java>:[81,81]
unchecked conversion
  required: org.apache.flink.streaming.api.windowing.assigners.MergingWindowAssigner.MergeCallback<org.apache.flink.streaming.api.windowing.windows.TimeWindow>
  found:    org.apache.flink.streaming.api.windowing.assigners.MergingWindowAssigner.MergeCallback
[WARNING] <https://builds.apache.org/job/flink-snapshot-deployment/ws/flink-streaming-java/src/test/java/org/apache/flink/streaming/runtime/operators/windowing/EventTimeSessionWindowsTest.java>:[83,48]
unchecked call to merge(java.util.Collection<W>,W) as a member of the raw type org.apache.flink.streaming.api.windowing.assigners.MergingWindowAssigner.MergeCallback
[WARNING] <https://builds.apache.org/job/flink-snapshot-deployment/ws/flink-streaming-java/src/test/java/org/apache/flink/streaming/runtime/operators/windowing/EventTimeSessionWindowsTest.java>:[92,38]
unchecked method invocation: method mergeWindows in class org.apache.flink.streaming.api.windowing.assigners.EventTimeSessionWindows
is applied to given types
  required: java.util.Collection<org.apache.flink.streaming.api.windowing.windows.TimeWindow>,org.apache.flink.streaming.api.windowing.assigners.MergingWindowAssigner.MergeCallback<org.apache.flink.streaming.api.windowing.windows.TimeWindow>
  found: java.util.ArrayList<org.apache.flink.streaming.api.windowing.windows.TimeWindow>,org.apache.flink.streaming.api.windowing.assigners.MergingWindowAssigner.MergeCallback
[WARNING] <https://builds.apache.org/job/flink-snapshot-deployment/ws/flink-streaming-java/src/test/java/org/apache/flink/streaming/runtime/operators/windowing/EventTimeSessionWindowsTest.java>:[99,33]
unchecked conversion
  required: org.apache.flink.streaming.api.windowing.assigners.MergingWindowAssigner.MergeCallback<org.apache.flink.streaming.api.windowing.windows.TimeWindow>
  found:    org.apache.flink.streaming.api.windowing.assigners.MergingWindowAssigner.MergeCallback
[WARNING] <https://builds.apache.org/job/flink-snapshot-deployment/ws/flink-streaming-java/src/test/java/org/apache/flink/streaming/runtime/operators/windowing/EventTimeSessionWindowsTest.java>:[102,65]
unchecked cast
  required: java.util.Collection<org.apache.flink.streaming.api.windowing.windows.TimeWindow>
  found:    java.lang.Iterable<capture#1 of ? extends org.apache.flink.streaming.api.windowing.windows.TimeWindow>
[WARNING] <https://builds.apache.org/job/flink-snapshot-deployment/ws/flink-streaming-java/src/test/java/org/apache/flink/streaming/runtime/operators/windowing/EventTimeSessionWindowsTest.java>:[101,49]
unchecked call to merge(java.util.Collection<W>,W) as a member of the raw type org.apache.flink.streaming.api.windowing.assigners.MergingWindowAssigner.MergeCallback
[WARNING] <https://builds.apache.org/job/flink-snapshot-deployment/ws/flink-streaming-java/src/test/java/org/apache/flink/streaming/runtime/operators/windowing/EventTimeSessionWindowsTest.java>:[106,65]
unchecked cast
  required: java.util.Collection<org.apache.flink.streaming.api.windowing.windows.TimeWindow>
  found:    java.lang.Iterable<capture#2 of ? extends org.apache.flink.streaming.api.windowing.windows.TimeWindow>
[WARNING] <https://builds.apache.org/job/flink-snapshot-deployment/ws/flink-streaming-java/src/test/java/org/apache/flink/streaming/runtime/operators/windowing/EventTimeSessionWindowsTest.java>:[105,49]
unchecked call to merge(java.util.Collection<W>,W) as a member of the raw type org.apache.flink.streaming.api.windowing.assigners.MergingWindowAssigner.MergeCallback
[WARNING] <https://builds.apache.org/job/flink-snapshot-deployment/ws/flink-streaming-java/src/test/java/org/apache/flink/streaming/runtime/operators/windowing/EventTimeSessionWindowsTest.java>:[109,49]
unchecked call to merge(java.util.Collection<W>,W) as a member of the raw type org.apache.flink.streaming.api.windowing.assigners.MergingWindowAssigner.MergeCallback
[WARNING] <https://builds.apache.org/job/flink-snapshot-deployment/ws/flink-streaming-java/src/test/java/org/apache/flink/streaming/runtime/operators/windowing/EventTimeSessionWindowsTest.java>:[118,38]
unchecked method invocation: method mergeWindows in class org.apache.flink.streaming.api.windowing.assigners.EventTimeSessionWindows
is applied to given types
  required: java.util.Collection<org.apache.flink.streaming.api.windowing.windows.TimeWindow>,org.apache.flink.streaming.api.windowing.assigners.MergingWindowAssigner.MergeCallback<org.apache.flink.streaming.api.windowing.windows.TimeWindow>
  found: java.util.ArrayList<org.apache.flink.streaming.api.windowing.windows.TimeWindow>,org.apache.flink.streaming.api.windowing.assigners.MergingWindowAssigner.MergeCallback
[WARNING] <https://builds.apache.org/job/flink-snapshot-deployment/ws/flink-streaming-java/src/test/java/org/apache/flink/streaming/util/KeyedOneInputStreamOperatorTestHarness.java>:
Some input files additionally use or override a deprecated API.
[WARNING] <https://builds.apache.org/job/flink-snapshot-deployment/ws/flink-streaming-java/src/test/java/org/apache/flink/streaming/runtime/operators/windowing/EventTimeSessionWindowsTest.java>:
Some input files additionally use unchecked or unsafe operations.
[INFO] 
[INFO] --- maven-checkstyle-plugin:2.17:check (default) @ flink-streaming-java_2.10 ---
[INFO] 
[INFO] --- maven-surefire-plugin:2.18.1:test (default-test) @ flink-streaming-java_2.10 ---
[INFO] Tests are skipped.
[INFO] 
[INFO] --- maven-jar-plugin:2.4:jar (default-jar) @ flink-streaming-java_2.10 ---
[INFO] Building jar: <https://builds.apache.org/job/flink-snapshot-deployment/ws/flink-streaming-java/target/flink-streaming-java_2.10-1.3-SNAPSHOT.jar>
[INFO] 
[INFO] --- maven-site-plugin:3.5.1:attach-descriptor (attach-descriptor) @ flink-streaming-java_2.10
---
[INFO] 
[INFO] --- maven-jar-plugin:2.4:test-jar (default) @ flink-streaming-java_2.10 ---
[INFO] Building jar: <https://builds.apache.org/job/flink-snapshot-deployment/ws/flink-streaming-java/target/flink-streaming-java_2.10-1.3-SNAPSHOT-tests.jar>
[INFO] 
[INFO] --- maven-shade-plugin:2.4.1:shade (shade-flink) @ flink-streaming-java_2.10 ---
[INFO] Excluding org.apache.flink:flink-core:jar:1.3-SNAPSHOT from the shaded jar.
[INFO] Excluding org.apache.flink:flink-annotations:jar:1.3-SNAPSHOT from the shaded jar.
[INFO] Excluding org.apache.flink:flink-metrics-core:jar:1.3-SNAPSHOT from the shaded jar.
[INFO] Excluding org.apache.commons:commons-lang3:jar:3.3.2 from the shaded jar.
[INFO] Excluding com.esotericsoftware.kryo:kryo:jar:2.24.0 from the shaded jar.
[INFO] Excluding com.esotericsoftware.minlog:minlog:jar:1.2 from the shaded jar.
[INFO] Excluding org.objenesis:objenesis:jar:2.1 from the shaded jar.
[INFO] Excluding commons-collections:commons-collections:jar:3.2.2 from the shaded jar.
[INFO] Excluding org.apache.commons:commons-compress:jar:1.4.1 from the shaded jar.
[INFO] Excluding org.tukaani:xz:jar:1.0 from the shaded jar.
[INFO] Excluding org.apache.avro:avro:jar:1.7.7 from the shaded jar.
[INFO] Excluding org.codehaus.jackson:jackson-core-asl:jar:1.9.13 from the shaded jar.
[INFO] Excluding org.codehaus.jackson:jackson-mapper-asl:jar:1.9.13 from the shaded jar.
[INFO] Excluding com.thoughtworks.paranamer:paranamer:jar:2.3 from the shaded jar.
[INFO] Excluding org.apache.flink:flink-runtime_2.10:jar:1.3-SNAPSHOT from the shaded jar.
[INFO] Excluding org.apache.flink:flink-java:jar:1.3-SNAPSHOT from the shaded jar.
[INFO] Excluding org.apache.flink:flink-shaded-hadoop2:jar:1.3-SNAPSHOT from the shaded jar.
[INFO] Excluding xmlenc:xmlenc:jar:0.52 from the shaded jar.
[INFO] Excluding commons-codec:commons-codec:jar:1.4 from the shaded jar.
[INFO] Excluding commons-io:commons-io:jar:2.4 from the shaded jar.
[INFO] Excluding commons-net:commons-net:jar:3.1 from the shaded jar.
[INFO] Excluding javax.servlet:servlet-api:jar:2.5 from the shaded jar.
[INFO] Excluding org.mortbay.jetty:jetty-util:jar:6.1.26 from the shaded jar.
[INFO] Excluding com.sun.jersey:jersey-core:jar:1.9 from the shaded jar.
[INFO] Excluding commons-el:commons-el:jar:1.0 from the shaded jar.
[INFO] Excluding commons-logging:commons-logging:jar:1.1.3 from the shaded jar.
[INFO] Excluding com.jamesmurty.utils:java-xmlbuilder:jar:0.4 from the shaded jar.
[INFO] Excluding commons-lang:commons-lang:jar:2.6 from the shaded jar.
[INFO] Excluding commons-configuration:commons-configuration:jar:1.7 from the shaded jar.
[INFO] Excluding commons-digester:commons-digester:jar:1.8.1 from the shaded jar.
[INFO] Excluding org.xerial.snappy:snappy-java:jar:1.0.5 from the shaded jar.
[INFO] Excluding com.jcraft:jsch:jar:0.1.42 from the shaded jar.
[INFO] Excluding commons-beanutils:commons-beanutils-bean-collections:jar:1.8.3 from the shaded
jar.
[INFO] Excluding commons-daemon:commons-daemon:jar:1.0.13 from the shaded jar.
[INFO] Excluding javax.xml.bind:jaxb-api:jar:2.2.2 from the shaded jar.
[INFO] Excluding javax.xml.stream:stax-api:jar:1.0-2 from the shaded jar.
[INFO] Excluding javax.activation:activation:jar:1.1 from the shaded jar.
[INFO] Excluding commons-cli:commons-cli:jar:1.3.1 from the shaded jar.
[INFO] Excluding io.netty:netty-all:jar:4.0.27.Final from the shaded jar.
[INFO] Excluding org.javassist:javassist:jar:3.18.2-GA from the shaded jar.
[INFO] Excluding org.scala-lang:scala-library:jar:2.10.4 from the shaded jar.
[INFO] Excluding com.data-artisans:flakka-actor_2.10:jar:2.3-custom from the shaded jar.
[INFO] Excluding com.typesafe:config:jar:1.2.1 from the shaded jar.
[INFO] Excluding com.data-artisans:flakka-remote_2.10:jar:2.3-custom from the shaded jar.
[INFO] Excluding io.netty:netty:jar:3.8.0.Final from the shaded jar.
[INFO] Excluding com.google.protobuf:protobuf-java:jar:2.5.0 from the shaded jar.
[INFO] Excluding org.uncommons.maths:uncommons-maths:jar:1.2.2a from the shaded jar.
[INFO] Excluding com.data-artisans:flakka-slf4j_2.10:jar:2.3-custom from the shaded jar.
[INFO] Excluding org.clapper:grizzled-slf4j_2.10:jar:1.0.2 from the shaded jar.
[INFO] Excluding com.github.scopt:scopt_2.10:jar:3.5.0 from the shaded jar.
[INFO] Excluding com.fasterxml.jackson.core:jackson-core:jar:2.7.4 from the shaded jar.
[INFO] Excluding com.fasterxml.jackson.core:jackson-databind:jar:2.7.4 from the shaded jar.
[INFO] Excluding com.fasterxml.jackson.core:jackson-annotations:jar:2.7.4 from the shaded
jar.
[INFO] Excluding org.apache.zookeeper:zookeeper:jar:3.4.6 from the shaded jar.
[INFO] Excluding jline:jline:jar:0.9.94 from the shaded jar.
[INFO] Excluding com.twitter:chill_2.10:jar:0.7.4 from the shaded jar.
[INFO] Excluding com.twitter:chill-java:jar:0.7.4 from the shaded jar.
[INFO] Excluding org.apache.flink:flink-clients_2.10:jar:1.3-SNAPSHOT from the shaded jar.
[INFO] Excluding org.apache.flink:flink-optimizer_2.10:jar:1.3-SNAPSHOT from the shaded jar.
[INFO] Excluding org.apache.commons:commons-math3:jar:3.5 from the shaded jar.
[INFO] Excluding org.apache.sling:org.apache.sling.commons.json:jar:2.0.6 from the shaded
jar.
[INFO] Including com.google.guava:guava:jar:18.0 in the shaded jar.
[INFO] Including org.apache.flink:force-shading:jar:1.3-SNAPSHOT in the shaded jar.
[INFO] Excluding org.slf4j:slf4j-api:jar:1.7.7 from the shaded jar.
[INFO] Excluding com.google.code.findbugs:jsr305:jar:1.3.9 from the shaded jar.
[INFO] Replacing original artifact with shaded artifact.
[INFO] Replacing <https://builds.apache.org/job/flink-snapshot-deployment/ws/flink-streaming-java/target/flink-streaming-java_2.10-1.3-SNAPSHOT.jar>
with <https://builds.apache.org/job/flink-snapshot-deployment/ws/flink-streaming-java/target/flink-streaming-java_2.10-1.3-SNAPSHOT-shaded.jar>
[INFO] Replacing original test artifact with shaded test artifact.
[INFO] Replacing <https://builds.apache.org/job/flink-snapshot-deployment/ws/flink-streaming-java/target/flink-streaming-java_2.10-1.3-SNAPSHOT-tests.jar>
with <https://builds.apache.org/job/flink-snapshot-deployment/ws/flink-streaming-java/target/flink-streaming-java_2.10-1.3-SNAPSHOT-shaded-tests.jar>
[INFO] Dependency-reduced POM written at: <https://builds.apache.org/job/flink-snapshot-deployment/ws/flink-streaming-java/target/dependency-reduced-pom.xml>
[INFO] Dependency-reduced POM written at: <https://builds.apache.org/job/flink-snapshot-deployment/ws/flink-streaming-java/target/dependency-reduced-pom.xml>
[INFO] Dependency-reduced POM written at: <https://builds.apache.org/job/flink-snapshot-deployment/ws/flink-streaming-java/target/dependency-reduced-pom.xml>
[INFO] 
[INFO] >>> maven-source-plugin:2.2.1:jar (attach-sources) > generate-sources @
flink-streaming-java_2.10 >>>
[INFO] 
[INFO] --- maven-checkstyle-plugin:2.17:check (validate) @ flink-streaming-java_2.10 ---
[INFO] ------------------------------------------------------------------------
[INFO] Reactor Summary:
[INFO] 
[INFO] force-shading ...................................... SUCCESS [  7.354 s]
[INFO] flink .............................................. SUCCESS [  7.654 s]
[INFO] flink-annotations .................................. SUCCESS [ 12.223 s]
[INFO] flink-shaded-hadoop ................................ SUCCESS [  3.971 s]
[INFO] flink-shaded-hadoop2 ............................... SUCCESS [ 21.091 s]
[INFO] flink-shaded-curator ............................... SUCCESS [  3.941 s]
[INFO] flink-shaded-curator-recipes ....................... SUCCESS [ 10.648 s]
[INFO] flink-shaded-curator-test .......................... SUCCESS [  8.390 s]
[INFO] flink-metrics ...................................... SUCCESS [  3.922 s]
[INFO] flink-metrics-core ................................. SUCCESS [ 14.174 s]
[INFO] flink-test-utils-parent ............................ SUCCESS [  3.866 s]
[INFO] flink-test-utils-junit ............................. SUCCESS [ 11.912 s]
[INFO] flink-core ......................................... SUCCESS [ 39.343 s]
[INFO] flink-java ......................................... SUCCESS [ 26.744 s]
[INFO] flink-runtime ...................................... SUCCESS [01:34 min]
[INFO] flink-optimizer .................................... SUCCESS [ 23.981 s]
[INFO] flink-clients ...................................... SUCCESS [ 14.608 s]
[INFO] flink-streaming-java ............................... FAILURE [ 26.860 s]
[INFO] flink-test-utils ................................... SKIPPED
[INFO] flink-scala ........................................ SKIPPED
[INFO] flink-runtime-web .................................. SKIPPED
[INFO] flink-examples ..................................... SKIPPED
[INFO] flink-examples-batch ............................... SKIPPED
[INFO] flink-connectors ................................... SKIPPED
[INFO] flink-hadoop-compatibility ......................... SKIPPED
[INFO] flink-contrib ...................................... SKIPPED
[INFO] flink-statebackend-rocksdb ......................... SKIPPED
[INFO] flink-tests ........................................ SKIPPED
[INFO] flink-streaming-scala .............................. SKIPPED
[INFO] flink-avro ......................................... SKIPPED
[INFO] flink-libraries .................................... SKIPPED
[INFO] flink-table ........................................ SKIPPED
[INFO] flink-jdbc ......................................... SKIPPED
[INFO] flink-hbase ........................................ SKIPPED
[INFO] flink-hcatalog ..................................... SKIPPED
[INFO] flink-metrics-jmx .................................. SKIPPED
[INFO] flink-connector-kafka-base ......................... SKIPPED
[INFO] flink-connector-kafka-0.8 .......................... SKIPPED
[INFO] flink-connector-kafka-0.9 .......................... SKIPPED
[INFO] flink-connector-kafka-0.10 ......................... SKIPPED
[INFO] flink-connector-elasticsearch-base ................. SKIPPED
[INFO] flink-connector-elasticsearch ...................... SKIPPED
[INFO] flink-connector-elasticsearch2 ..................... SKIPPED
[INFO] flink-connector-rabbitmq ........................... SKIPPED
[INFO] flink-connector-twitter ............................ SKIPPED
[INFO] flink-connector-nifi ............................... SKIPPED
[INFO] flink-connector-cassandra .......................... SKIPPED
[INFO] flink-connector-filesystem ......................... SKIPPED
[INFO] flink-connector-elasticsearch5 ..................... SKIPPED
[INFO] flink-examples-streaming ........................... SKIPPED
[INFO] flink-examples-table ............................... SKIPPED
[INFO] flink-gelly ........................................ SKIPPED
[INFO] flink-gelly-scala .................................. SKIPPED
[INFO] flink-gelly-examples ............................... SKIPPED
[INFO] flink-python ....................................... SKIPPED
[INFO] flink-ml ........................................... SKIPPED
[INFO] flink-cep .......................................... SKIPPED
[INFO] flink-cep-scala .................................... SKIPPED
[INFO] flink-scala-shell .................................. SKIPPED
[INFO] flink-quickstart ................................... SKIPPED
[INFO] flink-quickstart-java .............................. SKIPPED
[INFO] flink-quickstart-scala ............................. SKIPPED
[INFO] flink-storm ........................................ SKIPPED
[INFO] flink-storm-examples ............................... SKIPPED
[INFO] flink-streaming-contrib ............................ SKIPPED
[INFO] flink-tweet-inputformat ............................ SKIPPED
[INFO] flink-connector-wikiedits .......................... SKIPPED
[INFO] flink-mesos ........................................ SKIPPED
[INFO] flink-yarn ......................................... SKIPPED
[INFO] flink-metrics-dropwizard ........................... SKIPPED
[INFO] flink-metrics-ganglia .............................. SKIPPED
[INFO] flink-metrics-graphite ............................. SKIPPED
[INFO] flink-metrics-statsd ............................... SKIPPED
[INFO] flink-dist ......................................... SKIPPED
[INFO] flink-fs-tests ..................................... SKIPPED
[INFO] flink-java8 ........................................ SKIPPED
[INFO] ------------------------------------------------------------------------
[INFO] BUILD FAILURE
[INFO] ------------------------------------------------------------------------
[INFO] Total time: 05:36 min
[INFO] Finished at: 2017-04-27T16:20:10+00:00
[INFO] Final Memory: 188M/4455M
[INFO] ------------------------------------------------------------------------
[ERROR] Failed to execute goal org.apache.maven.plugins:maven-checkstyle-plugin:2.17:check
(validate) on project flink-streaming-java_2.10: Failed during checkstyle execution: Unable
to find suppressions file at location: ../tools/maven/suppressions.xml: Could not find resource
'../tools/maven/suppressions.xml'. -> [Help 1]
[ERROR] 
[ERROR] To see the full stack trace of the errors, re-run Maven with the -e switch.
[ERROR] Re-run Maven using the -X switch to enable full debug logging.
[ERROR] 
[ERROR] For more information about the errors and possible solutions, please read the following
articles:
[ERROR] [Help 1] http://cwiki.apache.org/confluence/display/MAVEN/MojoExecutionException
[ERROR] 
[ERROR] After correcting the problems, you can resume the build with the command
[ERROR]   mvn <goals> -rf :flink-streaming-java_2.10
Build step 'Execute shell' marked build as failure
Setting MAVEN_3_2_5_HOME=/home/jenkins/tools/maven/apache-maven-3.2.5

Mime
View raw message