flink-commits mailing list archives

Site index · List index
Message view « Date » · « Thread »
Top « Date » · « Thread »
From Apache Jenkins Server <jenk...@builds.apache.org>
Subject Build failed in Jenkins: flink-snapshot-deployment #333
Date Tue, 03 Jan 2017 04:46:16 GMT
See <https://builds.apache.org/job/flink-snapshot-deployment/333/>

------------------------------------------
[...truncated 23600 lines...]
[INFO] Including org.apache.flink:flink-runtime_2.11:jar:1.3-SNAPSHOT in the shaded jar.
[INFO] Including commons-cli:commons-cli:jar:1.3.1 in the shaded jar.
[INFO] Including io.netty:netty-all:jar:4.0.27.Final in the shaded jar.
[INFO] Including org.javassist:javassist:jar:3.18.2-GA in the shaded jar.
[INFO] Including com.data-artisans:flakka-actor_2.11:jar:2.3-custom in the shaded jar.
[INFO] Including com.data-artisans:flakka-remote_2.11:jar:2.3-custom in the shaded jar.
[INFO] Including com.google.protobuf:protobuf-java:jar:2.5.0 in the shaded jar.
[INFO] Including com.data-artisans:flakka-slf4j_2.11:jar:2.3-custom in the shaded jar.
[INFO] Including org.clapper:grizzled-slf4j_2.11:jar:1.0.2 in the shaded jar.
[INFO] Including com.github.scopt:scopt_2.11:jar:3.2.0 in the shaded jar.
[INFO] Including com.fasterxml.jackson.core:jackson-core:jar:2.7.4 in the shaded jar.
[INFO] Including com.fasterxml.jackson.core:jackson-databind:jar:2.7.4 in the shaded jar.
[INFO] Including org.apache.zookeeper:zookeeper:jar:3.4.6 in the shaded jar.
[INFO] Including com.twitter:chill_2.11:jar:0.8.1 in the shaded jar.
[INFO] Including org.apache.flink:flink-runtime-web_2.11:jar:1.3-SNAPSHOT in the shaded jar.
[INFO] Including tv.cntt:netty-router:jar:1.10 in the shaded jar.
[INFO] Including org.apache.flink:flink-optimizer_2.11:jar:1.3-SNAPSHOT in the shaded jar.
[INFO] Including org.apache.flink:flink-clients_2.11:jar:1.3-SNAPSHOT in the shaded jar.
[INFO] Including org.apache.flink:flink-avro_2.11:jar:1.3-SNAPSHOT in the shaded jar.
[INFO] Including org.apache.flink:flink-streaming-java_2.11:jar:1.3-SNAPSHOT in the shaded
jar.
[INFO] Including org.apache.sling:org.apache.sling.commons.json:jar:2.0.6 in the shaded jar.
[INFO] Including org.apache.flink:flink-streaming-scala_2.11:jar:1.3-SNAPSHOT in the shaded
jar.
[INFO] Including org.apache.flink:flink-python_2.11:jar:1.3-SNAPSHOT in the shaded jar.
[INFO] Including org.apache.flink:flink-scala-shell_2.11:jar:1.3-SNAPSHOT in the shaded jar.
[INFO] Including org.apache.flink:flink-metrics-core:jar:1.3-SNAPSHOT in the shaded jar.
[INFO] Including org.apache.flink:flink-metrics-jmx:jar:1.3-SNAPSHOT in the shaded jar.
[INFO] Including org.apache.flink:flink-mesos_2.11:jar:1.3-SNAPSHOT in the shaded jar.
[INFO] Including com.fasterxml.jackson.core:jackson-annotations:jar:2.7.4 in the shaded jar.
[INFO] Including jline:jline:jar:0.9.94 in the shaded jar.
[INFO] Including com.twitter:chill-java:jar:0.8.1 in the shaded jar.
[INFO] Including com.esotericsoftware.minlog:minlog:jar:1.2 in the shaded jar.
[INFO] Including org.objenesis:objenesis:jar:2.1 in the shaded jar.
[INFO] Including org.tukaani:xz:jar:1.0 in the shaded jar.
[INFO] Including xmlenc:xmlenc:jar:0.52 in the shaded jar.
[INFO] Including commons-codec:commons-codec:jar:1.4 in the shaded jar.
[INFO] Including commons-io:commons-io:jar:2.4 in the shaded jar.
[INFO] Including commons-net:commons-net:jar:3.1 in the shaded jar.
[INFO] Including javax.servlet:servlet-api:jar:2.5 in the shaded jar.
[INFO] Including org.mortbay.jetty:jetty-util:jar:6.1.26 in the shaded jar.
[INFO] Including com.sun.jersey:jersey-core:jar:1.9 in the shaded jar.
[INFO] Including commons-el:commons-el:jar:1.0 in the shaded jar.
[INFO] Including commons-logging:commons-logging:jar:1.1.3 in the shaded jar.
[INFO] Including com.jamesmurty.utils:java-xmlbuilder:jar:0.4 in the shaded jar.
[INFO] Including commons-lang:commons-lang:jar:2.6 in the shaded jar.
[INFO] Including commons-configuration:commons-configuration:jar:1.7 in the shaded jar.
[INFO] Including commons-digester:commons-digester:jar:1.8.1 in the shaded jar.
[INFO] Including org.codehaus.jackson:jackson-core-asl:jar:1.8.8 in the shaded jar.
[INFO] Including org.codehaus.jackson:jackson-mapper-asl:jar:1.8.8 in the shaded jar.
[INFO] Including com.thoughtworks.paranamer:paranamer:jar:2.3 in the shaded jar.
[INFO] Including org.xerial.snappy:snappy-java:jar:1.0.5 in the shaded jar.
[INFO] Including com.jcraft:jsch:jar:0.1.42 in the shaded jar.
[INFO] Including commons-beanutils:commons-beanutils-bean-collections:jar:1.8.3 in the shaded
jar.
[INFO] Including commons-daemon:commons-daemon:jar:1.0.13 in the shaded jar.
[INFO] Including javax.xml.bind:jaxb-api:jar:2.2.2 in the shaded jar.
[INFO] Including javax.xml.stream:stax-api:jar:1.0-2 in the shaded jar.
[INFO] Including javax.activation:activation:jar:1.1 in the shaded jar.
[INFO] Including com.typesafe:config:jar:1.2.1 in the shaded jar.
[INFO] Including io.netty:netty:jar:3.8.0.Final in the shaded jar.
[INFO] Including org.uncommons.maths:uncommons-maths:jar:1.2.2a in the shaded jar.
[INFO] Including tv.cntt:jauter:jar:1.7 in the shaded jar.
[INFO] Including org.apache.flink:flink-statebackend-rocksdb_2.11:jar:1.3-SNAPSHOT in the
shaded jar.
[INFO] Including org.rocksdb:rocksdbjni:jar:4.11.2 in the shaded jar.
[INFO] Including org.apache.flink:flink-yarn_2.11:jar:1.3-SNAPSHOT in the shaded jar.
[INFO] Including com.data-artisans:flakka-camel_2.11:jar:2.3-custom in the shaded jar.
[INFO] Including org.apache.camel:camel-core:jar:2.10.3 in the shaded jar.
[INFO] Excluding org.slf4j:slf4j-log4j12:jar:1.7.7 from the shaded jar.
[INFO] Excluding log4j:log4j:jar:1.2.17 from the shaded jar.
[INFO] Including org.apache.flink:force-shading:jar:1.3-SNAPSHOT in the shaded jar.
[INFO] Including org.slf4j:slf4j-api:jar:1.7.7 in the shaded jar.
[INFO] Including com.google.code.findbugs:jsr305:jar:1.3.9 in the shaded jar.
[WARNING] flink-scala_2.11-1.3-SNAPSHOT.jar, flink-core-1.3-SNAPSHOT.jar, flink-java-1.3-SNAPSHOT.jar,
flink-runtime_2.11-1.3-SNAPSHOT.jar, flink-streaming-scala_2.11-1.3-SNAPSHOT.jar define 25
overlapping classes: 
[WARNING]   - org.apache.flink.shaded.org.objectweb.asm.Edge
[WARNING]   - org.apache.flink.shaded.org.objectweb.asm.Context
[WARNING]   - org.apache.flink.shaded.org.objectweb.asm.Attribute
[WARNING]   - org.apache.flink.shaded.org.objectweb.asm.signature.SignatureVisitor
[WARNING]   - org.apache.flink.shaded.org.objectweb.asm.TypeReference
[WARNING]   - org.apache.flink.shaded.org.objectweb.asm.MethodWriter
[WARNING]   - org.apache.flink.shaded.org.objectweb.asm.ClassReader
[WARNING]   - org.apache.flink.shaded.org.objectweb.asm.Handler
[WARNING]   - org.apache.flink.shaded.org.objectweb.asm.Label
[WARNING]   - org.apache.flink.shaded.org.objectweb.asm.Frame
[WARNING]   - 15 more...
[WARNING] flink-java-1.3-SNAPSHOT.jar, flink-runtime_2.11-1.3-SNAPSHOT.jar, flink-core-1.3-SNAPSHOT.jar
define 141 overlapping classes: 
[WARNING]   - org.apache.flink.shaded.org.objectweb.asm.xml.ASMContentHandler$LocalVarRule
[WARNING]   - org.apache.flink.shaded.org.objectweb.asm.tree.InvokeDynamicInsnNode
[WARNING]   - org.apache.flink.shaded.org.objectweb.asm.xml.ASMContentHandler$ExceptionRule
[WARNING]   - org.apache.flink.shaded.org.objectweb.asm.xml.ASMContentHandler$LookupSwitchLabelRule
[WARNING]   - org.apache.flink.shaded.org.objectweb.asm.tree.LdcInsnNode
[WARNING]   - org.apache.flink.shaded.org.objectweb.asm.commons.JSRInlinerAdapter$Instantiation
[WARNING]   - org.apache.flink.shaded.org.objectweb.asm.xml.Processor$OutputSlicingHandler
[WARNING]   - org.apache.flink.shaded.org.objectweb.asm.tree.LocalVariableAnnotationNode
[WARNING]   - org.apache.flink.shaded.org.objectweb.asm.commons.StaticInitMerger
[WARNING]   - org.apache.flink.shaded.org.objectweb.asm.util.TraceClassVisitor
[WARNING]   - 131 more...
[WARNING] flink-optimizer_2.11-1.3-SNAPSHOT.jar, flink-runtime_2.11-1.3-SNAPSHOT.jar, flink-streaming-scala_2.11-1.3-SNAPSHOT.jar,
flink-scala_2.11-1.3-SNAPSHOT.jar, flink-runtime-web_2.11-1.3-SNAPSHOT.jar, flink-streaming-java_2.11-1.3-SNAPSHOT.jar,
flink-mesos_2.11-1.3-SNAPSHOT.jar, flink-yarn_2.11-1.3-SNAPSHOT.jar define 1690 overlapping
classes: 
[WARNING]   - org.apache.flink.shaded.com.google.common.collect.Synchronized$SynchronizedSortedSetMultimap
[WARNING]   - org.apache.flink.shaded.com.google.common.util.concurrent.FutureCallback
[WARNING]   - org.apache.flink.shaded.com.google.common.util.concurrent.Monitor$Guard
[WARNING]   - org.apache.flink.shaded.com.google.common.util.concurrent.Striped$2
[WARNING]   - org.apache.flink.shaded.com.google.common.collect.ImmutableEnumSet$1
[WARNING]   - org.apache.flink.shaded.com.google.common.primitives.Bytes$ByteArrayAsList
[WARNING]   - org.apache.flink.shaded.com.google.common.math.IntMath$1
[WARNING]   - org.apache.flink.shaded.com.google.common.hash.Hashing$ConcatenatedHashFunction
[WARNING]   - org.apache.flink.shaded.com.google.common.hash.Funnels$UnencodedCharsFunnel
[WARNING]   - org.apache.flink.shaded.com.google.common.collect.DenseImmutableTable$ImmutableArrayMap$1$1
[WARNING]   - 1680 more...
[WARNING] maven-shade-plugin has detected that some class files are
[WARNING] present in two or more JARs. When this happens, only one
[WARNING] single version of the class is copied to the uber jar.
[WARNING] Usually this is not harmful and you can skip these warnings,
[WARNING] otherwise try to manually exclude artifacts based on
[WARNING] mvn dependency:tree -Ddetail=true and the above output.
[WARNING] See http://docs.codehaus.org/display/MAVENUSER/Shade+Plugin
[INFO] Replacing original artifact with shaded artifact.
[INFO] Replacing <https://builds.apache.org/job/flink-snapshot-deployment/ws/flink-dist/target/flink-dist_2.11-1.3-SNAPSHOT.jar>
with <https://builds.apache.org/job/flink-snapshot-deployment/ws/flink-dist/target/flink-dist_2.11-1.3-SNAPSHOT-shaded.jar>
[INFO] 
[INFO] >>> maven-source-plugin:2.2.1:jar (attach-sources) > generate-sources @
flink-dist_2.11 >>>
[INFO] 
[INFO] --- maven-checkstyle-plugin:2.17:check (validate) @ flink-dist_2.11 ---
[INFO] 
[INFO] --- maven-enforcer-plugin:1.4.1:enforce (enforce-maven) @ flink-dist_2.11 ---
[INFO] 
[INFO] --- git-commit-id-plugin:2.1.5:revision (default) @ flink-dist_2.11 ---
[info] 
[info] <https://builds.apache.org/job/flink-snapshot-deployment/ws/flink-dist/../.git>
[info] 
[info] 
[info] 
[info] 
[info] 
[info] 
[info] 
[info] 
[info] 
[info] 
[info] 
[info] 
[info] 
[info] 
[INFO] 
[INFO] <<< maven-source-plugin:2.2.1:jar (attach-sources) < generate-sources @
flink-dist_2.11 <<<
[INFO] 
[INFO] --- maven-source-plugin:2.2.1:jar (attach-sources) @ flink-dist_2.11 ---
[INFO] Building jar: <https://builds.apache.org/job/flink-snapshot-deployment/ws/flink-dist/target/flink-dist_2.11-1.3-SNAPSHOT-sources.jar>
[INFO] 
[INFO] --- maven-javadoc-plugin:2.9.1:jar (attach-javadocs) @ flink-dist_2.11 ---
[INFO] 
[INFO] --- maven-assembly-plugin:2.4:single (bin) @ flink-dist_2.11 ---
[INFO] Reading assembly descriptor: src/main/assemblies/bin.xml
[INFO] Copying files to <https://builds.apache.org/job/flink-snapshot-deployment/ws/flink-dist/target/flink-1.3-SNAPSHOT-bin>
[WARNING] Assembly file: <https://builds.apache.org/job/flink-snapshot-deployment/ws/flink-dist/target/flink-1.3-SNAPSHOT-bin>
is not a regular file (it may be a directory). It cannot be attached to the project build
for installation or deployment.
[INFO] 
[INFO] --- maven-assembly-plugin:2.4:single (opt) @ flink-dist_2.11 ---
[INFO] Reading assembly descriptor: src/main/assemblies/opt.xml
[INFO] ------------------------------------------------------------------------
[INFO] Reactor Summary:
[INFO] 
[INFO] force-shading ...................................... SUCCESS [ 10.865 s]
[INFO] flink .............................................. SUCCESS [  8.995 s]
[INFO] flink-annotations .................................. SUCCESS [ 15.990 s]
[INFO] flink-shaded-hadoop ................................ SUCCESS [  4.756 s]
[INFO] flink-shaded-hadoop2 ............................... SUCCESS [ 39.686 s]
[INFO] flink-shaded-curator ............................... SUCCESS [  4.938 s]
[INFO] flink-shaded-curator-recipes ....................... SUCCESS [ 15.106 s]
[INFO] flink-shaded-curator-test .......................... SUCCESS [ 11.529 s]
[INFO] flink-metrics ...................................... SUCCESS [  6.153 s]
[INFO] flink-metrics-core ................................. SUCCESS [ 17.115 s]
[INFO] flink-test-utils-parent ............................ SUCCESS [  4.588 s]
[INFO] flink-test-utils-junit ............................. SUCCESS [ 13.994 s]
[INFO] flink-core ......................................... SUCCESS [ 59.519 s]
[INFO] flink-java ......................................... SUCCESS [ 39.937 s]
[INFO] flink-runtime ...................................... SUCCESS [02:20 min]
[INFO] flink-optimizer .................................... SUCCESS [ 32.414 s]
[INFO] flink-clients ...................................... SUCCESS [ 17.922 s]
[INFO] flink-streaming-java ............................... SUCCESS [ 48.912 s]
[INFO] flink-test-utils ................................... SUCCESS [ 22.842 s]
[INFO] flink-scala ........................................ SUCCESS [01:17 min]
[INFO] flink-runtime-web .................................. SUCCESS [ 32.657 s]
[INFO] flink-examples ..................................... SUCCESS [  4.745 s]
[INFO] flink-examples-batch ............................... SUCCESS [ 57.847 s]
[INFO] flink-connectors ................................... SUCCESS [  4.700 s]
[INFO] flink-hadoop-compatibility ......................... SUCCESS [ 21.418 s]
[INFO] flink-contrib ...................................... SUCCESS [  4.942 s]
[INFO] flink-statebackend-rocksdb ......................... SUCCESS [ 16.067 s]
[INFO] flink-tests ........................................ SUCCESS [01:41 min]
[INFO] flink-streaming-scala .............................. SUCCESS [01:05 min]
[INFO] flink-avro ......................................... SUCCESS [ 16.910 s]
[INFO] flink-libraries .................................... SUCCESS [  4.815 s]
[INFO] flink-table ........................................ SUCCESS [02:20 min]
[INFO] flink-jdbc ......................................... SUCCESS [ 15.526 s]
[INFO] flink-hbase ........................................ SUCCESS [ 17.584 s]
[INFO] flink-hcatalog ..................................... SUCCESS [ 24.476 s]
[INFO] flink-metrics-jmx .................................. SUCCESS [ 14.521 s]
[INFO] flink-connector-kafka-base ......................... SUCCESS [ 22.413 s]
[INFO] flink-connector-kafka-0.8 .......................... SUCCESS [ 19.124 s]
[INFO] flink-connector-kafka-0.9 .......................... SUCCESS [ 23.241 s]
[INFO] flink-connector-kafka-0.10 ......................... SUCCESS [ 20.835 s]
[INFO] flink-connector-elasticsearch ...................... SUCCESS [ 17.060 s]
[INFO] flink-connector-elasticsearch2 ..................... SUCCESS [ 22.301 s]
[INFO] flink-connector-rabbitmq ........................... SUCCESS [ 14.300 s]
[INFO] flink-connector-twitter ............................ SUCCESS [ 21.121 s]
[INFO] flink-connector-nifi ............................... SUCCESS [ 13.677 s]
[INFO] flink-connector-cassandra .......................... SUCCESS [ 20.327 s]
[INFO] flink-connector-filesystem ......................... SUCCESS [ 15.476 s]
[INFO] flink-examples-streaming ........................... SUCCESS [01:01 min]
[INFO] flink-gelly ........................................ SUCCESS [ 26.640 s]
[INFO] flink-gelly-scala .................................. SUCCESS [ 48.017 s]
[INFO] flink-gelly-examples ............................... SUCCESS [ 31.629 s]
[INFO] flink-python ....................................... SUCCESS [ 17.431 s]
[INFO] flink-ml ........................................... SUCCESS [01:50 min]
[INFO] flink-cep .......................................... SUCCESS [ 26.156 s]
[INFO] flink-cep-scala .................................... SUCCESS [ 26.413 s]
[INFO] flink-scala-shell .................................. SUCCESS [ 32.418 s]
[INFO] flink-quickstart ................................... SUCCESS [  6.663 s]
[INFO] flink-quickstart-java .............................. SUCCESS [ 10.542 s]
[INFO] flink-quickstart-scala ............................. SUCCESS [  9.638 s]
[INFO] flink-storm ........................................ SUCCESS [ 18.339 s]
[INFO] flink-storm-examples ............................... SUCCESS [01:27 min]
[INFO] flink-streaming-contrib ............................ SUCCESS [ 21.306 s]
[INFO] flink-tweet-inputformat ............................ SUCCESS [ 16.179 s]
[INFO] flink-connector-wikiedits .......................... SUCCESS [ 14.912 s]
[INFO] flink-mesos ........................................ SUCCESS [01:11 min]
[INFO] flink-yarn ......................................... SUCCESS [ 36.815 s]
[INFO] flink-metrics-dropwizard ........................... SUCCESS [ 17.373 s]
[INFO] flink-metrics-ganglia .............................. SUCCESS [ 18.465 s]
[INFO] flink-metrics-graphite ............................. SUCCESS [ 16.955 s]
[INFO] flink-metrics-statsd ............................... SUCCESS [ 14.377 s]
[INFO] flink-dist ......................................... FAILURE [ 43.451 s]
[INFO] flink-fs-tests ..................................... SKIPPED
[INFO] flink-java8 ........................................ SKIPPED
[INFO] ------------------------------------------------------------------------
[INFO] BUILD FAILURE
[INFO] ------------------------------------------------------------------------
[INFO] Total time: 35:33 min
[INFO] Finished at: 2017-01-03T04:43:12+00:00
[INFO] Final Memory: 429M/4779M
[INFO] ------------------------------------------------------------------------
[ERROR] Failed to execute goal org.apache.maven.plugins:maven-assembly-plugin:2.4:single (opt)
on project flink-dist_2.11: Failed to create assembly: Error adding file to archive: <https://builds.apache.org/job/flink-snapshot-deployment/ws/flink-dist/../flink-libraries/flink-cep/target/flink-cep_2.10-1.3-SNAPSHOT.jar>
isn't a file. -> [Help 1]
[ERROR] 
[ERROR] To see the full stack trace of the errors, re-run Maven with the -e switch.
[ERROR] Re-run Maven using the -X switch to enable full debug logging.
[ERROR] 
[ERROR] For more information about the errors and possible solutions, please read the following
articles:
[ERROR] [Help 1] http://cwiki.apache.org/confluence/display/MAVEN/MojoExecutionException
[ERROR] 
[ERROR] After correcting the problems, you can resume the build with the command
[ERROR]   mvn <goals> -rf :flink-dist_2.11
Build step 'Execute shell' marked build as failure
Setting MAVEN_3_2_5_HOME=/home/jenkins/tools/maven/apache-maven-3.2.5

Mime
View raw message