flink-commits mailing list archives

Site index · List index
Message view « Date » · « Thread »
Top « Date » · « Thread »
From Apache Jenkins Server <jenk...@builds.apache.org>
Subject Build failed in Jenkins: flink-snapshot-deployment #208
Date Fri, 02 Sep 2016 13:41:36 GMT
See <https://builds.apache.org/job/flink-snapshot-deployment/208/>

------------------------------------------
[...truncated 10546 lines...]
[INFO] --- maven-remote-resources-plugin:1.5:process (default) @ flink-mesos_2.10 ---
[INFO] 
[INFO] --- maven-resources-plugin:2.6:resources (default-resources) @ flink-mesos_2.10 ---
[INFO] Using 'UTF-8' encoding to copy filtered resources.
[INFO] Copying 1 resource
[INFO] Copying 3 resources
[INFO] 
[INFO] --- scala-maven-plugin:3.1.4:compile (scala-compile-first) @ flink-mesos_2.10 ---
[INFO] <https://builds.apache.org/job/flink-snapshot-deployment/ws/flink-mesos/src/main/java>:-1:
info: compiling
[INFO] <https://builds.apache.org/job/flink-snapshot-deployment/ws/flink-mesos/src/main/scala>:-1:
info: compiling
[INFO] Compiling 37 source files to <https://builds.apache.org/job/flink-snapshot-deployment/ws/flink-mesos/target/classes>
at 1472823684452
[WARNING] warning: there were 8 feature warning(s); re-run with -feature for details
[WARNING] one warning found
[INFO] prepare-compile in 0 s
[INFO] compile in 12 s
[INFO] 
[INFO] --- maven-compiler-plugin:3.1:compile (default-compile) @ flink-mesos_2.10 ---
[INFO] Changes detected - recompiling the module!
[INFO] Compiling 29 source files to <https://builds.apache.org/job/flink-snapshot-deployment/ws/flink-mesos/target/classes>
[INFO] 
[INFO] --- build-helper-maven-plugin:1.7:add-test-source (add-test-source) @ flink-mesos_2.10
---
[INFO] Test Source directory: <https://builds.apache.org/job/flink-snapshot-deployment/ws/flink-mesos/src/test/scala>
added.
[INFO] 
[INFO] --- maven-resources-plugin:2.6:testResources (default-testResources) @ flink-mesos_2.10
---
[INFO] Using 'UTF-8' encoding to copy filtered resources.
[INFO] Copying 2 resources
[INFO] Copying 3 resources
[INFO] 
[INFO] --- scala-maven-plugin:3.1.4:testCompile (scala-test-compile) @ flink-mesos_2.10 ---
[INFO] <https://builds.apache.org/job/flink-snapshot-deployment/ws/flink-mesos/src/test/java>:-1:
info: compiling
[INFO] <https://builds.apache.org/job/flink-snapshot-deployment/ws/flink-mesos/src/test/scala>:-1:
info: compiling
[INFO] Compiling 7 source files to <https://builds.apache.org/job/flink-snapshot-deployment/ws/flink-mesos/target/test-classes>
at 1472823696816
[WARNING] warning: there were 1 feature warning(s); re-run with -feature for details
[WARNING] one warning found
[INFO] prepare-compile in 0 s
[INFO] compile in 14 s
[INFO] 
[INFO] --- maven-compiler-plugin:3.1:testCompile (default-testCompile) @ flink-mesos_2.10
---
[INFO] Changes detected - recompiling the module!
[INFO] Compiling 1 source file to <https://builds.apache.org/job/flink-snapshot-deployment/ws/flink-mesos/target/test-classes>
[INFO] 
[INFO] --- maven-surefire-plugin:2.18.1:test (default-test) @ flink-mesos_2.10 ---
[INFO] Tests are skipped.
[INFO] 
[INFO] --- maven-jar-plugin:2.4:jar (default-jar) @ flink-mesos_2.10 ---
[INFO] Building jar: <https://builds.apache.org/job/flink-snapshot-deployment/ws/flink-mesos/target/flink-mesos_2.10-1.2-hadoop1-SNAPSHOT.jar>
[INFO] 
[INFO] --- maven-site-plugin:3.3:attach-descriptor (attach-descriptor) @ flink-mesos_2.10
---
[INFO] 
[INFO] --- maven-shade-plugin:2.4.1:shade (shade-flink) @ flink-mesos_2.10 ---
[INFO] Excluding org.apache.flink:flink-runtime_2.10:jar:1.2-hadoop1-SNAPSHOT from the shaded
jar.
[INFO] Excluding org.apache.flink:flink-core:jar:1.2-hadoop1-SNAPSHOT from the shaded jar.
[INFO] Excluding org.apache.flink:flink-annotations:jar:1.2-hadoop1-SNAPSHOT from the shaded
jar.
[INFO] Excluding org.apache.flink:flink-metrics-core:jar:1.2-hadoop1-SNAPSHOT from the shaded
jar.
[INFO] Excluding com.esotericsoftware.kryo:kryo:jar:2.24.0 from the shaded jar.
[INFO] Excluding com.esotericsoftware.minlog:minlog:jar:1.2 from the shaded jar.
[INFO] Excluding org.objenesis:objenesis:jar:2.1 from the shaded jar.
[INFO] Excluding org.apache.avro:avro:jar:1.7.6 from the shaded jar.
[INFO] Excluding com.thoughtworks.paranamer:paranamer:jar:2.3 from the shaded jar.
[INFO] Excluding org.apache.flink:flink-java:jar:1.2-hadoop1-SNAPSHOT from the shaded jar.
[INFO] Excluding org.apache.commons:commons-math3:jar:3.5 from the shaded jar.
[INFO] Excluding commons-cli:commons-cli:jar:1.3.1 from the shaded jar.
[INFO] Excluding io.netty:netty-all:jar:4.0.27.Final from the shaded jar.
[INFO] Excluding org.javassist:javassist:jar:3.18.2-GA from the shaded jar.
[INFO] Excluding org.scala-lang:scala-library:jar:2.10.4 from the shaded jar.
[INFO] Excluding org.clapper:grizzled-slf4j_2.10:jar:1.0.2 from the shaded jar.
[INFO] Excluding com.github.scopt:scopt_2.10:jar:3.2.0 from the shaded jar.
[INFO] Excluding io.dropwizard.metrics:metrics-core:jar:3.1.0 from the shaded jar.
[INFO] Excluding io.dropwizard.metrics:metrics-jvm:jar:3.1.0 from the shaded jar.
[INFO] Excluding io.dropwizard.metrics:metrics-json:jar:3.1.0 from the shaded jar.
[INFO] Excluding org.apache.zookeeper:zookeeper:jar:3.4.6 from the shaded jar.
[INFO] Excluding jline:jline:jar:0.9.94 from the shaded jar.
[INFO] Excluding com.twitter:chill_2.10:jar:0.7.4 from the shaded jar.
[INFO] Excluding com.twitter:chill-java:jar:0.7.4 from the shaded jar.
[INFO] Excluding org.apache.flink:flink-clients_2.10:jar:1.2-hadoop1-SNAPSHOT from the shaded
jar.
[INFO] Excluding org.apache.flink:flink-optimizer_2.10:jar:1.2-hadoop1-SNAPSHOT from the shaded
jar.
[INFO] Excluding org.apache.flink:flink-shaded-hadoop1:jar:1.2-hadoop1-SNAPSHOT from the shaded
jar.
[INFO] Excluding xmlenc:xmlenc:jar:0.52 from the shaded jar.
[INFO] Excluding commons-io:commons-io:jar:2.4 from the shaded jar.
[INFO] Excluding commons-logging:commons-logging:jar:1.0.3 from the shaded jar.
[INFO] Excluding commons-codec:commons-codec:jar:1.4 from the shaded jar.
[INFO] Excluding org.apache.commons:commons-math:jar:2.1 from the shaded jar.
[INFO] Excluding commons-configuration:commons-configuration:jar:1.7 from the shaded jar.
[INFO] Excluding commons-collections:commons-collections:jar:3.2.2 from the shaded jar.
[INFO] Excluding commons-lang:commons-lang:jar:2.6 from the shaded jar.
[INFO] Excluding commons-digester:commons-digester:jar:1.8.1 from the shaded jar.
[INFO] Excluding commons-beanutils:commons-beanutils:jar:1.8.3 from the shaded jar.
[INFO] Excluding commons-net:commons-net:jar:1.4.1 from the shaded jar.
[INFO] Excluding org.mortbay.jetty:jetty-util:jar:6.1.26 from the shaded jar.
[INFO] Excluding commons-el:commons-el:jar:1.0 from the shaded jar.
[INFO] Excluding hsqldb:hsqldb:jar:1.8.0.10 from the shaded jar.
[INFO] Excluding oro:oro:jar:2.0.8 from the shaded jar.
[INFO] Excluding org.codehaus.jackson:jackson-mapper-asl:jar:1.8.8 from the shaded jar.
[INFO] Excluding org.codehaus.jackson:jackson-core-asl:jar:1.8.8 from the shaded jar.
[INFO] Including org.apache.flink:flink-shaded-curator-recipes:jar:1.2-hadoop1-SNAPSHOT in
the shaded jar.
[INFO] Excluding com.typesafe.akka:akka-actor_2.10:jar:2.3.7 from the shaded jar.
[INFO] Excluding com.typesafe:config:jar:1.2.1 from the shaded jar.
[INFO] Excluding com.typesafe.akka:akka-remote_2.10:jar:2.3.7 from the shaded jar.
[INFO] Excluding io.netty:netty:jar:3.8.0.Final from the shaded jar.
[INFO] Excluding com.google.protobuf:protobuf-java:jar:2.5.0 from the shaded jar.
[INFO] Excluding org.uncommons.maths:uncommons-maths:jar:1.2.2a from the shaded jar.
[INFO] Excluding com.typesafe.akka:akka-slf4j_2.10:jar:2.3.7 from the shaded jar.
[INFO] Excluding org.apache.mesos:mesos:jar:0.27.1 from the shaded jar.
[INFO] Excluding com.netflix.fenzo:fenzo-core:jar:0.9.3 from the shaded jar.
[INFO] Excluding com.fasterxml.jackson.core:jackson-databind:jar:2.7.4 from the shaded jar.
[INFO] Excluding com.fasterxml.jackson.core:jackson-annotations:jar:2.7.4 from the shaded
jar.
[INFO] Excluding com.fasterxml.jackson.core:jackson-core:jar:2.7.4 from the shaded jar.
[INFO] Excluding tv.cntt:netty-router:jar:1.10 from the shaded jar.
[INFO] Excluding tv.cntt:jauter:jar:1.7 from the shaded jar.
[INFO] Including org.apache.flink:force-shading:jar:1.2-hadoop1-SNAPSHOT in the shaded jar.
[INFO] Excluding com.google.code.findbugs:jsr305:jar:1.3.9 from the shaded jar.
[INFO] Excluding org.apache.commons:commons-lang3:jar:3.3.2 from the shaded jar.
[INFO] Excluding org.slf4j:slf4j-api:jar:1.7.7 from the shaded jar.
[INFO] Excluding org.slf4j:slf4j-log4j12:jar:1.7.7 from the shaded jar.
[INFO] Excluding log4j:log4j:jar:1.2.17 from the shaded jar.
[INFO] Replacing original artifact with shaded artifact.
[INFO] Replacing <https://builds.apache.org/job/flink-snapshot-deployment/ws/flink-mesos/target/flink-mesos_2.10-1.2-hadoop1-SNAPSHOT.jar>
with <https://builds.apache.org/job/flink-snapshot-deployment/ws/flink-mesos/target/flink-mesos_2.10-1.2-hadoop1-SNAPSHOT-shaded.jar>
[INFO] Replacing original test artifact with shaded test artifact.
[INFO] Replacing <https://builds.apache.org/job/flink-snapshot-deployment/ws/flink-mesos/target/flink-mesos_2.10-1.2-hadoop1-SNAPSHOT-tests.jar>
with <https://builds.apache.org/job/flink-snapshot-deployment/ws/flink-mesos/target/flink-mesos_2.10-1.2-hadoop1-SNAPSHOT-shaded-tests.jar>
[INFO] Dependency-reduced POM written at: <https://builds.apache.org/job/flink-snapshot-deployment/ws/flink-mesos/target/dependency-reduced-pom.xml>
[INFO] Dependency-reduced POM written at: <https://builds.apache.org/job/flink-snapshot-deployment/ws/flink-mesos/target/dependency-reduced-pom.xml>
[INFO] 
[INFO] >>> maven-source-plugin:2.2.1:jar (attach-sources) > generate-sources @
flink-mesos_2.10 >>>
[INFO] 
[INFO] --- maven-checkstyle-plugin:2.17:check (validate) @ flink-mesos_2.10 ---
[INFO] 
[INFO] --- maven-enforcer-plugin:1.3.1:enforce (enforce-maven) @ flink-mesos_2.10 ---
[INFO] 
[INFO] --- build-helper-maven-plugin:1.7:add-source (add-source) @ flink-mesos_2.10 ---
[INFO] Source directory: <https://builds.apache.org/job/flink-snapshot-deployment/ws/flink-mesos/target/src/main/scala>
added.
[INFO] 
[INFO] <<< maven-source-plugin:2.2.1:jar (attach-sources) < generate-sources @
flink-mesos_2.10 <<<
[INFO] 
[INFO] --- maven-source-plugin:2.2.1:jar (attach-sources) @ flink-mesos_2.10 ---
[INFO] Building jar: <https://builds.apache.org/job/flink-snapshot-deployment/ws/flink-mesos/target/flink-mesos_2.10-1.2-hadoop1-SNAPSHOT-sources.jar>
[INFO] 
[INFO] --- maven-javadoc-plugin:2.9.1:jar (attach-javadocs) @ flink-mesos_2.10 ---
[INFO] 
1 warning
[WARNING] Javadoc Warnings
[WARNING] <https://builds.apache.org/job/flink-snapshot-deployment/ws/flink-mesos/src/main/java/org/apache/flink/mesos/scheduler/TaskSchedulerBuilder.java>:30:
warning - Tag @link: reference not found: TaskScheduler.Builder
[INFO] Building jar: <https://builds.apache.org/job/flink-snapshot-deployment/ws/flink-mesos/target/flink-mesos_2.10-1.2-hadoop1-SNAPSHOT-javadoc.jar>
[INFO] 
[INFO] --- maven-surefire-plugin:2.18.1:test (integration-tests) @ flink-mesos_2.10 ---
[INFO] Tests are skipped.
[INFO] 
[INFO] --- scalastyle-maven-plugin:0.5.0:check (default) @ flink-mesos_2.10 ---
error file=<https://builds.apache.org/job/flink-snapshot-deployment/ws/flink-mesos/src/test/scala/org/apache/flink/mesos/Utils.scala>
message=Expected identifier, but got Token(COMMA,,,1674,,)
Saving to outputFile=<https://builds.apache.org/job/flink-snapshot-deployment/ws/flink-mesos/target/scalastyle-output.xml>
Processed 13 file(s)
Found 1 errors
Found 0 warnings
Found 0 infos
Finished in 166 ms
[INFO] ------------------------------------------------------------------------
[INFO] Reactor Summary:
[INFO] 
[INFO] force-shading ...................................... SUCCESS [  8.630 s]
[INFO] flink .............................................. SUCCESS [  8.058 s]
[INFO] flink-annotations .................................. SUCCESS [ 11.885 s]
[INFO] flink-shaded-hadoop ................................ SUCCESS [  3.482 s]
[INFO] flink-shaded-hadoop1 ............................... SUCCESS [ 10.667 s]
[INFO] flink-shaded-curator ............................... SUCCESS [  4.039 s]
[INFO] flink-shaded-curator-recipes ....................... SUCCESS [ 10.111 s]
[INFO] flink-shaded-curator-test .......................... SUCCESS [  7.174 s]
[INFO] flink-metrics ...................................... SUCCESS [  3.460 s]
[INFO] flink-metrics-core ................................. SUCCESS [ 12.465 s]
[INFO] flink-test-utils-parent ............................ SUCCESS [  3.463 s]
[INFO] flink-test-utils-junit ............................. SUCCESS [ 10.560 s]
[INFO] flink-core ......................................... SUCCESS [ 42.990 s]
[INFO] flink-java ......................................... SUCCESS [ 25.180 s]
[INFO] flink-runtime ...................................... SUCCESS [01:41 min]
[INFO] flink-optimizer .................................... SUCCESS [ 24.173 s]
[INFO] flink-clients ...................................... SUCCESS [ 13.534 s]
[INFO] flink-streaming-java ............................... SUCCESS [ 30.428 s]
[INFO] flink-test-utils ................................... SUCCESS [ 20.243 s]
[INFO] flink-scala ........................................ SUCCESS [01:01 min]
[INFO] flink-runtime-web .................................. SUCCESS [ 22.465 s]
[INFO] flink-examples ..................................... SUCCESS [  3.635 s]
[INFO] flink-examples-batch ............................... SUCCESS [ 41.741 s]
[INFO] flink-batch-connectors ............................. SUCCESS [  3.596 s]
[INFO] flink-hadoop-compatibility ......................... SUCCESS [ 11.819 s]
[INFO] flink-contrib ...................................... SUCCESS [  3.557 s]
[INFO] flink-statebackend-rocksdb ......................... SUCCESS [ 12.212 s]
[INFO] flink-tests ........................................ SUCCESS [01:14 min]
[INFO] flink-streaming-scala .............................. SUCCESS [ 46.828 s]
[INFO] flink-streaming-connectors ......................... SUCCESS [  3.415 s]
[INFO] flink-connector-flume .............................. SUCCESS [ 14.537 s]
[INFO] flink-libraries .................................... SUCCESS [  3.493 s]
[INFO] flink-table ........................................ SUCCESS [01:29 min]
[INFO] flink-metrics-jmx .................................. SUCCESS [ 10.147 s]
[INFO] flink-connector-kafka-base ......................... SUCCESS [ 16.154 s]
[INFO] flink-connector-kafka-0.8 .......................... SUCCESS [ 12.175 s]
[INFO] flink-connector-kafka-0.9 .......................... SUCCESS [ 14.474 s]
[INFO] flink-connector-elasticsearch ...................... SUCCESS [ 12.668 s]
[INFO] flink-connector-elasticsearch2 ..................... SUCCESS [ 21.120 s]
[INFO] flink-connector-rabbitmq ........................... SUCCESS [ 10.858 s]
[INFO] flink-connector-twitter ............................ SUCCESS [ 15.366 s]
[INFO] flink-connector-nifi ............................... SUCCESS [ 11.274 s]
[INFO] flink-connector-cassandra .......................... SUCCESS [ 15.300 s]
[INFO] flink-connector-redis .............................. SUCCESS [ 11.441 s]
[INFO] flink-avro ......................................... SUCCESS [ 12.404 s]
[INFO] flink-jdbc ......................................... SUCCESS [ 10.829 s]
[INFO] flink-hbase ........................................ SUCCESS [ 16.191 s]
[INFO] flink-hcatalog ..................................... SUCCESS [ 22.572 s]
[INFO] flink-examples-streaming ........................... SUCCESS [ 44.651 s]
[INFO] flink-gelly ........................................ SUCCESS [ 17.803 s]
[INFO] flink-gelly-scala .................................. SUCCESS [ 34.635 s]
[INFO] flink-gelly-examples ............................... SUCCESS [ 24.915 s]
[INFO] flink-python ....................................... SUCCESS [ 11.902 s]
[INFO] flink-ml ........................................... SUCCESS [01:06 min]
[INFO] flink-cep .......................................... SUCCESS [ 17.126 s]
[INFO] flink-cep-scala .................................... SUCCESS [ 20.198 s]
[INFO] flink-scala-shell .................................. SUCCESS [ 26.140 s]
[INFO] flink-quickstart ................................... SUCCESS [  5.376 s]
[INFO] flink-quickstart-java .............................. SUCCESS [  8.160 s]
[INFO] flink-quickstart-scala ............................. SUCCESS [  7.215 s]
[INFO] flink-storm ........................................ SUCCESS [ 13.057 s]
[INFO] flink-storm-examples ............................... SUCCESS [ 49.464 s]
[INFO] flink-streaming-contrib ............................ SUCCESS [ 15.752 s]
[INFO] flink-tweet-inputformat ............................ SUCCESS [ 11.479 s]
[INFO] flink-operator-stats ............................... SUCCESS [ 10.925 s]
[INFO] flink-connector-wikiedits .......................... SUCCESS [ 10.720 s]
[INFO] flink-mesos ........................................ FAILURE [ 34.601 s]
[INFO] flink-dist ......................................... SKIPPED
[INFO] flink-metrics-dropwizard ........................... SKIPPED
[INFO] flink-metrics-ganglia .............................. SKIPPED
[INFO] flink-metrics-graphite ............................. SKIPPED
[INFO] flink-metrics-statsd ............................... SKIPPED
[INFO] flink-java8 ........................................ SKIPPED
[INFO] ------------------------------------------------------------------------
[INFO] BUILD FAILURE
[INFO] ------------------------------------------------------------------------
[INFO] Total time: 23:10 min
[INFO] Finished at: 2016-09-02T13:41:57+00:00
[INFO] Final Memory: 281M/3998M
[INFO] ------------------------------------------------------------------------
[ERROR] Failed to execute goal org.scalastyle:scalastyle-maven-plugin:0.5.0:check (default)
on project flink-mesos_2.10: Failed during scalastyle execution: You have 1 Scalastyle violation(s).
-> [Help 1]
[ERROR] 
[ERROR] To see the full stack trace of the errors, re-run Maven with the -e switch.
[ERROR] Re-run Maven using the -X switch to enable full debug logging.
[ERROR] 
[ERROR] For more information about the errors and possible solutions, please read the following
articles:
[ERROR] [Help 1] http://cwiki.apache.org/confluence/display/MAVEN/MojoExecutionException
[ERROR] 
[ERROR] After correcting the problems, you can resume the build with the command
[ERROR]   mvn <goals> -rf :flink-mesos_2.10
Build step 'Execute shell' marked build as failure
Setting MAVEN_3_2_5_HOME=/home/jenkins/tools/maven/apache-maven-3.2.5

Mime
View raw message