flink-commits mailing list archives

Site index · List index
Message view « Date » · « Thread »
Top « Date » · « Thread »
From Apache Jenkins Server <jenk...@builds.apache.org>
Subject Build failed in Jenkins: flink-snapshot-deployment #160
Date Wed, 20 Jul 2016 07:12:35 GMT
See <https://builds.apache.org/job/flink-snapshot-deployment/160/>

------------------------------------------
[...truncated 26825 lines...]
[WARNING] <https://builds.apache.org/job/flink-snapshot-deployment/ws/flink-optimizer/src/main/java/org/apache/flink/optimizer/traversals/RangePartitionRewriter.java>:[140,66]
unchecked call to MapPartitionOperatorBase(FT,org.apache.flink.api.common.operators.UnaryOperatorInformation<IN,OUT>,java.lang.String)
as a member of the raw type org.apache.flink.api.common.operators.base.MapPartitionOperatorBase
[WARNING] <https://builds.apache.org/job/flink-snapshot-deployment/ws/flink-optimizer/src/main/java/org/apache/flink/optimizer/traversals/RangePartitionRewriter.java>:[155,73]
unchecked call to UnaryOperatorInformation(org.apache.flink.api.common.typeinfo.TypeInformation<IN>,org.apache.flink.api.common.typeinfo.TypeInformation<OUT>)
as a member of the raw type org.apache.flink.api.common.operators.UnaryOperatorInformation
[WARNING] <https://builds.apache.org/job/flink-snapshot-deployment/ws/flink-optimizer/src/main/java/org/apache/flink/optimizer/traversals/RangePartitionRewriter.java>:[156,65]
unchecked call to GroupReduceOperatorBase(FT,org.apache.flink.api.common.operators.UnaryOperatorInformation<IN,OUT>,java.lang.String)
as a member of the raw type org.apache.flink.api.common.operators.base.GroupReduceOperatorBase
[WARNING] <https://builds.apache.org/job/flink-snapshot-deployment/ws/flink-optimizer/src/main/java/org/apache/flink/optimizer/traversals/RangePartitionRewriter.java>:[170,67]
unchecked call to RangeBoundaryBuilder(org.apache.flink.api.common.typeutils.TypeComparatorFactory<T>,int)
as a member of the raw type org.apache.flink.runtime.operators.udf.RangeBoundaryBuilder
[WARNING] <https://builds.apache.org/job/flink-snapshot-deployment/ws/flink-optimizer/src/main/java/org/apache/flink/optimizer/traversals/RangePartitionRewriter.java>:[172,72]
unchecked call to UnaryOperatorInformation(org.apache.flink.api.common.typeinfo.TypeInformation<IN>,org.apache.flink.api.common.typeinfo.TypeInformation<OUT>)
as a member of the raw type org.apache.flink.api.common.operators.UnaryOperatorInformation
[WARNING] <https://builds.apache.org/job/flink-snapshot-deployment/ws/flink-optimizer/src/main/java/org/apache/flink/optimizer/traversals/RangePartitionRewriter.java>:[173,65]
unchecked call to MapPartitionOperatorBase(FT,org.apache.flink.api.common.operators.UnaryOperatorInformation<IN,OUT>,java.lang.String)
as a member of the raw type org.apache.flink.api.common.operators.base.MapPartitionOperatorBase
[WARNING] <https://builds.apache.org/job/flink-snapshot-deployment/ws/flink-optimizer/src/main/java/org/apache/flink/optimizer/traversals/RangePartitionRewriter.java>:[187,59]
unchecked call to AssignRangeIndex(org.apache.flink.api.common.typeutils.TypeComparatorFactory<IN>)
as a member of the raw type org.apache.flink.runtime.operators.udf.AssignRangeIndex
[WARNING] <https://builds.apache.org/job/flink-snapshot-deployment/ws/flink-optimizer/src/main/java/org/apache/flink/optimizer/traversals/RangePartitionRewriter.java>:[189,73]
unchecked call to UnaryOperatorInformation(org.apache.flink.api.common.typeinfo.TypeInformation<IN>,org.apache.flink.api.common.typeinfo.TypeInformation<OUT>)
as a member of the raw type org.apache.flink.api.common.operators.UnaryOperatorInformation
[WARNING] <https://builds.apache.org/job/flink-snapshot-deployment/ws/flink-optimizer/src/main/java/org/apache/flink/optimizer/traversals/RangePartitionRewriter.java>:[190,66]
unchecked call to MapPartitionOperatorBase(FT,org.apache.flink.api.common.operators.UnaryOperatorInformation<IN,OUT>,java.lang.String)
as a member of the raw type org.apache.flink.api.common.operators.base.MapPartitionOperatorBase
[WARNING] <https://builds.apache.org/job/flink-snapshot-deployment/ws/flink-optimizer/src/main/java/org/apache/flink/optimizer/traversals/RangePartitionRewriter.java>:[218,72]
unchecked call to UnaryOperatorInformation(org.apache.flink.api.common.typeinfo.TypeInformation<IN>,org.apache.flink.api.common.typeinfo.TypeInformation<OUT>)
as a member of the raw type org.apache.flink.api.common.operators.UnaryOperatorInformation
[WARNING] <https://builds.apache.org/job/flink-snapshot-deployment/ws/flink-optimizer/src/main/java/org/apache/flink/optimizer/traversals/RangePartitionRewriter.java>:[219,56]
unchecked call to MapOperatorBase(FT,org.apache.flink.api.common.operators.UnaryOperatorInformation<IN,OUT>,java.lang.String)
as a member of the raw type org.apache.flink.api.common.operators.base.MapOperatorBase
[INFO] 
[INFO] --- maven-resources-plugin:2.6:testResources (default-testResources) @ flink-optimizer_2.11
---
[INFO] Using 'UTF-8' encoding to copy filtered resources.
[INFO] Copying 2 resources
[INFO] Copying 3 resources
[INFO] 
[INFO] --- maven-compiler-plugin:3.1:testCompile (default-testCompile) @ flink-optimizer_2.11
---
[INFO] Changes detected - recompiling the module!
[INFO] Compiling 88 source files to <https://builds.apache.org/job/flink-snapshot-deployment/ws/flink-optimizer/target/test-classes>
[WARNING] <https://builds.apache.org/job/flink-snapshot-deployment/ws/flink-optimizer/src/test/java/org/apache/flink/optimizer/util/OperatorResolver.java>:[112,96]
unchecked call to accept(org.apache.flink.util.Visitor<T>) as a member of the raw type
org.apache.flink.util.Visitable
[WARNING] <https://builds.apache.org/job/flink-snapshot-deployment/ws/flink-optimizer/src/test/java/org/apache/flink/optimizer/util/OperatorResolver.java>:[114,94]
unchecked call to accept(org.apache.flink.util.Visitor<T>) as a member of the raw type
org.apache.flink.util.Visitable
[WARNING] <https://builds.apache.org/job/flink-snapshot-deployment/ws/flink-optimizer/src/test/java/org/apache/flink/optimizer/util/OperatorResolver.java>:[115,89]
unchecked call to accept(org.apache.flink.util.Visitor<T>) as a member of the raw type
org.apache.flink.util.Visitable
[WARNING] <https://builds.apache.org/job/flink-snapshot-deployment/ws/flink-optimizer/src/test/java/org/apache/flink/optimizer/BranchingPlansCompilerTest.java>:[448,86]
unchecked cast
  required: org.apache.flink.api.java.io.TextOutputFormat<java.lang.String>
  found:    capture#1 of ? extends org.apache.flink.api.common.io.OutputFormat<capture#2
of ?>
[INFO] 
[INFO] --- maven-surefire-plugin:2.18.1:test (default-test) @ flink-optimizer_2.11 ---
[INFO] Tests are skipped.
[INFO] 
[INFO] --- maven-jar-plugin:2.4:jar (default-jar) @ flink-optimizer_2.11 ---
[INFO] Building jar: <https://builds.apache.org/job/flink-snapshot-deployment/ws/flink-optimizer/target/flink-optimizer_2.11-1.1-SNAPSHOT.jar>
[INFO] 
[INFO] --- maven-site-plugin:3.3:attach-descriptor (attach-descriptor) @ flink-optimizer_2.11
---
[INFO] 
[INFO] --- maven-jar-plugin:2.4:test-jar (default) @ flink-optimizer_2.11 ---
[INFO] Building jar: <https://builds.apache.org/job/flink-snapshot-deployment/ws/flink-optimizer/target/flink-optimizer_2.11-1.1-SNAPSHOT-tests.jar>
[INFO] 
[INFO] --- maven-shade-plugin:2.4.1:shade (shade-flink) @ flink-optimizer_2.11 ---
[INFO] Excluding org.apache.flink:flink-core:jar:1.1-SNAPSHOT from the shaded jar.
[INFO] Excluding org.apache.flink:flink-annotations:jar:1.1-SNAPSHOT from the shaded jar.
[INFO] Excluding com.esotericsoftware.kryo:kryo:jar:2.24.0 from the shaded jar.
[INFO] Excluding com.esotericsoftware.minlog:minlog:jar:1.2 from the shaded jar.
[INFO] Excluding org.objenesis:objenesis:jar:2.1 from the shaded jar.
[INFO] Excluding org.apache.avro:avro:jar:1.7.6 from the shaded jar.
[INFO] Excluding org.codehaus.jackson:jackson-core-asl:jar:1.9.13 from the shaded jar.
[INFO] Excluding org.codehaus.jackson:jackson-mapper-asl:jar:1.9.13 from the shaded jar.
[INFO] Excluding com.thoughtworks.paranamer:paranamer:jar:2.3 from the shaded jar.
[INFO] Excluding org.apache.flink:flink-shaded-hadoop2:jar:1.1-SNAPSHOT from the shaded jar.
[INFO] Excluding xmlenc:xmlenc:jar:0.52 from the shaded jar.
[INFO] Excluding commons-codec:commons-codec:jar:1.4 from the shaded jar.
[INFO] Excluding commons-io:commons-io:jar:2.4 from the shaded jar.
[INFO] Excluding commons-net:commons-net:jar:3.1 from the shaded jar.
[INFO] Excluding commons-collections:commons-collections:jar:3.2.1 from the shaded jar.
[INFO] Excluding javax.servlet:servlet-api:jar:2.5 from the shaded jar.
[INFO] Excluding org.mortbay.jetty:jetty-util:jar:6.1.26 from the shaded jar.
[INFO] Excluding com.sun.jersey:jersey-core:jar:1.9 from the shaded jar.
[INFO] Excluding commons-el:commons-el:jar:1.0 from the shaded jar.
[INFO] Excluding commons-logging:commons-logging:jar:1.1.3 from the shaded jar.
[INFO] Excluding com.jamesmurty.utils:java-xmlbuilder:jar:0.4 from the shaded jar.
[INFO] Excluding commons-lang:commons-lang:jar:2.6 from the shaded jar.
[INFO] Excluding commons-configuration:commons-configuration:jar:1.7 from the shaded jar.
[INFO] Excluding commons-digester:commons-digester:jar:1.8.1 from the shaded jar.
[INFO] Excluding org.xerial.snappy:snappy-java:jar:1.0.5 from the shaded jar.
[INFO] Excluding com.jcraft:jsch:jar:0.1.42 from the shaded jar.
[INFO] Excluding org.apache.commons:commons-compress:jar:1.4.1 from the shaded jar.
[INFO] Excluding org.tukaani:xz:jar:1.0 from the shaded jar.
[INFO] Excluding commons-beanutils:commons-beanutils-bean-collections:jar:1.8.3 from the shaded
jar.
[INFO] Excluding commons-daemon:commons-daemon:jar:1.0.13 from the shaded jar.
[INFO] Excluding javax.xml.bind:jaxb-api:jar:2.2.2 from the shaded jar.
[INFO] Excluding javax.xml.stream:stax-api:jar:1.0-2 from the shaded jar.
[INFO] Excluding javax.activation:activation:jar:1.1 from the shaded jar.
[INFO] Excluding com.google.inject:guice:jar:3.0 from the shaded jar.
[INFO] Excluding javax.inject:javax.inject:jar:1 from the shaded jar.
[INFO] Excluding aopalliance:aopalliance:jar:1.0 from the shaded jar.
[INFO] Excluding org.apache.flink:flink-runtime_2.11:jar:1.1-SNAPSHOT from the shaded jar.
[INFO] Excluding commons-cli:commons-cli:jar:1.3.1 from the shaded jar.
[INFO] Excluding io.netty:netty-all:jar:4.0.27.Final from the shaded jar.
[INFO] Excluding org.javassist:javassist:jar:3.18.2-GA from the shaded jar.
[INFO] Excluding org.scala-lang:scala-library:jar:2.11.7 from the shaded jar.
[INFO] Excluding com.typesafe.akka:akka-actor_2.11:jar:2.3.7 from the shaded jar.
[INFO] Excluding com.typesafe:config:jar:1.2.1 from the shaded jar.
[INFO] Excluding com.typesafe.akka:akka-remote_2.11:jar:2.3.7 from the shaded jar.
[INFO] Excluding io.netty:netty:jar:3.8.0.Final from the shaded jar.
[INFO] Excluding com.google.protobuf:protobuf-java:jar:2.5.0 from the shaded jar.
[INFO] Excluding org.uncommons.maths:uncommons-maths:jar:1.2.2a from the shaded jar.
[INFO] Excluding com.typesafe.akka:akka-slf4j_2.11:jar:2.3.7 from the shaded jar.
[INFO] Excluding org.clapper:grizzled-slf4j_2.11:jar:1.0.2 from the shaded jar.
[INFO] Excluding com.github.scopt:scopt_2.11:jar:3.2.0 from the shaded jar.
[INFO] Excluding io.dropwizard.metrics:metrics-core:jar:3.1.0 from the shaded jar.
[INFO] Excluding io.dropwizard.metrics:metrics-jvm:jar:3.1.0 from the shaded jar.
[INFO] Excluding io.dropwizard.metrics:metrics-json:jar:3.1.0 from the shaded jar.
[INFO] Excluding com.fasterxml.jackson.core:jackson-databind:jar:2.7.4 from the shaded jar.
[INFO] Excluding com.fasterxml.jackson.core:jackson-annotations:jar:2.7.4 from the shaded
jar.
[INFO] Excluding com.fasterxml.jackson.core:jackson-core:jar:2.7.4 from the shaded jar.
[INFO] Excluding org.apache.zookeeper:zookeeper:jar:3.4.6 from the shaded jar.
[INFO] Excluding jline:jline:jar:0.9.94 from the shaded jar.
[INFO] Excluding com.twitter:chill_2.11:jar:0.7.4 from the shaded jar.
[INFO] Excluding com.twitter:chill-java:jar:0.7.4 from the shaded jar.
[INFO] Excluding org.apache.flink:flink-java:jar:1.1-SNAPSHOT from the shaded jar.
[INFO] Excluding org.apache.commons:commons-math3:jar:3.5 from the shaded jar.
[INFO] Including com.google.guava:guava:jar:18.0 in the shaded jar.
[INFO] Including org.apache.flink:force-shading:jar:1.1-SNAPSHOT in the shaded jar.
[INFO] Excluding com.google.code.findbugs:jsr305:jar:1.3.9 from the shaded jar.
[INFO] Excluding org.apache.commons:commons-lang3:jar:3.3.2 from the shaded jar.
[INFO] Excluding org.slf4j:slf4j-api:jar:1.7.7 from the shaded jar.
[INFO] Excluding org.slf4j:slf4j-log4j12:jar:1.7.7 from the shaded jar.
[INFO] Excluding log4j:log4j:jar:1.2.17 from the shaded jar.
[INFO] Replacing original artifact with shaded artifact.
[INFO] Replacing <https://builds.apache.org/job/flink-snapshot-deployment/ws/flink-optimizer/target/flink-optimizer_2.11-1.1-SNAPSHOT.jar>
with <https://builds.apache.org/job/flink-snapshot-deployment/ws/flink-optimizer/target/flink-optimizer_2.11-1.1-SNAPSHOT-shaded.jar>
[INFO] Replacing original test artifact with shaded test artifact.
[INFO] Replacing <https://builds.apache.org/job/flink-snapshot-deployment/ws/flink-optimizer/target/flink-optimizer_2.11-1.1-SNAPSHOT-tests.jar>
with <https://builds.apache.org/job/flink-snapshot-deployment/ws/flink-optimizer/target/flink-optimizer_2.11-1.1-SNAPSHOT-shaded-tests.jar>
[INFO] Dependency-reduced POM written at: <https://builds.apache.org/job/flink-snapshot-deployment/ws/flink-optimizer/target/dependency-reduced-pom.xml>
[INFO] Dependency-reduced POM written at: <https://builds.apache.org/job/flink-snapshot-deployment/ws/flink-optimizer/target/dependency-reduced-pom.xml>
[INFO] 
[INFO] >>> maven-source-plugin:2.2.1:jar (attach-sources) > generate-sources @
flink-optimizer_2.11 >>>
[INFO] 
[INFO] --- maven-checkstyle-plugin:2.16:check (validate) @ flink-optimizer_2.11 ---
[INFO] 
[INFO] --- maven-enforcer-plugin:1.3.1:enforce (enforce-maven) @ flink-optimizer_2.11 ---
[INFO] 
[INFO] <<< maven-source-plugin:2.2.1:jar (attach-sources) < generate-sources @
flink-optimizer_2.11 <<<
[INFO] 
[INFO] --- maven-source-plugin:2.2.1:jar (attach-sources) @ flink-optimizer_2.11 ---
[INFO] Building jar: <https://builds.apache.org/job/flink-snapshot-deployment/ws/flink-optimizer/target/flink-optimizer_2.11-1.1-SNAPSHOT-sources.jar>
[INFO] 
[INFO] --- maven-javadoc-plugin:2.9.1:jar (attach-javadocs) @ flink-optimizer_2.11 ---
[INFO] Building jar: <https://builds.apache.org/job/flink-snapshot-deployment/ws/flink-optimizer/target/flink-optimizer_2.11-1.1-SNAPSHOT-javadoc.jar>
[INFO] 
[INFO] --- maven-surefire-plugin:2.18.1:test (integration-tests) @ flink-optimizer_2.11 ---
[INFO] Tests are skipped.
[INFO] 
[INFO] --- japicmp-maven-plugin:0.7.0:cmp (default) @ flink-optimizer_2.11 ---
[INFO] Written file '<https://builds.apache.org/job/flink-snapshot-deployment/ws/flink-optimizer/target/japicmp/japicmp.diff'.>
Warning:  org.apache.xerces.jaxp.SAXParserImpl$JAXPSAXParser: Property 'http://www.oracle.com/xml/jaxp/properties/entityExpansionLimit'
is not recognized.
Compiler warnings:
  WARNING:  'org.apache.xerces.jaxp.SAXParserImpl: Property 'http://javax.xml.XMLConstants/property/accessExternalDTD'
is not recognized.'
Warning:  org.apache.xerces.parsers.SAXParser: Property 'http://javax.xml.XMLConstants/property/accessExternalDTD'
is not recognized.
Warning:  org.apache.xerces.parsers.SAXParser: Property 'http://www.oracle.com/xml/jaxp/properties/entityExpansionLimit'
is not recognized.
[INFO] Written file '<https://builds.apache.org/job/flink-snapshot-deployment/ws/flink-optimizer/target/japicmp/japicmp.xml'.>
[INFO] Written file '<https://builds.apache.org/job/flink-snapshot-deployment/ws/flink-optimizer/target/japicmp/japicmp.html'.>
[INFO] 
[INFO] --- maven-install-plugin:2.5.1:install (default-install) @ flink-optimizer_2.11 ---
[INFO] Installing <https://builds.apache.org/job/flink-snapshot-deployment/ws/flink-optimizer/target/flink-optimizer_2.11-1.1-SNAPSHOT.jar>
to /home/jenkins/.m2/repository/org/apache/flink/flink-optimizer_2.11/1.1-SNAPSHOT/flink-optimizer_2.11-1.1-SNAPSHOT.jar
[INFO] Installing <https://builds.apache.org/job/flink-snapshot-deployment/ws/flink-optimizer/target/dependency-reduced-pom.xml>
to /home/jenkins/.m2/repository/org/apache/flink/flink-optimizer_2.11/1.1-SNAPSHOT/flink-optimizer_2.11-1.1-SNAPSHOT.pom
[INFO] Installing <https://builds.apache.org/job/flink-snapshot-deployment/ws/flink-optimizer/target/flink-optimizer_2.11-1.1-SNAPSHOT-tests.jar>
to /home/jenkins/.m2/repository/org/apache/flink/flink-optimizer_2.11/1.1-SNAPSHOT/flink-optimizer_2.11-1.1-SNAPSHOT-tests.jar
[INFO] Installing <https://builds.apache.org/job/flink-snapshot-deployment/ws/flink-optimizer/target/flink-optimizer_2.11-1.1-SNAPSHOT-tests.jar>
to /home/jenkins/.m2/repository/org/apache/flink/flink-optimizer_2.11/1.1-SNAPSHOT/flink-optimizer_2.11-1.1-SNAPSHOT-tests.jar
[INFO] Installing <https://builds.apache.org/job/flink-snapshot-deployment/ws/flink-optimizer/target/flink-optimizer_2.11-1.1-SNAPSHOT-sources.jar>
to /home/jenkins/.m2/repository/org/apache/flink/flink-optimizer_2.11/1.1-SNAPSHOT/flink-optimizer_2.11-1.1-SNAPSHOT-sources.jar
[INFO] Installing <https://builds.apache.org/job/flink-snapshot-deployment/ws/flink-optimizer/target/flink-optimizer_2.11-1.1-SNAPSHOT-javadoc.jar>
to /home/jenkins/.m2/repository/org/apache/flink/flink-optimizer_2.11/1.1-SNAPSHOT/flink-optimizer_2.11-1.1-SNAPSHOT-javadoc.jar
[INFO] 
[INFO] --- maven-deploy-plugin:2.8.1:deploy (default-deploy) @ flink-optimizer_2.11 ---
[INFO] Downloading: https://repository.apache.org/content/repositories/snapshots/org/apache/flink/flink-optimizer_2.11/1.1-SNAPSHOT/maven-metadata.xml
[WARNING] Could not transfer metadata org.apache.flink:flink-optimizer_2.11:1.1-SNAPSHOT/maven-metadata.xml
from/to apache.snapshots.https (https://repository.apache.org/content/repositories/snapshots):
Connect to repository.apache.org:443 [repository.apache.org/207.244.88.143] failed: Connection
timed out
[INFO] ------------------------------------------------------------------------
[INFO] Reactor Summary:
[INFO] 
[INFO] force-shading ...................................... SUCCESS [ 19.958 s]
[INFO] flink .............................................. SUCCESS [  9.258 s]
[INFO] flink-annotations .................................. SUCCESS [ 13.765 s]
[INFO] flink-shaded-hadoop ................................ SUCCESS [ 12.121 s]
[INFO] flink-shaded-hadoop2 ............................... SUCCESS [ 32.540 s]
[INFO] flink-shaded-include-yarn-tests .................... SUCCESS [ 39.182 s]
[INFO] flink-shaded-curator ............................... SUCCESS [  4.267 s]
[INFO] flink-shaded-curator-recipes ....................... SUCCESS [ 11.996 s]
[INFO] flink-shaded-curator-test .......................... SUCCESS [ 18.696 s]
[INFO] flink-test-utils-parent ............................ SUCCESS [ 10.363 s]
[INFO] flink-test-utils-junit ............................. SUCCESS [ 16.065 s]
[INFO] flink-core ......................................... SUCCESS [01:21 min]
[INFO] flink-java ......................................... SUCCESS [ 39.741 s]
[INFO] flink-runtime ...................................... SUCCESS [02:41 min]
[INFO] flink-optimizer .................................... FAILURE [02:26 min]
[INFO] flink-clients ...................................... SKIPPED
[INFO] flink-streaming-java ............................... SKIPPED
[INFO] flink-test-utils ................................... SKIPPED
[INFO] flink-scala ........................................ SKIPPED
[INFO] flink-runtime-web .................................. SKIPPED
[INFO] flink-examples ..................................... SKIPPED
[INFO] flink-examples-batch ............................... SKIPPED
[INFO] flink-contrib ...................................... SKIPPED
[INFO] flink-statebackend-rocksdb ......................... SKIPPED
[INFO] flink-tests ........................................ SKIPPED
[INFO] flink-streaming-scala .............................. SKIPPED
[INFO] flink-streaming-connectors ......................... SKIPPED
[INFO] flink-connector-flume .............................. SKIPPED
[INFO] flink-libraries .................................... SKIPPED
[INFO] flink-table ........................................ SKIPPED
[INFO] flink-connector-kafka-base ......................... SKIPPED
[INFO] flink-connector-kafka-0.8 .......................... SKIPPED
[INFO] flink-connector-kafka-0.9 .......................... SKIPPED
[INFO] flink-connector-elasticsearch ...................... SKIPPED
[INFO] flink-connector-elasticsearch2 ..................... SKIPPED
[INFO] flink-connector-rabbitmq ........................... SKIPPED
[INFO] flink-connector-twitter ............................ SKIPPED
[INFO] flink-connector-nifi ............................... SKIPPED
[INFO] flink-connector-cassandra .......................... SKIPPED
[INFO] flink-connector-redis .............................. SKIPPED
[INFO] flink-connector-filesystem ......................... SKIPPED
[INFO] flink-batch-connectors ............................. SKIPPED
[INFO] flink-avro ......................................... SKIPPED
[INFO] flink-jdbc ......................................... SKIPPED
[INFO] flink-hadoop-compatibility ......................... SKIPPED
[INFO] flink-hbase ........................................ SKIPPED
[INFO] flink-hcatalog ..................................... SKIPPED
[INFO] flink-examples-streaming ........................... SKIPPED
[INFO] flink-gelly ........................................ SKIPPED
[INFO] flink-gelly-scala .................................. SKIPPED
[INFO] flink-gelly-examples ............................... SKIPPED
[INFO] flink-python ....................................... SKIPPED
[INFO] flink-ml ........................................... SKIPPED
[INFO] flink-cep .......................................... SKIPPED
[INFO] flink-cep-scala .................................... SKIPPED
[INFO] flink-scala-shell .................................. SKIPPED
[INFO] flink-quickstart ................................... SKIPPED
[INFO] flink-quickstart-java .............................. SKIPPED
[INFO] flink-quickstart-scala ............................. SKIPPED
[INFO] flink-storm ........................................ SKIPPED
[INFO] flink-storm-examples ............................... SKIPPED
[INFO] flink-streaming-contrib ............................ SKIPPED
[INFO] flink-tweet-inputformat ............................ SKIPPED
[INFO] flink-operator-stats ............................... SKIPPED
[INFO] flink-connector-wikiedits .......................... SKIPPED
[INFO] flink-yarn ......................................... SKIPPED
[INFO] flink-dist ......................................... SKIPPED
[INFO] flink-metrics ...................................... SKIPPED
[INFO] flink-metrics-dropwizard ........................... SKIPPED
[INFO] flink-metrics-ganglia .............................. SKIPPED
[INFO] flink-metrics-graphite ............................. SKIPPED
[INFO] flink-metrics-statsd ............................... SKIPPED
[INFO] flink-fs-tests ..................................... SKIPPED
[INFO] flink-java8 ........................................ SKIPPED
[INFO] ------------------------------------------------------------------------
[INFO] BUILD FAILURE
[INFO] ------------------------------------------------------------------------
[INFO] Total time: 10:19 min
[INFO] Finished at: 2016-07-20T07:12:37+00:00
[INFO] Final Memory: 138M/3560M
[INFO] ------------------------------------------------------------------------
[ERROR] Failed to execute goal org.apache.maven.plugins:maven-deploy-plugin:2.8.1:deploy (default-deploy)
on project flink-optimizer_2.11: Failed to retrieve remote metadata org.apache.flink:flink-optimizer_2.11:1.1-SNAPSHOT/maven-metadata.xml:
Could not transfer metadata org.apache.flink:flink-optimizer_2.11:1.1-SNAPSHOT/maven-metadata.xml
from/to apache.snapshots.https (https://repository.apache.org/content/repositories/snapshots):
Connect to repository.apache.org:443 [repository.apache.org/207.244.88.143] failed: Connection
timed out -> [Help 1]
[ERROR] 
[ERROR] To see the full stack trace of the errors, re-run Maven with the -e switch.
[ERROR] Re-run Maven using the -X switch to enable full debug logging.
[ERROR] 
[ERROR] For more information about the errors and possible solutions, please read the following
articles:
[ERROR] [Help 1] http://cwiki.apache.org/confluence/display/MAVEN/MojoExecutionException
[ERROR] 
[ERROR] After correcting the problems, you can resume the build with the command
[ERROR]   mvn <goals> -rf :flink-optimizer_2.11
Build step 'Execute shell' marked build as failure
Setting MAVEN_3_2_5_HOME=/home/jenkins/jenkins-slave/tools/hudson.tasks.Maven_MavenInstallation/maven-3.2.5

Mime
View raw message