flink-commits mailing list archives

Site index · List index
Message view « Date » · « Thread »
Top « Date » · « Thread »
From Apache Jenkins Server <jenk...@builds.apache.org>
Subject Build failed in Jenkins: flink-snapshot-deployment #154
Date Thu, 14 Jul 2016 04:19:26 GMT
See <https://builds.apache.org/job/flink-snapshot-deployment/154/>

------------------------------------------
[...truncated 11714 lines...]
[INFO] 
[INFO] --- maven-surefire-plugin:2.18.1:test (default-test) @ flink-parent ---
[INFO] Tests are skipped.
[INFO] 
[INFO] --- maven-site-plugin:3.3:attach-descriptor (attach-descriptor) @ flink-parent ---
[INFO] 
[INFO] --- maven-shade-plugin:2.4.1:shade (shade-flink) @ flink-parent ---
[INFO] Including org.apache.flink:force-shading:jar:1.1-SNAPSHOT in the shaded jar.
[INFO] Excluding com.google.code.findbugs:jsr305:jar:1.3.9 from the shaded jar.
[INFO] Excluding org.apache.commons:commons-lang3:jar:3.3.2 from the shaded jar.
[INFO] Excluding org.slf4j:slf4j-api:jar:1.7.7 from the shaded jar.
[INFO] Excluding org.slf4j:slf4j-log4j12:jar:1.7.7 from the shaded jar.
[INFO] Excluding log4j:log4j:jar:1.2.17 from the shaded jar.
[INFO] Replacing original artifact with shaded artifact.
[INFO] 
[INFO] >>> maven-source-plugin:2.2.1:jar (attach-sources) > generate-sources @
flink-parent >>>
[INFO] 
[INFO] --- maven-checkstyle-plugin:2.16:check (validate) @ flink-parent ---
[INFO] 
[INFO] --- maven-enforcer-plugin:1.3.1:enforce (enforce-maven) @ flink-parent ---
[INFO] 
[INFO] <<< maven-source-plugin:2.2.1:jar (attach-sources) < generate-sources @
flink-parent <<<
[INFO] 
[INFO] --- maven-source-plugin:2.2.1:jar (attach-sources) @ flink-parent ---
[INFO] 
[INFO] --- maven-javadoc-plugin:2.9.1:jar (attach-javadocs) @ flink-parent ---
[INFO] Not executing Javadoc as the project is not a Java classpath-capable package
[INFO] 
[INFO] --- maven-surefire-plugin:2.18.1:test (integration-tests) @ flink-parent ---
[INFO] Tests are skipped.
[INFO] 
[INFO] --- japicmp-maven-plugin:0.7.0:cmp (default) @ flink-parent ---
[INFO] Skipping execution because packaging of this module is 'pom'.
[INFO] 
[INFO] --- apache-rat-plugin:0.11:check (default) @ flink-parent ---
[INFO] RAT will not execute since it is configured to be skipped via system property 'rat.skip'.
[INFO] 
[INFO] --- maven-install-plugin:2.5.1:install (default-install) @ flink-parent ---
[INFO] Installing <https://builds.apache.org/job/flink-snapshot-deployment/ws/pom.xml>
to /home/jenkins/.m2/repository/org/apache/flink/flink-parent/1.1-SNAPSHOT/flink-parent-1.1-SNAPSHOT.pom
[INFO] 
[INFO] --- maven-deploy-plugin:2.8.1:deploy (default-deploy) @ flink-parent ---
[INFO] Downloading: https://repository.apache.org/content/repositories/snapshots/org/apache/flink/flink-parent/1.1-SNAPSHOT/maven-metadata.xml
[INFO] Downloaded: https://repository.apache.org/content/repositories/snapshots/org/apache/flink/flink-parent/1.1-SNAPSHOT/maven-metadata.xml
(605 B at 0.0 KB/sec)
[INFO] Uploading: https://repository.apache.org/content/repositories/snapshots/org/apache/flink/flink-parent/1.1-SNAPSHOT/flink-parent-1.1-20160714.041910-367.pom
[INFO] Uploaded: https://repository.apache.org/content/repositories/snapshots/org/apache/flink/flink-parent/1.1-SNAPSHOT/flink-parent-1.1-20160714.041910-367.pom
(40 KB at 38.0 KB/sec)
[INFO] Downloading: https://repository.apache.org/content/repositories/snapshots/org/apache/flink/flink-parent/maven-metadata.xml
[INFO] Downloaded: https://repository.apache.org/content/repositories/snapshots/org/apache/flink/flink-parent/maven-metadata.xml
(2 KB at 2.0 KB/sec)
[INFO] Uploading: https://repository.apache.org/content/repositories/snapshots/org/apache/flink/flink-parent/1.1-SNAPSHOT/maven-metadata.xml
[INFO] Uploaded: https://repository.apache.org/content/repositories/snapshots/org/apache/flink/flink-parent/1.1-SNAPSHOT/maven-metadata.xml
(605 B at 0.7 KB/sec)
[INFO] Uploading: https://repository.apache.org/content/repositories/snapshots/org/apache/flink/flink-parent/maven-metadata.xml
[INFO] Uploaded: https://repository.apache.org/content/repositories/snapshots/org/apache/flink/flink-parent/maven-metadata.xml
(2 KB at 1.3 KB/sec)
[INFO]                                                                         
[INFO] ------------------------------------------------------------------------
[INFO] Building flink-annotations 1.1-SNAPSHOT
[INFO] ------------------------------------------------------------------------
[INFO] 
[INFO] --- maven-clean-plugin:2.5:clean (default-clean) @ flink-annotations ---
[INFO] Deleting <https://builds.apache.org/job/flink-snapshot-deployment/ws/flink-annotations/target>
[INFO] 
[INFO] --- maven-checkstyle-plugin:2.16:check (validate) @ flink-annotations ---
[INFO] 
[INFO] --- maven-enforcer-plugin:1.3.1:enforce (enforce-maven) @ flink-annotations ---
[INFO] 
[INFO] --- maven-remote-resources-plugin:1.5:process (default) @ flink-annotations ---
[INFO] 
[INFO] --- maven-resources-plugin:2.6:resources (default-resources) @ flink-annotations ---
[INFO] Using 'UTF-8' encoding to copy filtered resources.
[INFO] skip non existing resourceDirectory <https://builds.apache.org/job/flink-snapshot-deployment/ws/flink-annotations/src/main/resources>
[INFO] Copying 3 resources
[INFO] 
[INFO] --- maven-compiler-plugin:3.1:compile (default-compile) @ flink-annotations ---
[INFO] Changes detected - recompiling the module!
[INFO] Compiling 3 source files to <https://builds.apache.org/job/flink-snapshot-deployment/ws/flink-annotations/target/classes>
[INFO] 
[INFO] --- maven-resources-plugin:2.6:testResources (default-testResources) @ flink-annotations
---
[INFO] Using 'UTF-8' encoding to copy filtered resources.
[INFO] skip non existing resourceDirectory <https://builds.apache.org/job/flink-snapshot-deployment/ws/flink-annotations/src/test/resources>
[INFO] Copying 3 resources
[INFO] 
[INFO] --- maven-compiler-plugin:3.1:testCompile (default-testCompile) @ flink-annotations
---
[INFO] No sources to compile
[INFO] 
[INFO] --- maven-surefire-plugin:2.18.1:test (default-test) @ flink-annotations ---
[INFO] Tests are skipped.
[INFO] 
[INFO] --- maven-jar-plugin:2.4:jar (default-jar) @ flink-annotations ---
[INFO] Building jar: <https://builds.apache.org/job/flink-snapshot-deployment/ws/flink-annotations/target/flink-annotations-1.1-SNAPSHOT.jar>
[INFO] 
[INFO] --- maven-site-plugin:3.3:attach-descriptor (attach-descriptor) @ flink-annotations
---
[INFO] 
[INFO] --- maven-shade-plugin:2.4.1:shade (shade-flink) @ flink-annotations ---
[INFO] Including org.apache.flink:force-shading:jar:1.1-SNAPSHOT in the shaded jar.
[INFO] Excluding com.google.code.findbugs:jsr305:jar:1.3.9 from the shaded jar.
[INFO] Excluding org.apache.commons:commons-lang3:jar:3.3.2 from the shaded jar.
[INFO] Excluding org.slf4j:slf4j-api:jar:1.7.7 from the shaded jar.
[INFO] Excluding org.slf4j:slf4j-log4j12:jar:1.7.7 from the shaded jar.
[INFO] Excluding log4j:log4j:jar:1.2.17 from the shaded jar.
[INFO] Replacing original artifact with shaded artifact.
[INFO] Replacing <https://builds.apache.org/job/flink-snapshot-deployment/ws/flink-annotations/target/flink-annotations-1.1-SNAPSHOT.jar>
with <https://builds.apache.org/job/flink-snapshot-deployment/ws/flink-annotations/target/flink-annotations-1.1-SNAPSHOT-shaded.jar>
[INFO] Replacing original test artifact with shaded test artifact.
[INFO] Replacing <https://builds.apache.org/job/flink-snapshot-deployment/ws/flink-annotations/target/flink-annotations-1.1-SNAPSHOT-tests.jar>
with <https://builds.apache.org/job/flink-snapshot-deployment/ws/flink-annotations/target/flink-annotations-1.1-SNAPSHOT-shaded-tests.jar>
[INFO] Dependency-reduced POM written at: <https://builds.apache.org/job/flink-snapshot-deployment/ws/flink-annotations/target/dependency-reduced-pom.xml>
[INFO] Dependency-reduced POM written at: <https://builds.apache.org/job/flink-snapshot-deployment/ws/flink-annotations/target/dependency-reduced-pom.xml>
[INFO] 
[INFO] >>> maven-source-plugin:2.2.1:jar (attach-sources) > generate-sources @
flink-annotations >>>
[INFO] 
[INFO] --- maven-checkstyle-plugin:2.16:check (validate) @ flink-annotations ---
[INFO] 
[INFO] --- maven-enforcer-plugin:1.3.1:enforce (enforce-maven) @ flink-annotations ---
[INFO] 
[INFO] <<< maven-source-plugin:2.2.1:jar (attach-sources) < generate-sources @
flink-annotations <<<
[INFO] 
[INFO] --- maven-source-plugin:2.2.1:jar (attach-sources) @ flink-annotations ---
[INFO] Building jar: <https://builds.apache.org/job/flink-snapshot-deployment/ws/flink-annotations/target/flink-annotations-1.1-SNAPSHOT-sources.jar>
[INFO] 
[INFO] --- maven-javadoc-plugin:2.9.1:jar (attach-javadocs) @ flink-annotations ---
[INFO] Building jar: <https://builds.apache.org/job/flink-snapshot-deployment/ws/flink-annotations/target/flink-annotations-1.1-SNAPSHOT-javadoc.jar>
[INFO] 
[INFO] --- maven-surefire-plugin:2.18.1:test (integration-tests) @ flink-annotations ---
[INFO] Tests are skipped.
[INFO] 
[INFO] --- japicmp-maven-plugin:0.7.0:cmp (default) @ flink-annotations ---
[INFO] Skipping execution because parameter 'skip' was set to true.
[INFO] 
[INFO] --- maven-install-plugin:2.5.1:install (default-install) @ flink-annotations ---
[INFO] Installing <https://builds.apache.org/job/flink-snapshot-deployment/ws/flink-annotations/target/flink-annotations-1.1-SNAPSHOT.jar>
to /home/jenkins/.m2/repository/org/apache/flink/flink-annotations/1.1-SNAPSHOT/flink-annotations-1.1-SNAPSHOT.jar
[INFO] Installing <https://builds.apache.org/job/flink-snapshot-deployment/ws/flink-annotations/target/dependency-reduced-pom.xml>
to /home/jenkins/.m2/repository/org/apache/flink/flink-annotations/1.1-SNAPSHOT/flink-annotations-1.1-SNAPSHOT.pom
[INFO] Installing <https://builds.apache.org/job/flink-snapshot-deployment/ws/flink-annotations/target/flink-annotations-1.1-SNAPSHOT-tests.jar>
to /home/jenkins/.m2/repository/org/apache/flink/flink-annotations/1.1-SNAPSHOT/flink-annotations-1.1-SNAPSHOT-tests.jar
[INFO] Installing <https://builds.apache.org/job/flink-snapshot-deployment/ws/flink-annotations/target/flink-annotations-1.1-SNAPSHOT-sources.jar>
to /home/jenkins/.m2/repository/org/apache/flink/flink-annotations/1.1-SNAPSHOT/flink-annotations-1.1-SNAPSHOT-sources.jar
[INFO] Installing <https://builds.apache.org/job/flink-snapshot-deployment/ws/flink-annotations/target/flink-annotations-1.1-SNAPSHOT-javadoc.jar>
to /home/jenkins/.m2/repository/org/apache/flink/flink-annotations/1.1-SNAPSHOT/flink-annotations-1.1-SNAPSHOT-javadoc.jar
[INFO] 
[INFO] --- maven-deploy-plugin:2.8.1:deploy (default-deploy) @ flink-annotations ---
[INFO] Downloading: https://repository.apache.org/content/repositories/snapshots/org/apache/flink/flink-annotations/1.1-SNAPSHOT/maven-metadata.xml
[INFO] Downloaded: https://repository.apache.org/content/repositories/snapshots/org/apache/flink/flink-annotations/1.1-SNAPSHOT/maven-metadata.xml
(2 KB at 2.4 KB/sec)
[INFO] Uploading: https://repository.apache.org/content/repositories/snapshots/org/apache/flink/flink-annotations/1.1-SNAPSHOT/flink-annotations-1.1-20160714.041918-359.jar
[INFO] Uploaded: https://repository.apache.org/content/repositories/snapshots/org/apache/flink/flink-annotations/1.1-SNAPSHOT/flink-annotations-1.1-20160714.041918-359.jar
(11 KB at 11.2 KB/sec)
[INFO] Uploading: https://repository.apache.org/content/repositories/snapshots/org/apache/flink/flink-annotations/1.1-SNAPSHOT/flink-annotations-1.1-20160714.041918-359.pom
[INFO] Uploaded: https://repository.apache.org/content/repositories/snapshots/org/apache/flink/flink-annotations/1.1-SNAPSHOT/flink-annotations-1.1-20160714.041918-359.pom
(4 KB at 4.2 KB/sec)
[INFO] Downloading: https://repository.apache.org/content/repositories/snapshots/org/apache/flink/flink-annotations/maven-metadata.xml
[INFO] Downloaded: https://repository.apache.org/content/repositories/snapshots/org/apache/flink/flink-annotations/maven-metadata.xml
(487 B at 0.8 KB/sec)
[INFO] Uploading: https://repository.apache.org/content/repositories/snapshots/org/apache/flink/flink-annotations/1.1-SNAPSHOT/maven-metadata.xml
[INFO] Uploaded: https://repository.apache.org/content/repositories/snapshots/org/apache/flink/flink-annotations/1.1-SNAPSHOT/maven-metadata.xml
(2 KB at 1.5 KB/sec)
[INFO] Uploading: https://repository.apache.org/content/repositories/snapshots/org/apache/flink/flink-annotations/maven-metadata.xml
[INFO] Uploaded: https://repository.apache.org/content/repositories/snapshots/org/apache/flink/flink-annotations/maven-metadata.xml
(487 B at 0.2 KB/sec)
[INFO] Uploading: https://repository.apache.org/content/repositories/snapshots/org/apache/flink/flink-annotations/1.1-SNAPSHOT/flink-annotations-1.1-20160714.041918-359-tests.jar
[INFO] Uploaded: https://repository.apache.org/content/repositories/snapshots/org/apache/flink/flink-annotations/1.1-SNAPSHOT/flink-annotations-1.1-20160714.041918-359-tests.jar
(22 B at 0.0 KB/sec)
[INFO] Uploading: https://repository.apache.org/content/repositories/snapshots/org/apache/flink/flink-annotations/1.1-SNAPSHOT/maven-metadata.xml
[INFO] Uploaded: https://repository.apache.org/content/repositories/snapshots/org/apache/flink/flink-annotations/1.1-SNAPSHOT/maven-metadata.xml
(2 KB at 1.4 KB/sec)
[INFO] Uploading: https://repository.apache.org/content/repositories/snapshots/org/apache/flink/flink-annotations/1.1-SNAPSHOT/flink-annotations-1.1-20160714.041918-359-sources.jar
[INFO] Uploaded: https://repository.apache.org/content/repositories/snapshots/org/apache/flink/flink-annotations/1.1-SNAPSHOT/flink-annotations-1.1-20160714.041918-359-sources.jar
(9 KB at 4.0 KB/sec)
[INFO] Uploading: https://repository.apache.org/content/repositories/snapshots/org/apache/flink/flink-annotations/1.1-SNAPSHOT/maven-metadata.xml
[INFO] Uploaded: https://repository.apache.org/content/repositories/snapshots/org/apache/flink/flink-annotations/1.1-SNAPSHOT/maven-metadata.xml
(2 KB at 1.5 KB/sec)
[INFO] Uploading: https://repository.apache.org/content/repositories/snapshots/org/apache/flink/flink-annotations/1.1-SNAPSHOT/flink-annotations-1.1-20160714.041918-359-javadoc.jar
[INFO] ------------------------------------------------------------------------
[INFO] Reactor Summary:
[INFO] 
[INFO] force-shading ...................................... SUCCESS [ 12.123 s]
[INFO] flink .............................................. SUCCESS [01:12 min]
[INFO] flink-annotations .................................. FAILURE [ 16.098 s]
[INFO] flink-shaded-hadoop ................................ SKIPPED
[INFO] flink-shaded-hadoop2 ............................... SKIPPED
[INFO] flink-shaded-include-yarn-tests .................... SKIPPED
[INFO] flink-shaded-curator ............................... SKIPPED
[INFO] flink-shaded-curator-recipes ....................... SKIPPED
[INFO] flink-shaded-curator-test .......................... SKIPPED
[INFO] flink-test-utils-parent ............................ SKIPPED
[INFO] flink-test-utils-junit ............................. SKIPPED
[INFO] flink-core ......................................... SKIPPED
[INFO] flink-java ......................................... SKIPPED
[INFO] flink-runtime ...................................... SKIPPED
[INFO] flink-optimizer .................................... SKIPPED
[INFO] flink-clients ...................................... SKIPPED
[INFO] flink-streaming-java ............................... SKIPPED
[INFO] flink-test-utils ................................... SKIPPED
[INFO] flink-scala ........................................ SKIPPED
[INFO] flink-runtime-web .................................. SKIPPED
[INFO] flink-examples ..................................... SKIPPED
[INFO] flink-examples-batch ............................... SKIPPED
[INFO] flink-contrib ...................................... SKIPPED
[INFO] flink-statebackend-rocksdb ......................... SKIPPED
[INFO] flink-tests ........................................ SKIPPED
[INFO] flink-streaming-scala .............................. SKIPPED
[INFO] flink-streaming-connectors ......................... SKIPPED
[INFO] flink-connector-flume .............................. SKIPPED
[INFO] flink-libraries .................................... SKIPPED
[INFO] flink-table ........................................ SKIPPED
[INFO] flink-connector-kafka-base ......................... SKIPPED
[INFO] flink-connector-kafka-0.8 .......................... SKIPPED
[INFO] flink-connector-kafka-0.9 .......................... SKIPPED
[INFO] flink-connector-elasticsearch ...................... SKIPPED
[INFO] flink-connector-elasticsearch2 ..................... SKIPPED
[INFO] flink-connector-rabbitmq ........................... SKIPPED
[INFO] flink-connector-twitter ............................ SKIPPED
[INFO] flink-connector-nifi ............................... SKIPPED
[INFO] flink-connector-cassandra .......................... SKIPPED
[INFO] flink-connector-redis .............................. SKIPPED
[INFO] flink-connector-filesystem ......................... SKIPPED
[INFO] flink-batch-connectors ............................. SKIPPED
[INFO] flink-avro ......................................... SKIPPED
[INFO] flink-jdbc ......................................... SKIPPED
[INFO] flink-hadoop-compatibility ......................... SKIPPED
[INFO] flink-hbase ........................................ SKIPPED
[INFO] flink-hcatalog ..................................... SKIPPED
[INFO] flink-examples-streaming ........................... SKIPPED
[INFO] flink-gelly ........................................ SKIPPED
[INFO] flink-gelly-scala .................................. SKIPPED
[INFO] flink-gelly-examples ............................... SKIPPED
[INFO] flink-python ....................................... SKIPPED
[INFO] flink-ml ........................................... SKIPPED
[INFO] flink-cep .......................................... SKIPPED
[INFO] flink-cep-scala .................................... SKIPPED
[INFO] flink-scala-shell .................................. SKIPPED
[INFO] flink-quickstart ................................... SKIPPED
[INFO] flink-quickstart-java .............................. SKIPPED
[INFO] flink-quickstart-scala ............................. SKIPPED
[INFO] flink-storm ........................................ SKIPPED
[INFO] flink-storm-examples ............................... SKIPPED
[INFO] flink-streaming-contrib ............................ SKIPPED
[INFO] flink-tweet-inputformat ............................ SKIPPED
[INFO] flink-operator-stats ............................... SKIPPED
[INFO] flink-connector-wikiedits .......................... SKIPPED
[INFO] flink-yarn ......................................... SKIPPED
[INFO] flink-dist ......................................... SKIPPED
[INFO] flink-metrics ...................................... SKIPPED
[INFO] flink-metrics-dropwizard ........................... SKIPPED
[INFO] flink-metrics-ganglia .............................. SKIPPED
[INFO] flink-metrics-graphite ............................. SKIPPED
[INFO] flink-metrics-statsd ............................... SKIPPED
[INFO] flink-fs-tests ..................................... SKIPPED
[INFO] flink-java8 ........................................ SKIPPED
[INFO] ------------------------------------------------------------------------
[INFO] BUILD FAILURE
[INFO] ------------------------------------------------------------------------
[INFO] Total time: 01:42 min
[INFO] Finished at: 2016-07-14T04:19:30+00:00
[INFO] Final Memory: 65M/1265M
[INFO] ------------------------------------------------------------------------
[ERROR] Failed to execute goal org.apache.maven.plugins:maven-deploy-plugin:2.8.1:deploy (default-deploy)
on project flink-annotations: Failed to deploy artifacts: Could not transfer artifact org.apache.flink:flink-annotations:jar:javadoc:1.1-20160714.041918-359
from/to apache.snapshots.https (https://repository.apache.org/content/repositories/snapshots):
Failed to transfer file: https://repository.apache.org/content/repositories/snapshots/org/apache/flink/flink-annotations/1.1-SNAPSHOT/flink-annotations-1.1-20160714.041918-359-javadoc.jar.
Return code is: 502, ReasonPhrase: Bad Gateway. -> [Help 1]
[ERROR] 
[ERROR] To see the full stack trace of the errors, re-run Maven with the -e switch.
[ERROR] Re-run Maven using the -X switch to enable full debug logging.
[ERROR] 
[ERROR] For more information about the errors and possible solutions, please read the following
articles:
[ERROR] [Help 1] http://cwiki.apache.org/confluence/display/MAVEN/MojoExecutionException
[ERROR] 
[ERROR] After correcting the problems, you can resume the build with the command
[ERROR]   mvn <goals> -rf :flink-annotations
Build step 'Execute shell' marked build as failure
Setting MAVEN_3_2_5_HOME=/home/jenkins/jenkins-slave/tools/hudson.tasks.Maven_MavenInstallation/maven-3.2.5

Mime
View raw message