flink-commits mailing list archives

Site index · List index
Message view « Date » · « Thread »
Top « Date » · « Thread »
From Apache Jenkins Server <jenk...@builds.apache.org>
Subject Build failed in Jenkins: flink-snapshot-deployment #102
Date Mon, 23 May 2016 03:36:09 GMT
See <https://builds.apache.org/job/flink-snapshot-deployment/102/>

------------------------------------------
[...truncated 35 lines...]
[INFO] --- maven-plugin-plugin:2.5.1:helpmojo (generated-helpmojo) @ lifecycle-mapping ---
[INFO] Using 'UTF-8' encoding to read mojo metadata.
[INFO] Applying mojo extractor for language: java
[INFO] Mojo extractor for language: java found 1 mojo descriptors.
[INFO] Applying mojo extractor for language: bsh
[INFO] Mojo extractor for language: bsh found 0 mojo descriptors.
[INFO] 
[INFO] --- maven-resources-plugin:2.6:resources (default-resources) @ lifecycle-mapping ---
[INFO] Using 'UTF-8' encoding to copy filtered resources.
[INFO] skip non existing resourceDirectory <https://builds.apache.org/job/flink-snapshot-deployment/ws/dummy-lifecycle-mapping-plugin/src/main/resources>
[INFO] 
[INFO] --- maven-compiler-plugin:3.1:compile (default-compile) @ lifecycle-mapping ---
[INFO] Changes detected - recompiling the module!
[INFO] Compiling 2 source files to <https://builds.apache.org/job/flink-snapshot-deployment/ws/dummy-lifecycle-mapping-plugin/target/classes>
[WARNING] <https://builds.apache.org/job/flink-snapshot-deployment/ws/dummy-lifecycle-mapping-plugin/target/generated-sources/plugin/org/eclipse/m2e/HelpMojo.java>:
<https://builds.apache.org/job/flink-snapshot-deployment/ws/dummy-lifecycle-mapping-plugin/target/generated-sources/plugin/org/eclipse/m2e/HelpMojo.java>
uses unchecked or unsafe operations.
[WARNING] <https://builds.apache.org/job/flink-snapshot-deployment/ws/dummy-lifecycle-mapping-plugin/target/generated-sources/plugin/org/eclipse/m2e/HelpMojo.java>:
Recompile with -Xlint:unchecked for details.
[INFO] 
[INFO] --- maven-plugin-plugin:2.5.1:descriptor (default-descriptor) @ lifecycle-mapping ---
[INFO] Using 'UTF-8' encoding to read mojo metadata.
[INFO] Applying mojo extractor for language: java
[INFO] Mojo extractor for language: java found 2 mojo descriptors.
[INFO] Applying mojo extractor for language: bsh
[INFO] Mojo extractor for language: bsh found 0 mojo descriptors.
[INFO] 
[INFO] --- maven-resources-plugin:2.6:testResources (default-testResources) @ lifecycle-mapping
---
[INFO] Using 'UTF-8' encoding to copy filtered resources.
[INFO] skip non existing resourceDirectory <https://builds.apache.org/job/flink-snapshot-deployment/ws/dummy-lifecycle-mapping-plugin/src/test/resources>
[INFO] 
[INFO] --- maven-compiler-plugin:3.1:testCompile (default-testCompile) @ lifecycle-mapping
---
[INFO] No sources to compile
[INFO] 
[INFO] --- maven-surefire-plugin:2.12.4:test (default-test) @ lifecycle-mapping ---
[INFO] No tests to run.
[INFO] 
[INFO] --- maven-jar-plugin:2.3.2:jar (default-jar) @ lifecycle-mapping ---
[INFO] Building jar: <https://builds.apache.org/job/flink-snapshot-deployment/ws/dummy-lifecycle-mapping-plugin/target/lifecycle-mapping-1.0.0.jar>
[INFO] 
[INFO] --- maven-plugin-plugin:2.5.1:addPluginArtifactMetadata (default-addPluginArtifactMetadata)
@ lifecycle-mapping ---
[INFO] 
[INFO] --- maven-install-plugin:2.4:install (default-install) @ lifecycle-mapping ---
[INFO] Installing <https://builds.apache.org/job/flink-snapshot-deployment/ws/dummy-lifecycle-mapping-plugin/target/lifecycle-mapping-1.0.0.jar>
to /home/jenkins/.m2/repository/org/eclipse/m2e/lifecycle-mapping/1.0.0/lifecycle-mapping-1.0.0.jar
[INFO] Installing <https://builds.apache.org/job/flink-snapshot-deployment/ws/dummy-lifecycle-mapping-plugin/pom.xml>
to /home/jenkins/.m2/repository/org/eclipse/m2e/lifecycle-mapping/1.0.0/lifecycle-mapping-1.0.0.pom
[INFO] ------------------------------------------------------------------------
[INFO] BUILD SUCCESS
[INFO] ------------------------------------------------------------------------
[INFO] Total time: 3.716 s
[INFO] Finished at: 2016-05-23T03:33:55+00:00
[INFO] Final Memory: 19M/557M
[INFO] ------------------------------------------------------------------------
detected current version as: '1.1-SNAPSHOT' ; hadoop1: 1.1-hadoop1-SNAPSHOT 
Generating poms for hadoop1
hadoop version hadoop1
Using pom.hadoop1.xml as name for the generated pom file.
[INFO] Scanning for projects...
[INFO] ------------------------------------------------------------------------
[INFO] Reactor Build Order:
[INFO] 
[INFO] force-shading
[INFO] flink
[INFO] flink-annotations
[INFO] flink-shaded-hadoop
[INFO] flink-shaded-hadoop1
[INFO] flink-shaded-curator
[INFO] flink-shaded-curator-recipes
[INFO] flink-shaded-curator-test
[INFO] flink-core
[INFO] flink-java
[INFO] flink-runtime
[INFO] flink-optimizer
[INFO] flink-clients
[INFO] flink-test-utils
[INFO] flink-scala
[INFO] flink-runtime-web
[INFO] flink-streaming-java
[INFO] flink-examples
[INFO] flink-examples-batch
[INFO] flink-contrib
[INFO] flink-statebackend-rocksdb
[INFO] flink-tests
[INFO] flink-streaming-scala
[INFO] flink-streaming-connectors
[INFO] flink-connector-flume
[INFO] flink-connector-kafka-base
[INFO] flink-connector-kafka-0.8
[INFO] flink-connector-kafka-0.9
[INFO] flink-connector-elasticsearch
[INFO] flink-connector-elasticsearch2
[INFO] flink-connector-rabbitmq
[INFO] flink-connector-twitter
[INFO] flink-connector-nifi
[INFO] flink-batch-connectors
[INFO] flink-avro
[INFO] flink-libraries
[INFO] flink-table
[INFO] flink-jdbc
[INFO] flink-hadoop-compatibility
[INFO] flink-hbase
[INFO] flink-hcatalog
[INFO] flink-examples-streaming
[INFO] flink-gelly
[INFO] flink-gelly-scala
[INFO] flink-gelly-examples
[INFO] flink-python
[INFO] flink-ml
[INFO] flink-cep
[INFO] flink-cep-scala
[INFO] flink-scala-shell
[INFO] flink-quickstart
[INFO] flink-quickstart-java
[INFO] flink-quickstart-scala
[INFO] flink-storm
[INFO] flink-storm-examples
[INFO] flink-streaming-contrib
[INFO] flink-tweet-inputformat
[INFO] flink-operator-stats
[INFO] flink-connector-wikiedits
[INFO] flink-dist
[INFO] flink-metric-reporters
[INFO] flink-metrics-dropwizard
[INFO] flink-metrics-ganglia
[INFO] flink-metrics-graphite
[INFO] flink-metrics-statsd
[INFO] flink-java8
[INFO]                                                                         
[INFO] ------------------------------------------------------------------------
[INFO] Building force-shading 1.1-SNAPSHOT
[INFO] ------------------------------------------------------------------------
[INFO] 
[INFO] --- maven-remote-resources-plugin:1.5:process (default) @ force-shading ---
[INFO] 
[INFO] --- maven-resources-plugin:2.6:resources (default-resources) @ force-shading ---
[INFO] Using 'UTF-8' encoding to copy filtered resources.
[INFO] skip non existing resourceDirectory <https://builds.apache.org/job/flink-snapshot-deployment/ws/tools/force-shading/src/main/resources>
[INFO] Copying 3 resources
[INFO] 
[INFO] --- maven-compiler-plugin:3.1:compile (default-compile) @ force-shading ---
[INFO] No sources to compile
[INFO] 
[INFO] --- maven-resources-plugin:2.6:testResources (default-testResources) @ force-shading
---
[INFO] Using 'UTF-8' encoding to copy filtered resources.
[INFO] skip non existing resourceDirectory <https://builds.apache.org/job/flink-snapshot-deployment/ws/tools/force-shading/src/test/resources>
[INFO] Copying 3 resources
[INFO] 
[INFO] --- maven-compiler-plugin:3.1:testCompile (default-testCompile) @ force-shading ---
[INFO] No sources to compile
[INFO] 
[INFO] --- maven-surefire-plugin:2.16:test (default-test) @ force-shading ---
[INFO] Tests are skipped.
[INFO] 
[INFO] --- maven-jar-plugin:2.4:jar (default-jar) @ force-shading ---
[INFO] Building jar: <https://builds.apache.org/job/flink-snapshot-deployment/ws/tools/force-shading/target/force-shading-1.1-SNAPSHOT.jar>
[INFO] 
[INFO] --- maven-site-plugin:3.3:attach-descriptor (attach-descriptor) @ force-shading ---
[INFO] 
[INFO] --- maven-install-plugin:2.5.1:install (default-install) @ force-shading ---
[INFO] Installing <https://builds.apache.org/job/flink-snapshot-deployment/ws/tools/force-shading/target/force-shading-1.1-SNAPSHOT.jar>
to /home/jenkins/.m2/repository/org/apache/flink/force-shading/1.1-SNAPSHOT/force-shading-1.1-SNAPSHOT.jar
[INFO] Installing <https://builds.apache.org/job/flink-snapshot-deployment/ws/tools/force-shading/pom.hadoop1.xml>
to /home/jenkins/.m2/repository/org/apache/flink/force-shading/1.1-SNAPSHOT/force-shading-1.1-SNAPSHOT.pom
[INFO] 
[INFO] --- maven-deploy-plugin:2.8.1:deploy (default-deploy) @ force-shading ---
[INFO] Downloading: https://repository.apache.org/content/repositories/snapshots/org/apache/flink/force-shading/1.1-SNAPSHOT/maven-metadata.xml
[INFO] Downloaded: https://repository.apache.org/content/repositories/snapshots/org/apache/flink/force-shading/1.1-SNAPSHOT/maven-metadata.xml
(779 B at 0.7 KB/sec)
[INFO] Uploading: https://repository.apache.org/content/repositories/snapshots/org/apache/flink/force-shading/1.1-SNAPSHOT/force-shading-1.1-20160523.033409-221.jar
[INFO] Uploading: https://repository.apache.org/content/repositories/snapshots/org/apache/flink/force-shading/1.1-SNAPSHOT/force-shading-1.1-20160523.033409-221.pom
[INFO] Uploaded: https://repository.apache.org/content/repositories/snapshots/org/apache/flink/force-shading/1.1-SNAPSHOT/force-shading-1.1-20160523.033409-221.pom
(4 KB at 0.1 KB/sec)
[INFO] ------------------------------------------------------------------------
[INFO] Reactor Summary:
[INFO] 
[INFO] force-shading ...................................... FAILURE [02:04 min]
[INFO] flink .............................................. SKIPPED
[INFO] flink-annotations .................................. SKIPPED
[INFO] flink-shaded-hadoop ................................ SKIPPED
[INFO] flink-shaded-hadoop1 ............................... SKIPPED
[INFO] flink-shaded-curator ............................... SKIPPED
[INFO] flink-shaded-curator-recipes ....................... SKIPPED
[INFO] flink-shaded-curator-test .......................... SKIPPED
[INFO] flink-core ......................................... SKIPPED
[INFO] flink-java ......................................... SKIPPED
[INFO] flink-runtime ...................................... SKIPPED
[INFO] flink-optimizer .................................... SKIPPED
[INFO] flink-clients ...................................... SKIPPED
[INFO] flink-test-utils ................................... SKIPPED
[INFO] flink-scala ........................................ SKIPPED
[INFO] flink-runtime-web .................................. SKIPPED
[INFO] flink-streaming-java ............................... SKIPPED
[INFO] flink-examples ..................................... SKIPPED
[INFO] flink-examples-batch ............................... SKIPPED
[INFO] flink-contrib ...................................... SKIPPED
[INFO] flink-statebackend-rocksdb ......................... SKIPPED
[INFO] flink-tests ........................................ SKIPPED
[INFO] flink-streaming-scala .............................. SKIPPED
[INFO] flink-streaming-connectors ......................... SKIPPED
[INFO] flink-connector-flume .............................. SKIPPED
[INFO] flink-connector-kafka-base ......................... SKIPPED
[INFO] flink-connector-kafka-0.8 .......................... SKIPPED
[INFO] flink-connector-kafka-0.9 .......................... SKIPPED
[INFO] flink-connector-elasticsearch ...................... SKIPPED
[INFO] flink-connector-elasticsearch2 ..................... SKIPPED
[INFO] flink-connector-rabbitmq ........................... SKIPPED
[INFO] flink-connector-twitter ............................ SKIPPED
[INFO] flink-connector-nifi ............................... SKIPPED
[INFO] flink-batch-connectors ............................. SKIPPED
[INFO] flink-avro ......................................... SKIPPED
[INFO] flink-libraries .................................... SKIPPED
[INFO] flink-table ........................................ SKIPPED
[INFO] flink-jdbc ......................................... SKIPPED
[INFO] flink-hadoop-compatibility ......................... SKIPPED
[INFO] flink-hbase ........................................ SKIPPED
[INFO] flink-hcatalog ..................................... SKIPPED
[INFO] flink-examples-streaming ........................... SKIPPED
[INFO] flink-gelly ........................................ SKIPPED
[INFO] flink-gelly-scala .................................. SKIPPED
[INFO] flink-gelly-examples ............................... SKIPPED
[INFO] flink-python ....................................... SKIPPED
[INFO] flink-ml ........................................... SKIPPED
[INFO] flink-cep .......................................... SKIPPED
[INFO] flink-cep-scala .................................... SKIPPED
[INFO] flink-scala-shell .................................. SKIPPED
[INFO] flink-quickstart ................................... SKIPPED
[INFO] flink-quickstart-java .............................. SKIPPED
[INFO] flink-quickstart-scala ............................. SKIPPED
[INFO] flink-storm ........................................ SKIPPED
[INFO] flink-storm-examples ............................... SKIPPED
[INFO] flink-streaming-contrib ............................ SKIPPED
[INFO] flink-tweet-inputformat ............................ SKIPPED
[INFO] flink-operator-stats ............................... SKIPPED
[INFO] flink-connector-wikiedits .......................... SKIPPED
[INFO] flink-dist ......................................... SKIPPED
[INFO] flink-metric-reporters ............................. SKIPPED
[INFO] flink-metrics-dropwizard ........................... SKIPPED
[INFO] flink-metrics-ganglia .............................. SKIPPED
[INFO] flink-metrics-graphite ............................. SKIPPED
[INFO] flink-metrics-statsd ............................... SKIPPED
[INFO] flink-java8 ........................................ SKIPPED
[INFO] ------------------------------------------------------------------------
[INFO] BUILD FAILURE
[INFO] ------------------------------------------------------------------------
[INFO] Total time: 02:06 min
[INFO] Finished at: 2016-05-23T03:36:09+00:00
[INFO] Final Memory: 37M/690M
[INFO] ------------------------------------------------------------------------
[ERROR] Failed to execute goal org.apache.maven.plugins:maven-deploy-plugin:2.8.1:deploy (default-deploy)
on project force-shading: Failed to deploy artifacts: Could not transfer artifact org.apache.flink:force-shading:jar:1.1-20160523.033409-221
from/to apache.snapshots.https (https://repository.apache.org/content/repositories/snapshots):
Failed to transfer file: https://repository.apache.org/content/repositories/snapshots/org/apache/flink/force-shading/1.1-SNAPSHOT/force-shading-1.1-20160523.033409-221.jar.
Return code is: 502, ReasonPhrase: Proxy Error. -> [Help 1]
[ERROR] 
[ERROR] To see the full stack trace of the errors, re-run Maven with the -e switch.
[ERROR] Re-run Maven using the -X switch to enable full debug logging.
[ERROR] 
[ERROR] For more information about the errors and possible solutions, please read the following
articles:
[ERROR] [Help 1] http://cwiki.apache.org/confluence/display/MAVEN/MojoExecutionException
Build step 'Execute shell' marked build as failure
Setting MAVEN_3_2_5_HOME=/home/jenkins/jenkins-slave/tools/hudson.tasks.Maven_MavenInstallation/maven-3.2.5

Mime
View raw message