flex-dev mailing list archives

Site index · List index
Message view « Date » · « Thread »
Top « Date » · « Thread »
From OmPrakash Muppirala <bigosma...@gmail.com>
Subject Re: Build failed in Jenkins: flex-asjs #193
Date Thu, 04 Sep 2014 18:30:31 GMT
Would you know if the VM has the browser in the correct path?
This is what is in the build.xml: "C:\Program Files\Internet
Explorer\iexplore.exe"

Thanks,
Om

On Thu, Sep 4, 2014 at 11:28 AM, OmPrakash Muppirala <bigosmallm@gmail.com>
wrote:

> On Thu, Sep 4, 2014 at 11:26 AM, Erik de Bruin <erik@ixsoftware.nl> wrote:
>
>> Om, did you perhaps kill the build? What did it do to you to deserve that?
>>
>>
> I did build locally before checking it in and it built fine.  It looks
> like a timeout issue, probably because of a hung browser?
>
>
> The following error occurred while executing this line:
> <
> http://apacheflexbuild.cloudapp.net:8080/job/flex-asjs/ws/frameworks/as/projects/FlexJSUI/tests/build.xml>:126:
> java.util.concurrent.
> ExecutionException: Socket timeout waiting for flexunit report
>
>
>
>> ;-)
>>
>> EdB
>>
>>
>>
>> On Thu, Sep 4, 2014 at 8:19 PM, <flex.ci.builds@gmail.com> wrote:
>>
>> > See <http://apacheflexbuild.cloudapp.net:8080/job/flex-asjs/193/changes
>> >
>> >
>> > Changes:
>> >
>> > [bigosmallm] Use addElement() instead of addChild()
>> >
>> > [bigosmallm] Fix formatting of style attribute + add fill-opacity
>> attribute
>> >
>> > ------------------------------------------
>> > [...truncated 139 lines...]
>> > air-config:
>> >      [copy] Copying 1 file to <
>> > http://apacheflexbuild.cloudapp.net:8080/job/flex-asjs/ws/frameworks>
>> >
>> > stage-source-no-scripts:
>> >
>> > clean-temp:
>> >      [copy] Copying 14 files to <
>> > http://apacheflexbuild.cloudapp.net:8080/job/flex-asjs/ws/temp>
>> >
>> > stage-framework-as:
>> >      [copy] Copying 372 files to <
>> >
>> http://apacheflexbuild.cloudapp.net:8080/job/flex-asjs/ws/temp/frameworks/as
>> > >
>> >      [echo] Updating config file air-config.xml with version
>> 0.0.3.20140904
>> >      [echo] Updating config file flex-config.xml with version
>> > 0.0.3.20140904
>> >
>> > stage-framework-js:
>> >      [copy] Copying 178 files to <
>> >
>> http://apacheflexbuild.cloudapp.net:8080/job/flex-asjs/ws/temp/frameworks/js/FlexJS/src
>> > >
>> >      [copy] Copying 2 files to <
>> >
>> http://apacheflexbuild.cloudapp.net:8080/job/flex-asjs/ws/temp/frameworks/js
>> > >
>> >      [copy] Copying 1 file to <
>> > http://apacheflexbuild.cloudapp.net:8080/job/flex-asjs/ws/temp/asdoc>
>> >      [copy] Copying 2 files to <
>> > http://apacheflexbuild.cloudapp.net:8080/job/flex-asjs/ws/temp/ide>
>> >      [copy] Copying 4 files to <
>> > http://apacheflexbuild.cloudapp.net:8080/job/flex-asjs/ws/temp/js/bin>
>> >      [copy] Copying 202 files to <
>> > http://apacheflexbuild.cloudapp.net:8080/job/flex-asjs/ws/temp/examples
>> >
>> >
>> > stage-source:
>> >
>> > stage-scripts:
>> >      [copy] Copying 4 files to <
>> > http://apacheflexbuild.cloudapp.net:8080/job/flex-asjs/ws/temp/scripts>
>> >
>> > source-package-zip:
>> >     [mkdir] Created dir: <
>> > http://apacheflexbuild.cloudapp.net:8080/job/flex-asjs/ws/out>
>> >       [zip] Building zip: <
>> >
>> http://apacheflexbuild.cloudapp.net:8080/job/flex-asjs/193/artifact/out/apache-flex-flexjs-0.0.3-src.zip
>> > >
>> >
>> > source-package-tgz:
>> >       [tar] Building tar: <
>> >
>> http://apacheflexbuild.cloudapp.net:8080/job/flex-asjs/193/artifact/out/apache-flex-flexjs-0.0.3-src.tar.gz
>> > >
>> >
>> > source-package:
>> >
>> > source-release:
>> >
>> > setup-binary-release:
>> >
>> > thirdparty-downloads:
>> >
>> > thirdparty-downloads:
>> >
>> > swfobject-check:
>> >
>> > swfobject-download:
>> >
>> > main:
>> >      [echo] Use thirdparty-clean or super-clean to remove these.
>> >
>> > thirdparty-downloads:
>> >
>> > prebuild:
>> >
>> > frameworks-as:
>> >
>> > check-compile-env:
>> >
>> > check-playerglobal-home:
>> >
>> > check-air-home:
>> >
>> > check-flex-home:
>> >
>> > check-falcon-home:
>> >
>> > check-falconjx-home:
>> >
>> > check-compile-env:
>> >      [echo] OS: Windows Server 2008 R2 / 6.1 / amd64
>> >      [echo] VM: Java HotSpot(TM) 64-Bit Server VM / 24.55-b03
>> >      [echo] Java: 1.7.0_55
>> >      [echo] Ant: Apache Ant(TM) version 1.9.3 compiled on December 23
>> 2013
>> > Ant Java Version: 1.7
>> >
>> > clean:
>> >
>> > clean:
>> >
>> > clean:
>> >
>> > thirdparty-downloads:
>> >
>> > swfobject-check:
>> >
>> > swfobject-download:
>> >
>> > main:
>> >      [echo] Use thirdparty-clean or super-clean to remove these.
>> >
>> > prepare:
>> >
>> > compile:
>> >
>> > flexjsui:
>> >
>> > clean:
>> >
>> > compile:
>> >      [echo] Compiling libs/FlexJSUI.swc
>> >      [echo] FLEX_HOME: C:\Jenkins\workspace\flex-sdk
>> >      [echo] FALCON_HOME:
>> > c:\Jenkins\workspace\flex-falcon\compiler\generated\dist\sdk
>> >     [compc] Loading configuration: <
>> >
>> http://apacheflexbuild.cloudapp.net:8080/job/flex-asjs/ws/frameworks/as/projects/FlexJSUI/compile-config.xml
>> > >
>> >     [compc]
>> >     [compc] 321371 bytes written to
>> > C:\Jenkins\workspace\flex-asjs\frameworks\as\libs\FlexJSUI.swc in 25.277
>> > seconds
>> >
>> > test:
>> > [available] DEPRECATED - <available> used to override an existing
>> property.
>> > [available]   Build file should not reuse the same property name for
>> > different values.
>> >
>> > clean:
>> >
>> > compile:
>> >      [echo] Compiling FlexUnitFlexJSApplication.swf
>> >      [echo] FLEX_HOME: C:\Jenkins\workspace\flex-sdk
>> >      [echo] FALCON_HOME:
>> > c:\Jenkins\workspace\flex-falcon\compiler\generated\dist\sdk
>> >      [echo] FLEXUNIT_HOME: C:\jenkins\workspace\flex-flexunit
>> >     [mxmlc] Loading configuration:
>> > C:\Jenkins\workspace\flex-sdk\frameworks\flex-config.xml
>> >     [mxmlc]
>> >     [mxmlc] 152830 bytes written to
>> >
>> C:\Jenkins\workspace\flex-asjs\frameworks\as\projects\FlexJSUI\tests\FlexUnitFlexJSApplication.swf
>> > in 16.355 seconds
>> >
>> > test:
>> >  [flexunit] Validating task attributes ...
>> >  [flexunit] Generating default values ...
>> >  [flexunit] Using the following settings for the test run:
>> >  [flexunit]     FLEX_HOME: [C:\Jenkins\workspace\flex-sdk]
>> >  [flexunit]     haltonfailure: [false]
>> >  [flexunit]     headless: [false]
>> >  [flexunit]     display: [99]
>> >  [flexunit]     localTrusted: [true]
>> >  [flexunit]     player: [flash]
>> >  [flexunit]     command: [C:\Program Files (x86)\Mozilla
>> > Firefox\firefox.exe]
>> >  [flexunit]     port: [1024]
>> >  [flexunit]     swf: [<
>> >
>> http://apacheflexbuild.cloudapp.net:8080/job/flex-asjs/ws/frameworks/as/projects/FlexJSUI/tests/FlexUnitFlexJSApplication.swf
>> > ]>
>> >  [flexunit]     timeout: [60000ms]
>> >  [flexunit]     toDir: [<
>> >
>> http://apacheflexbuild.cloudapp.net:8080/job/flex-asjs/ws/frameworks/as/projects/FlexJSUI/tests/out
>> > ]>
>> >  [flexunit] Setting up server process ...
>> >  [flexunit] Entry [<
>> >
>> http://apacheflexbuild.cloudapp.net:8080/job/flex-asjs/ws/frameworks/as/projects/FlexJSUI/tests
>> ]>
>> > already available in local trust file at
>> > [C:\Users\apacheflexbuild\AppData\Roaming\Macromedia\Flash
>> > Player\#Security\FlashPlayerTrust\flexUnit.cfg].
>> >  [flexunit] Executing 'C:\Program Files (x86)\Mozilla
>> Firefox\firefox.exe'
>> > with arguments:
>> >  [flexunit] '<
>> >
>> http://apacheflexbuild.cloudapp.net:8080/job/flex-asjs/ws/frameworks/as/projects/FlexJSUI/tests/FlexUnitFlexJSApplication.swf
>> > '>
>> >  [flexunit]
>> >  [flexunit] The ' characters around the executable and arguments are
>> >  [flexunit] not part of the command.
>> >  [flexunit]
>> >  [flexunit] Starting server ...
>> >  [flexunit] Opening server socket on port [1024].
>> >  [flexunit] Waiting for client connection ...
>> >  [flexunit]
>> >  [flexunit] Stopping server ...
>> >  [flexunit] End of test data reached, sending acknowledgement to player
>> ...
>> >  [flexunit] Closing client connection ...
>> >  [flexunit] Closing server on port [1024] ...
>> >
>> > BUILD FAILED
>> > <http://apacheflexbuild.cloudapp.net:8080/job/flex-asjs/ws/build.xml
>> >:399:
>> > The following error occurred while executing this line:
>> > <
>> >
>> http://apacheflexbuild.cloudapp.net:8080/job/flex-asjs/ws/frameworks/as/build.xml
>> >:78:
>> > The following error occurred while executing this line:
>> > <
>> >
>> http://apacheflexbuild.cloudapp.net:8080/job/flex-asjs/ws/frameworks/as/build.xml
>> >:129:
>> > The following error occurred while executing this line:
>> > <
>> >
>> http://apacheflexbuild.cloudapp.net:8080/job/flex-asjs/ws/frameworks/as/projects/FlexJSUI/build.xml
>> >:35:
>> > The following error occurred while executing this line:
>> > <
>> >
>> http://apacheflexbuild.cloudapp.net:8080/job/flex-asjs/ws/frameworks/as/projects/FlexJSUI/tests/build.xml
>> >:126:
>> > java.util.concurrent.ExecutionException: Socket timeout waiting for
>> > flexunit report
>> >         at java.util.concurrent.FutureTask.report(FutureTask.java:122)
>> >         at java.util.concurrent.FutureTask.get(FutureTask.java:188)
>> >         at org.flexunit.ant.tasks.TestRun.run(Unknown Source)
>> >         at org.flexunit.ant.tasks.FlexUnitTask.execute(Unknown Source)
>> >         at
>> > org.apache.tools.ant.UnknownElement.execute(UnknownElement.java:292)
>> >         at sun.reflect.GeneratedMethodAccessor4.invoke(Unknown Source)
>> >         at
>> >
>> sun.reflect.DelegatingMethodAccessorImpl.invoke(DelegatingMethodAccessorImpl.java:43)
>> >         at java.lang.reflect.Method.invoke(Method.java:606)
>> >         at
>> >
>> org.apache.tools.ant.dispatch.DispatchUtils.execute(DispatchUtils.java:106)
>> >         at org.apache.tools.ant.Task.perform(Task.java:348)
>> >         at org.apache.tools.ant.Target.execute(Target.java:435)
>> >         at org.apache.tools.ant.Target.performTasks(Target.java:456)
>> >         at
>> > org.apache.tools.ant.Project.executeSortedTargets(Project.java:1393)
>> >         at
>> >
>> org.apache.tools.ant.helper.SingleCheckExecutor.executeTargets(SingleCheckExecutor.java:38)
>> >         at
>> org.apache.tools.ant.Project.executeTargets(Project.java:1248)
>> >         at org.apache.tools.ant.taskdefs.Ant.execute(Ant.java:440)
>> >         at
>> > org.apache.tools.ant.UnknownElement.execute(UnknownElement.java:292)
>> >         at sun.reflect.GeneratedMethodAccessor4.invoke(Unknown Source)
>> >         at
>> >
>> sun.reflect.DelegatingMethodAccessorImpl.invoke(DelegatingMethodAccessorImpl.java:43)
>> >         at java.lang.reflect.Method.invoke(Method.java:606)
>> >         at
>> >
>> org.apache.tools.ant.dispatch.DispatchUtils.execute(DispatchUtils.java:106)
>> >         at org.apache.tools.ant.Task.perform(Task.java:348)
>> >         at org.apache.tools.ant.Target.execute(Target.java:435)
>> >         at org.apache.tools.ant.Target.performTasks(Target.java:456)
>> >         at
>> > org.apache.tools.ant.Project.executeSortedTargets(Project.java:1393)
>> >         at
>> >
>> org.apache.tools.ant.helper.SingleCheckExecutor.executeTargets(SingleCheckExecutor.java:38)
>> >         at
>> org.apache.tools.ant.Project.executeTargets(Project.java:1248)
>> >         at org.apache.tools.ant.taskdefs.Ant.execute(Ant.java:440)
>> >         at
>> > org.apache.tools.ant.UnknownElement.execute(UnknownElement.java:292)
>> >         at sun.reflect.GeneratedMethodAccessor4.invoke(Unknown Source)
>> >         at
>> >
>> sun.reflect.DelegatingMethodAccessorImpl.invoke(DelegatingMethodAccessorImpl.java:43)
>> >         at java.lang.reflect.Method.invoke(Method.java:606)
>> >         at
>> >
>> org.apache.tools.ant.dispatch.DispatchUtils.execute(DispatchUtils.java:106)
>> >         at org.apache.tools.ant.Task.perform(Task.java:348)
>> >         at org.apache.tools.ant.Target.execute(Target.java:435)
>> >         at org.apache.tools.ant.Target.performTasks(Target.java:456)
>> >         at
>> > org.apache.tools.ant.Project.executeSortedTargets(Project.java:1393)
>> >         at
>> >
>> org.apache.tools.ant.helper.SingleCheckExecutor.executeTargets(SingleCheckExecutor.java:38)
>> >         at
>> org.apache.tools.ant.Project.executeTargets(Project.java:1248)
>> >         at org.apache.tools.ant.taskdefs.Ant.execute(Ant.java:440)
>> >         at
>> > org.apache.tools.ant.taskdefs.CallTarget.execute(CallTarget.java:105)
>> >         at
>> > org.apache.tools.ant.UnknownElement.execute(UnknownElement.java:292)
>> >         at sun.reflect.GeneratedMethodAccessor4.invoke(Unknown Source)
>> >         at
>> >
>> sun.reflect.DelegatingMethodAccessorImpl.invoke(DelegatingMethodAccessorImpl.java:43)
>> >         at java.lang.reflect.Method.invoke(Method.java:606)
>> >         at
>> >
>> org.apache.tools.ant.dispatch.DispatchUtils.execute(DispatchUtils.java:106)
>> >         at org.apache.tools.ant.Task.perform(Task.java:348)
>> >         at org.apache.tools.ant.Target.execute(Target.java:435)
>> >         at org.apache.tools.ant.Target.performTasks(Target.java:456)
>> >         at
>> > org.apache.tools.ant.Project.executeSortedTargets(Project.java:1393)
>> >         at
>> >
>> org.apache.tools.ant.helper.SingleCheckExecutor.executeTargets(SingleCheckExecutor.java:38)
>> >         at
>> org.apache.tools.ant.Project.executeTargets(Project.java:1248)
>> >         at org.apache.tools.ant.taskdefs.Ant.execute(Ant.java:440)
>> >         at
>> > org.apache.tools.ant.UnknownElement.execute(UnknownElement.java:292)
>> >         at sun.reflect.GeneratedMethodAccessor4.invoke(Unknown Source)
>> >         at
>> >
>> sun.reflect.DelegatingMethodAccessorImpl.invoke(DelegatingMethodAccessorImpl.java:43)
>> >         at java.lang.reflect.Method.invoke(Method.java:606)
>> >         at
>> >
>> org.apache.tools.ant.dispatch.DispatchUtils.execute(DispatchUtils.java:106)
>> >         at org.apache.tools.ant.Task.perform(Task.java:348)
>> >         at org.apache.tools.ant.Target.execute(Target.java:435)
>> >         at org.apache.tools.ant.Target.performTasks(Target.java:456)
>> >         at
>> > org.apache.tools.ant.Project.executeSortedTargets(Project.java:1393)
>> >         at org.apache.tools.ant.Project.executeTarget(Project.java:1364)
>> >         at
>> >
>> org.apache.tools.ant.helper.DefaultExecutor.executeTargets(DefaultExecutor.java:41)
>> >         at
>> org.apache.tools.ant.Project.executeTargets(Project.java:1248)
>> >         at org.apache.tools.ant.Main.runBuild(Main.java:851)
>> >         at org.apache.tools.ant.Main.startAnt(Main.java:235)
>> >         at org.apache.tools.ant.launch.Launcher.run(Launcher.java:280)
>> >         at org.apache.tools.ant.launch.Launcher.main(Launcher.java:109)
>> > Caused by: Socket timeout waiting for flexunit report
>> >         at org.flexunit.ant.FlexUnitSocketServer.start(Unknown Source)
>> >         at org.flexunit.ant.FlexUnitSocketThread.call(Unknown Source)
>> >         at java.util.concurrent.FutureTask.run(FutureTask.java:262)
>> >         at
>> >
>> java.util.concurrent.ThreadPoolExecutor.runWorker(ThreadPoolExecutor.java:1145)
>> >         at
>> >
>> java.util.concurrent.ThreadPoolExecutor$Worker.run(ThreadPoolExecutor.java:615)
>> >         at java.lang.Thread.run(Thread.java:745)
>> > Caused by: java.net.SocketTimeoutException: Accept timed out
>> >         at java.net.DualStackPlainSocketImpl.waitForNewConnection(Native
>> > Method)
>> >         at
>> >
>> java.net.DualStackPlainSocketImpl.socketAccept(DualStackPlainSocketImpl.java:135)
>> >         at
>> >
>> java.net.AbstractPlainSocketImpl.accept(AbstractPlainSocketImpl.java:398)
>> >         at java.net.PlainSocketImpl.accept(PlainSocketImpl.java:198)
>> >         at java.net.ServerSocket.implAccept(ServerSocket.java:530)
>> >         at java.net.ServerSocket.accept(ServerSocket.java:498)
>> >         at
>> org.flexunit.ant.FlexUnitSocketServer.openClientSocket(Unknown
>> > Source)
>> >         ... 6 more
>> >
>> > Total time: 1 minute 59 seconds
>> > Build step 'Invoke Ant' marked build as failure
>> > Archiving artifacts
>> > No JDK named ‘(Default)’ found
>> > No JDK named ‘(Default)’ found
>> >
>>
>>
>>
>> --
>> Ix Multimedia Software
>>
>> Jan Luykenstraat 27
>> 3521 VB Utrecht
>>
>> T. 06-51952295
>> I. www.ixsoftware.nl
>>
>
>

Mime
  • Unnamed multipart/alternative (inline, None, 0 bytes)
View raw message