flex-dev mailing list archives

Site index · List index
Message view « Date » · « Thread »
Top « Date » · « Thread »
From Erik de Bruin <e...@ixsoftware.nl>
Subject Re: Build failed in Jenkins: flex-sdk_release #542
Date Tue, 01 Apr 2014 13:25:25 GMT
Well, OK then. The tinkering of INFRA seems to have solved most of the
problems with the builds on the CI machine. Only the 'release' job fails,
and that seems related to the checkintests, NOT something git/Jenkins...

Anyone have any idea what's up with this?

EdB




On Tue, Apr 1, 2014 at 3:15 PM, Apache Jenkins Server <
jenkins@builds.apache.org> wrote:

> See <https://builds.apache.org/job/flex-sdk_release/542/>
>
> ------------------------------------------
> [...truncated 2319 lines...]
> create-config-files:
>      [copy] Copying 3 files to <
> https://builds.apache.org/job/flex-sdk_release/ws/ide\flashbuilder\config>
>
> expand-config-tokens:
>      [echo] expanding {airHome} and {playerglobalHome} tokens
>
> main:
>
> post-build:
>
> main:
>      [echo] ant main target completed on 04/01/2014 02:12:23 PM
>
> frameworks-rsls:
>      [echo] build.number is 20140401
>     [unzip] Expanding: <
> https://builds.apache.org/job/flex-sdk_release/ws/frameworks\libs\textLayout.swc>
> into <https://builds.apache.org/job/flex-sdk_release/ws/frameworks\rsls>
>      [java] Loading configuration file
> F:\hudson\hudson-slave\workspace\flex-sdk_release\frameworks\flex-config.xml
>      [java] <
> https://builds.apache.org/job/flex-sdk_release/ws/frameworks/rsls/library.swf>
> (492215 bytes)
>      [java] <
> https://builds.apache.org/job/flex-sdk_release/ws/frameworks/rsls/textLayout_4.13.0.20140401.swf>
> (342337 bytes)
>    [delete] Deleting: <
> https://builds.apache.org/job/flex-sdk_release/ws/frameworks\rsls\library.swf
> >
>      [java] Digest information was updated in
> F:\hudson\hudson-slave\workspace\flex-sdk_release\frameworks\libs\textLayout.swc
>     [unzip] Expanding: <
> https://builds.apache.org/job/flex-sdk_release/ws/frameworks\libs\framework.swc>
> into <https://builds.apache.org/job/flex-sdk_release/ws/frameworks\rsls>
>      [java] Loading configuration file
> F:\hudson\hudson-slave\workspace\flex-sdk_release\frameworks\flex-config.xml
>      [java] <
> https://builds.apache.org/job/flex-sdk_release/ws/frameworks/rsls/library.swf>
> (798926 bytes)
>      [java] <
> https://builds.apache.org/job/flex-sdk_release/ws/frameworks/rsls/framework_4.13.0.20140401.swf>
> (559398 bytes)
>    [delete] Deleting: <
> https://builds.apache.org/job/flex-sdk_release/ws/frameworks\rsls\library.swf
> >
>      [java] Digest information was updated in
> F:\hudson\hudson-slave\workspace\flex-sdk_release\frameworks\libs\framework.swc
>     [unzip] Expanding: <
> https://builds.apache.org/job/flex-sdk_release/ws/frameworks\libs\mx\mx.swc>
> into <https://builds.apache.org/job/flex-sdk_release/ws/frameworks\rsls>
>      [java] Loading configuration file
> F:\hudson\hudson-slave\workspace\flex-sdk_release\frameworks\flex-config.xml
>      [java] <
> https://builds.apache.org/job/flex-sdk_release/ws/frameworks/rsls/library.swf>
> (811581 bytes)
>      [java] <
> https://builds.apache.org/job/flex-sdk_release/ws/frameworks/rsls/mx_4.13.0.20140401.swf>
> (529810 bytes)
>    [delete] Deleting: <
> https://builds.apache.org/job/flex-sdk_release/ws/frameworks\rsls\library.swf
> >
>      [java] Digest information was updated in
> F:\hudson\hudson-slave\workspace\flex-sdk_release\frameworks\libs\mx\mx.swc
>     [unzip] Expanding: <
> https://builds.apache.org/job/flex-sdk_release/ws/frameworks\libs\rpc.swc>
> into <https://builds.apache.org/job/flex-sdk_release/ws/frameworks\rsls>
>      [java] Loading configuration file
> F:\hudson\hudson-slave\workspace\flex-sdk_release\frameworks\flex-config.xml
>      [java] <
> https://builds.apache.org/job/flex-sdk_release/ws/frameworks/rsls/library.swf>
> (299676 bytes)
>      [java] <
> https://builds.apache.org/job/flex-sdk_release/ws/frameworks/rsls/rpc_4.13.0.20140401.swf>
> (209050 bytes)
>    [delete] Deleting: <
> https://builds.apache.org/job/flex-sdk_release/ws/frameworks\rsls\library.swf
> >
>      [java] Digest information was updated in
> F:\hudson\hudson-slave\workspace\flex-sdk_release\frameworks\libs\rpc.swc
>     [unzip] Expanding: <
> https://builds.apache.org/job/flex-sdk_release/ws/frameworks\libs\spark.swc>
> into <https://builds.apache.org/job/flex-sdk_release/ws/frameworks\rsls>
>      [java] Loading configuration file
> F:\hudson\hudson-slave\workspace\flex-sdk_release\frameworks\flex-config.xml
>      [java] <
> https://builds.apache.org/job/flex-sdk_release/ws/frameworks/rsls/library.swf>
> (1273991 bytes)
>      [java] <
> https://builds.apache.org/job/flex-sdk_release/ws/frameworks/rsls/spark_4.13.0.20140401.swf>
> (837704 bytes)
>    [delete] Deleting: <
> https://builds.apache.org/job/flex-sdk_release/ws/frameworks\rsls\library.swf
> >
>      [java] Digest information was updated in
> F:\hudson\hudson-slave\workspace\flex-sdk_release\frameworks\libs\spark.swc
>     [unzip] Expanding: <
> https://builds.apache.org/job/flex-sdk_release/ws/frameworks\libs\sparkskins.swc>
> into <https://builds.apache.org/job/flex-sdk_release/ws/frameworks\rsls>
>      [java] Loading configuration file
> F:\hudson\hudson-slave\workspace\flex-sdk_release\frameworks\flex-config.xml
>      [java] <
> https://builds.apache.org/job/flex-sdk_release/ws/frameworks/rsls/library.swf>
> (110595 bytes)
>      [java] <
> https://builds.apache.org/job/flex-sdk_release/ws/frameworks/rsls/sparkskins_4.13.0.20140401.swf>
> (68893 bytes)
>    [delete] Deleting: <
> https://builds.apache.org/job/flex-sdk_release/ws/frameworks\rsls\library.swf
> >
>      [java] Digest information was updated in
> F:\hudson\hudson-slave\workspace\flex-sdk_release\frameworks\libs\sparkskins.swc
>     [unzip] Expanding: <
> https://builds.apache.org/job/flex-sdk_release/ws/frameworks\libs\charts.swc>
> into <https://builds.apache.org/job/flex-sdk_release/ws/frameworks\rsls>
>      [java] Loading configuration file
> F:\hudson\hudson-slave\workspace\flex-sdk_release\frameworks\flex-config.xml
>      [java] <
> https://builds.apache.org/job/flex-sdk_release/ws/frameworks/rsls/library.swf>
> (381496 bytes)
>      [java] <
> https://builds.apache.org/job/flex-sdk_release/ws/frameworks/rsls/charts_4.13.0.20140401.swf>
> (255421 bytes)
>    [delete] Deleting: <
> https://builds.apache.org/job/flex-sdk_release/ws/frameworks\rsls\library.swf
> >
>      [java] Digest information was updated in
> F:\hudson\hudson-slave\workspace\flex-sdk_release\frameworks\libs\charts.swc
>     [unzip] Expanding: <
> https://builds.apache.org/job/flex-sdk_release/ws/frameworks\libs\advancedgrids.swc>
> into <https://builds.apache.org/job/flex-sdk_release/ws/frameworks\rsls>
>      [java] Loading configuration file
> F:\hudson\hudson-slave\workspace\flex-sdk_release\frameworks\flex-config.xml
>      [java] <
> https://builds.apache.org/job/flex-sdk_release/ws/frameworks/rsls/library.swf>
> (342428 bytes)
>      [java] <
> https://builds.apache.org/job/flex-sdk_release/ws/frameworks/rsls/advancedgrids_4.13.0.20140401.swf>
> (245901 bytes)
>    [delete] Deleting: <
> https://builds.apache.org/job/flex-sdk_release/ws/frameworks\rsls\library.swf
> >
>      [java] Digest information was updated in
> F:\hudson\hudson-slave\workspace\flex-sdk_release\frameworks\libs\advancedgrids.swc
>     [unzip] Expanding: <
> https://builds.apache.org/job/flex-sdk_release/ws/frameworks\libs\spark_dmv.swc>
> into <https://builds.apache.org/job/flex-sdk_release/ws/frameworks\rsls>
>      [java] Loading configuration file
> F:\hudson\hudson-slave\workspace\flex-sdk_release\frameworks\flex-config.xml
>      [java] <
> https://builds.apache.org/job/flex-sdk_release/ws/frameworks/rsls/library.swf>
> (7287 bytes)
>      [java] <
> https://builds.apache.org/job/flex-sdk_release/ws/frameworks/rsls/spark_dmv_4.13.0.20140401.swf>
> (6046 bytes)
>    [delete] Deleting: <
> https://builds.apache.org/job/flex-sdk_release/ws/frameworks\rsls\library.swf
> >
>      [java] Digest information was updated in
> F:\hudson\hudson-slave\workspace\flex-sdk_release\frameworks\libs\spark_dmv.swc
>     [unzip] Expanding: <
> https://builds.apache.org/job/flex-sdk_release/ws/frameworks\libs\apache.swc>
> into <https://builds.apache.org/job/flex-sdk_release/ws/frameworks\rsls>
>      [java] Loading configuration file
> F:\hudson\hudson-slave\workspace\flex-sdk_release\frameworks\flex-config.xml
>      [java] <
> https://builds.apache.org/job/flex-sdk_release/ws/frameworks/rsls/library.swf>
> (14202 bytes)
>      [java] <
> https://builds.apache.org/job/flex-sdk_release/ws/frameworks/rsls/apache_4.13.0.20140401.swf>
> (11159 bytes)
>    [delete] Deleting: <
> https://builds.apache.org/job/flex-sdk_release/ws/frameworks\rsls\library.swf
> >
>      [java] Digest information was updated in
> F:\hudson\hudson-slave\workspace\flex-sdk_release\frameworks\libs\apache.swc
>     [unzip] Expanding: <
> https://builds.apache.org/job/flex-sdk_release/ws/frameworks\libs\experimental.swc>
> into <https://builds.apache.org/job/flex-sdk_release/ws/frameworks\rsls>
>      [java] Loading configuration file
> F:\hudson\hudson-slave\workspace\flex-sdk_release\frameworks\flex-config.xml
>      [java] <
> https://builds.apache.org/job/flex-sdk_release/ws/frameworks/rsls/library.swf>
> (183631 bytes)
>      [java] <
> https://builds.apache.org/job/flex-sdk_release/ws/frameworks/rsls/experimental_4.13.0.20140401.swf>
> (122279 bytes)
>    [delete] Deleting: <
> https://builds.apache.org/job/flex-sdk_release/ws/frameworks\rsls\library.swf
> >
>      [java] Digest information was updated in
> F:\hudson\hudson-slave\workspace\flex-sdk_release\frameworks\libs\experimental.swc
>     [unzip] Expanding: <
> https://builds.apache.org/job/flex-sdk_release/ws/frameworks\libs\experimental_mobile.swc>
> into <https://builds.apache.org/job/flex-sdk_release/ws/frameworks\rsls>
>      [java] Loading configuration file
> F:\hudson\hudson-slave\workspace\flex-sdk_release\frameworks\flex-config.xml
>      [java] <
> https://builds.apache.org/job/flex-sdk_release/ws/frameworks/rsls/library.swf>
> (22741 bytes)
>      [java] <
> https://builds.apache.org/job/flex-sdk_release/ws/frameworks/rsls/experimental_mobile_4.13.0.20140401.swf>
> (17103 bytes)
>    [delete] Deleting: <
> https://builds.apache.org/job/flex-sdk_release/ws/frameworks\rsls\library.swf
> >
>      [java] Digest information was updated in
> F:\hudson\hudson-slave\workspace\flex-sdk_release\frameworks\libs\experimental_mobile.swc
>
> sample-themes:
>
> clean:
>
> compile:
>      [echo] Compiling samples/themes/arcade/arcade.swc
>     [mxmlc] Loading configuration file
> F:\hudson\hudson-slave\workspace\flex-sdk_release\frameworks\flex-config.xml
>     [mxmlc]
> F:\hudson\hudson-slave\workspace\flex-sdk_release\samples\themes\arcade\src\assets\flex_skins.swf
> (35365 bytes)
>     [compc] Loading configuration file
> F:\hudson\hudson-slave\workspace\flex-sdk_release\frameworks\flex-config.xml
>     [compc]
> F:\hudson\hudson-slave\workspace\flex-sdk_release\samples\themes\arcade\arcade.swc
> (167467 bytes)
>
> main:
>
> clean:
>
> compile:
>      [echo] Compiling samples/themes/cobalt/cobalt.swc
>     [compc] <
> https://builds.apache.org/job/flex-sdk_release/ws/samples\themes\cobalt\build.xml>:67:
> java.io.IOException: Cannot run program
> "f:\hudson\tools\java\latest-1.6-64\jre\bin\java.exe" (in directory "<
> https://builds.apache.org/job/flex-sdk_release/ws/samples\themes\cobalt")>:
> CreateProcess error=87, The parameter is incorrect
>     [compc]     at org.apache.tools.ant.taskdefs.Java.fork(Java.java:798)
>     [compc]     at
> org.apache.tools.ant.taskdefs.Java.executeJava(Java.java:214)
>     [compc]     at
> org.apache.tools.ant.taskdefs.Java.executeJava(Java.java:135)
>     [compc]     at flex.ant.FlexTask.executeOutOfProcess(FlexTask.java:260)
>     [compc]     at flex.ant.FlexTask.execute(FlexTask.java:238)
>     [compc]     at
> org.apache.tools.ant.UnknownElement.execute(UnknownElement.java:291)
>     [compc]     at sun.reflect.GeneratedMethodAccessor4.invoke(Unknown
> Source)
>     [compc]     at
> sun.reflect.DelegatingMethodAccessorImpl.invoke(DelegatingMethodAccessorImpl.java:25)
>     [compc]     at java.lang.reflect.Method.invoke(Method.java:597)
>     [compc]     at
> org.apache.tools.ant.dispatch.DispatchUtils.execute(DispatchUtils.java:106)
>     [compc]     at org.apache.tools.ant.Task.perform(Task.java:348)
>     [compc]     at org.apache.tools.ant.Target.execute(Target.java:390)
>     [compc]     at
> org.apache.tools.ant.Target.performTasks(Target.java:411)
>     [compc]     at
> org.apache.tools.ant.Project.executeSortedTargets(Project.java:1399)
>     [compc]     at
> org.apache.tools.ant.helper.SingleCheckExecutor.executeTargets(SingleCheckExecutor.java:38)
>     [compc]     at
> org.apache.tools.ant.Project.executeTargets(Project.java:1251)
>     [compc]     at org.apache.tools.ant.taskdefs.Ant.execute(Ant.java:442)
>     [compc]     at
> org.apache.tools.ant.UnknownElement.execute(UnknownElement.java:291)
>     [compc]     at sun.reflect.GeneratedMethodAccessor4.invoke(Unknown
> Source)
>     [compc]     at
> sun.reflect.DelegatingMethodAccessorImpl.invoke(DelegatingMethodAccessorImpl.java:25)
>     [compc]     at java.lang.reflect.Method.invoke(Method.java:597)
>     [compc]     at
> org.apache.tools.ant.dispatch.DispatchUtils.execute(DispatchUtils.java:106)
>     [compc]     at org.apache.tools.ant.Task.perform(Task.java:348)
>     [compc]     at org.apache.tools.ant.Target.execute(Target.java:390)
>     [compc]     at
> org.apache.tools.ant.Target.performTasks(Target.java:411)
>     [compc]     at
> org.apache.tools.ant.Project.executeSortedTargets(Project.java:1399)
>     [compc]     at
> org.apache.tools.ant.Project.executeTarget(Project.java:1368)
>     [compc]     at
> org.apache.tools.ant.helper.DefaultExecutor.executeTargets(DefaultExecutor.java:41)
>     [compc]     at
> org.apache.tools.ant.Project.executeTargets(Project.java:1251)
>     [compc]     at org.apache.tools.ant.Main.runBuild(Main.java:809)
>     [compc]     at org.apache.tools.ant.Main.startAnt(Main.java:217)
>     [compc]     at
> org.apache.tools.ant.launch.Launcher.run(Launcher.java:280)
>     [compc]     at
> org.apache.tools.ant.launch.Launcher.main(Launcher.java:109)
>     [compc] Caused by: java.io.IOException: Cannot run program
> "f:\hudson\tools\java\latest-1.6-64\jre\bin\java.exe" (in directory "<
> https://builds.apache.org/job/flex-sdk_release/ws/samples\themes\cobalt")>:
> CreateProcess error=87, The parameter is incorrect
>     [compc]     at java.lang.ProcessBuilder.start(ProcessBuilder.java:460)
>     [compc]     at java.lang.Runtime.exec(Runtime.java:593)
>     [compc]     at
> org.apache.tools.ant.taskdefs.Execute$Java13CommandLauncher.exec(Execute.java:862)
>     [compc]     at
> org.apache.tools.ant.taskdefs.Execute.launch(Execute.java:481)
>     [compc]     at
> org.apache.tools.ant.taskdefs.Execute.execute(Execute.java:495)
>     [compc]     at org.apache.tools.ant.taskdefs.Java.fork(Java.java:791)
>     [compc]     ... 32 more
>     [compc] Caused by: java.io.IOException: CreateProcess error=87, The
> parameter is incorrect
>     [compc]     at java.lang.ProcessImpl.create(Native Method)
>     [compc]     at java.lang.ProcessImpl.<init>(ProcessImpl.java:81)
>     [compc]     at java.lang.ProcessImpl.start(ProcessImpl.java:30)
>     [compc]     at java.lang.ProcessBuilder.start(ProcessBuilder.java:453)
>     [compc]     ... 37 more
>
> main:
>
> clean:
>
> compile:
>      [echo] Compiling samples/themes/graphite/graphite.swc
>     [mxmlc] Loading configuration file
> F:\hudson\hudson-slave\workspace\flex-sdk_release\frameworks\flex-config.xml
>     [mxmlc]
> F:\hudson\hudson-slave\workspace\flex-sdk_release\samples\themes\graphite\src\assets\flex_skins.swf
> (482206 bytes)
>     [compc] Loading configuration file
> F:\hudson\hudson-slave\workspace\flex-sdk_release\frameworks\flex-config.xml
>     [compc]
> F:\hudson\hudson-slave\workspace\flex-sdk_release\samples\themes\graphite\graphite.swc
> (653456 bytes)
>
> main:
>
> runtime-setup:
>
> mustella-setup:
>  [loadfile] <
> https://builds.apache.org/job/flex-sdk_release/ws/mustella\local.properties>
> doesn't exist
>
> echo-info:
>      [echo]     JAVA_HOME:               f:\hudson\tools\java\latest-1.6-64
>      [echo]     FLASHPLAYER_DEBUGGER:    C:/Program Files
> (x86)/Adobe/flashplayer_11_sa_debug_32bit.exe
>      [echo]     sdk.dir:                 <
> https://builds.apache.org/job/flex-sdk_release/ws/mustella/..>
>      [echo]     mustella exclude file:
> f:/hudson/hudson-slave/workspace/flex-sdk_release/mustella/tests/ExcludeListWin.txt
>
> get_date:
>
> get_os:
>
> setup_mac:
>
> setup_windows:
>      [echo] doing windows setup
>      [echo] homepath: C:\Users\hudson
>      [echo] trace output file: 1
>      [echo]  player is C:/Program Files
> (x86)/Adobe/flashplayer_11_sa_debug_32bit.exe
>
> setup_linux:
>
> db_time:
>     [mkdir] Created dir: <
> https://builds.apache.org/job/flex-sdk_release/ws/mustella\tmp>
>      [echo] db_time=2014/04/01 14:13:47
>
> get_mobile_data:
>
> device_fail:
>
> handle_mobile_config:
>
> echo-browser:
>
> echo-apollo:
>
> setup:
>      [echo] player is C:/Program Files
> (x86)/Adobe/flashplayer_11_sa_debug_32bit.exe
>      [echo] fileset:
>
> makemustellaswc:
>  [loadfile] <
> https://builds.apache.org/job/flex-sdk_release/ws/mustella\local.properties>
> doesn't exist
>
> compilemustellaswc:
>      [exec] Loading configuration file
> F:\hudson\hudson-slave\workspace\flex-sdk_release\frameworks\flex-config.xml
>      [exec]
> F:\hudson\hudson-slave\workspace\flex-sdk_release\mustella\mustella.swc
> (94819 bytes)
>     [javac] <https://builds.apache.org/job/flex-sdk_release/ws/build.xml>:1445:
> warning: 'includeantruntime' was not set, defaulting to
> build.sysclasspath=last; set to false for repeatable builds
>     [javac] Compiling 1 source file
>
> load-task:
>
> basictests:
>     [mxmlc] Loading configuration file
> F:\hudson\hudson-slave\workspace\flex-sdk_release\frameworks\flex-config.xml
>     [mxmlc] Loading configuration file
> F:\hudson\hudson-slave\workspace\flex-sdk_release\frameworks\tests\basicTests\BasicTests-config.xml
>     [mxmlc]
> F:\hudson\hudson-slave\workspace\flex-sdk_release\frameworks\tests\basicTests\BasicTests.swf
> (3755113 bytes)
>     [mxmlc] Loading configuration file
> F:\hudson\hudson-slave\workspace\flex-sdk_release\frameworks\flex-config.xml
>     [mxmlc]
> F:\hudson\hudson-slave\workspace\flex-sdk_release\frameworks\tests\basicTests\basicLoader.swf
> (959 bytes)
>     [mxmlc] Loading configuration file
> F:\hudson\hudson-slave\workspace\flex-sdk_release\frameworks\flex-config.xml
>     [mxmlc]
> F:\hudson\hudson-slave\workspace\flex-sdk_release\frameworks\tests\basicTests\spark\views\StyleManagerModuleTest.swf
> (526507 bytes)
>     [mxmlc] Loading configuration file
> F:\hudson\hudson-slave\workspace\flex-sdk_release\frameworks\flex-config.xml
>     [mxmlc] Required RSLs:
>     [mxmlc]     framework_20140401.swf
>     [mxmlc]     textLayout_20140401.swf
>     [mxmlc]     spark_20140401.swf
>     [mxmlc]     osmf_20140401.swf
>     [mxmlc]
> F:\hudson\hudson-slave\workspace\flex-sdk_release\frameworks\tests\basicTests\spark\views\HelloWorld.swf
> (50544 bytes)
>      [echo] launching player and swf
>
> mustellaresultsparser:
>      [java] Unexpected Trace:  width: 804  height:  566  diag:
> 983.2456458078012
>      [java] results: FAILED
>
> BUILD FAILED
> <https://builds.apache.org/job/flex-sdk_release/ws/build.xml>:1521: The
> following error occurred while executing this line:
> <https://builds.apache.org/job/flex-sdk_release/ws/build.xml>:1678: Java
> returned: 1
>
> Total time: 15 minutes 27 seconds
> Build step 'Invoke Ant' marked build as failure
> Archiving artifacts
>



-- 
Ix Multimedia Software

Jan Luykenstraat 27
3521 VB Utrecht

T. 06-51952295
I. www.ixsoftware.nl

Mime
  • Unnamed multipart/alternative (inline, None, 0 bytes)
View raw message