flex-dev mailing list archives

Site index · List index
Message view « Date » · « Thread »
Top « Date » · « Thread »
From OmPrakash Muppirala <bigosma...@gmail.com>
Subject Re: Build failed in Jenkins: flex-sdk_mustella #121
Date Wed, 05 Jun 2013 17:14:58 GMT
I am seeing this error now.  Its a new one, anyone has any ideas?

I am able to download the file
https://java.net/downloads/javacc/javacc-5.0.tar.gz manually.

================================================================================

*javacc-jar-check*:
*javacc-jar*:
*download-zip*:
*get-zip*:
      [get] Getting: https://java.net/downloads/javacc/javacc-5.0.tar.gz
      [get] To:
c:\jenkins_slave\workspace\flex-sdk_mustella\in\javacc-5.0.tar.gz

      [get] Error getting
https://java.net/downloads/javacc/javacc-5.0.tar.gz to
c:\jenkins_slave\workspace\flex-sdk_mustella\in\javacc-5.0.tar.gz
BUILD FAILEDc:\jenkins_slave\workspace\flex-sdk_mustella\build.xml:128:
The following error occurred while executing this line:
c:\jenkins_slave\workspace\flex-sdk_mustella\modules\build.xml:64: The
following error occurred while executing this line:
c:\jenkins_slave\workspace\flex-sdk_mustella\modules\downloads.xml:399:
The following error occurred while executing this line:
c:\jenkins_slave\workspace\flex-sdk_mustella\modules\downloads.xml:143:
The following error occurred while executing this line:
c:\jenkins_slave\workspace\flex-sdk_mustella\modules\downloads.xml:162:
javax.net.ssl.SSLHandshakeException:
sun.security.validator.ValidatorException: PKIX path building failed:
sun.security.provider.certpath.SunCertPathBuilderException: unable to
find valid certification path to requested target
	at com.sun.net.ssl.internal.ssl.Alerts.getSSLException(Alerts.java:174)
	at com.sun.net.ssl.internal.ssl.SSLSocketImpl.fatal(SSLSocketImpl.java:1520)
	at com.sun.net.ssl.internal.ssl.Handshaker.fatalSE(Handshaker.java:182)
	at com.sun.net.ssl.internal.ssl.Handshaker.fatalSE(Handshaker.java:176)
	at com.sun.net.ssl.internal.ssl.ClientHandshaker.serverCertificate(ClientHandshaker.java:975)
	at com.sun.net.ssl.internal.ssl.ClientHandshaker.processMessage(ClientHandshaker.java:123)
	at com.sun.net.ssl.internal.ssl.Handshaker.processLoop(Handshaker.java:511)
	at com.sun.net.ssl.internal.ssl.Handshaker.process_record(Handshaker.java:449)
	at com.sun.net.ssl.internal.ssl.SSLSocketImpl.readRecord(SSLSocketImpl.java:817)
	at com.sun.net.ssl.internal.ssl.SSLSocketImpl.performInitialHandshake(SSLSocketImpl.java:1029)
	at com.sun.net.ssl.internal.ssl.SSLSocketImpl.startHandshake(SSLSocketImpl.java:1056)
	at com.sun.net.ssl.internal.ssl.SSLSocketImpl.startHandshake(SSLSocketImpl.java:1040)
	at sun.net.www.protocol.https.HttpsClient.afterConnect(HttpsClient.java:405)
	at sun.net.www.protocol.https.AbstractDelegateHttpsURLConnection.connect(AbstractDelegateHttpsURLConnection.java:170)
	at sun.net.www.protocol.https.HttpsURLConnectionImpl.connect(HttpsURLConnectionImpl.java:133)
	at org.apache.tools.ant.taskdefs.Get$GetThread.openConnection(Get.java:660)
	at org.apache.tools.ant.taskdefs.Get$GetThread.get(Get.java:579)
	at org.apache.tools.ant.taskdefs.Get$GetThread.run(Get.java:569)
Caused by: sun.security.validator.ValidatorException: PKIX path
building failed:
sun.security.provider.certpath.SunCertPathBuilderException: unable to
find valid certification path to requested target
	at sun.security.validator.PKIXValidator.doBuild(PKIXValidator.java:285)
	at sun.security.validator.PKIXValidator.engineValidate(PKIXValidator.java:191)
	at sun.security.validator.Validator.validate(Validator.java:218)
	at com.sun.net.ssl.internal.ssl.X509TrustManagerImpl.validate(X509TrustManagerImpl.java:126)
	at com.sun.net.ssl.internal.ssl.X509TrustManagerImpl.checkServerTrusted(X509TrustManagerImpl.java:209)
	at com.sun.net.ssl.internal.ssl.X509TrustManagerImpl.checkServerTrusted(X509TrustManagerImpl.java:249)
	at com.sun.net.ssl.internal.ssl.ClientHandshaker.serverCertificate(ClientHandshaker.java:954)
	... 13 more
Caused by: sun.security.provider.certpath.SunCertPathBuilderException:
unable to find valid certification path to requested target
	at sun.security.provider.certpath.SunCertPathBuilder.engineBuild(SunCertPathBuilder.java:174)
	at java.security.cert.CertPathBuilder.build(CertPathBuilder.java:238)
	at sun.security.validator.PKIXValidator.doBuild(PKIXValidator.java:280)
	... 19 more

================================================================================


Thanks,


Om


On Wed, Jun 5, 2013 at 1:13 AM, OmPrakash Muppirala <bigosmallm@gmail.com>wrote:

> I have enabled an ant main build, added a TLF job and cleaned up a lot of
> small issues with the mustella job.
>
> The build is running and I need to go to sleep now.  I will check it in
> the morning.
>
> Thanks,
> Om
>
>
> On Tue, Jun 4, 2013 at 11:25 PM, OmPrakash Muppirala <bigosmallm@gmail.com
> > wrote:
>
>> On Tue, Jun 4, 2013 at 11:18 PM, Alex Harui <aharui@adobe.com> wrote:
>>
>>> I'm not going to be using the VM, so go for it.
>>>
>>> I'm ok with checking in jenkins.sh or maybe adding it to .gitignore?
>>>
>>>
>> Checking it in would make it a more turnkey solution (I sound like a
>> salesman :-) ) which would make it easier to run it on other VMs without
>> having to copy the file on to each VM.
>>
>> Om
>>
>>
>>>
>>> From: OmPrakash Muppirala <bigosmallm@gmail.com>
>>> Date: Tuesday, June 4, 2013 11:07 PM
>>> To: "dev@flex.apache.org" <dev@flex.apache.org>
>>> Cc: "erikdebruin@apache.org" <erikdebruin@apache.org>, "
>>> jmclean@apache.org" <jmclean@apache.org>, "carlosrovira@apache.org" <
>>> carlosrovira@apache.org>, "aharui@apache.org" <aharui@apache.org>
>>> Subject: Re: Build failed in Jenkins: flex-sdk_mustella #121
>>>
>>> From the log, it looks like the job is being run from
>>> C:\ApacheFlex\git\flex-sdk\mustella\
>>>
>>> I am pretty sure that this is not the location where the Jenkins job has
>>> its workspace.  That would explain why the last few days worth of code is
>>> missing.
>>>
>>> Alex, let me know when you are done, I can take a shot at fixing this.
>>>
>>> Will it be a problem if we checked in the jenkins.sh file into git?
>>>
>>> Thanks,
>>> Om
>>>
>>> On Tue, Jun 4, 2013 at 11:00 PM, OmPrakash Muppirala <
>>> bigosmallm@gmail.com> wrote:
>>>
>>>> Do you mind if I peek in and take a look?
>>>>
>>>> Thanks,
>>>> Om
>>>>
>>>>
>>>> On Tue, Jun 4, 2013 at 10:47 PM, Alex Harui <aharui@adobe.com> wrote:
>>>>
>>>>> Hi Erik,
>>>>>
>>>>> I took a look at the VM.  It doesn't look like it pulled down the
>>>>> changes
>>>>> I made over the past few days.  Could it be that since 'git status'
>>>>> isn't
>>>>> clean that the 'git pull' failed?
>>>>>
>>>>> -Alex
>>>>>
>>>>> On 6/4/13 9:49 PM, "flex.mustella@gmail.com" <flex.mustella@gmail.com>
>>>>> wrote:
>>>>>
>>>>> >See <http://localhost:8080/job/flex-sdk_mustella/121/changes>
>>>>> >
>>>>> >Changes:
>>>>> >
>>>>> >[carlosrovira] frameworks-rsls is broken since it depends of
>>>>> >"build.number.date" variable that is not provided.
>>>>> >
>>>>> >[jmclean] Changed Linux to use zip of compile pixel bender files
>>>>> >
>>>>> >[jmclean] Added version of files for Linux /AIR 2
>>>>> >
>>>>> >[jmclean] Changed build files to us zip of pixel bender files on Linux
>>>>> >
>>>>> >[jmclean] Changed build files to us zip of pixel bender files on Linux
>>>>> >
>>>>> >[jmclean] Changed build files to us zip of pixel bender files on Linux
>>>>> >
>>>>> >[jmclean] fix up platform conditionals
>>>>> >
>>>>> >[jmclean] fixed spacing
>>>>> >
>>>>> >[jmclean] set configMiod initially to empty
>>>>> >
>>>>> >[aharui] re-cut png.xmls for a full run.  These tests leave dirty
>>>>> >siblings that will affect png.xml compares in partial runs
>>>>> >
>>>>> >[aharui] Catch exception when Shader is involved
>>>>> >
>>>>> >[aharui] Try to use png.xml for Win differences
>>>>> >
>>>>> >[jmclean] Fixed build for Linux so it includes correct config file.
>>>>> >
>>>>> >[aharui] Use png.xml for Win differences
>>>>> >
>>>>> >[aharui] use png.xml for win differences
>>>>> >
>>>>> >[aharui] Try to use png.xml for Win differences
>>>>> >
>>>>> >[aharui] remove unique id chars from tag names in xml compare so
>>>>> embedded
>>>>> >assets match
>>>>> >
>>>>> >[aharui] update png.xml for full runs.  The tests leave dirty objects
>>>>> on
>>>>> >the display list
>>>>> >
>>>>> >[aharui] update png.xml for full runs.  Tests leave dirty siblings on
>>>>> >display list
>>>>> >
>>>>> >[aharui] update png.xml for full run
>>>>> >
>>>>> >[aharui] Use png.xml for Win differences
>>>>> >
>>>>> >[aharui] use png.xml for win differences
>>>>> >
>>>>> >[aharui] use png.xml for win differences
>>>>> >
>>>>> >[aharui] use png.xml for win differences
>>>>> >
>>>>> >------------------------------------------
>>>>> >[...truncated 79772 lines...]
>>>>> >     [java]
>>>>> spark/validators/NumberValidator/Methods/NV_validate_tester
>>>>> >NV_validate_default_valid_model_test17 Passed
>>>>> >     [java]
>>>>> spark/validators/NumberValidator/Methods/NV_validate_tester
>>>>> >NV_validate_default_valid_model_test18 Passed
>>>>> >     [java]
>>>>> spark/validators/NumberValidator/Methods/NV_validate_tester
>>>>> >NV_validate_default_valid_model_test19 Passed
>>>>> >     [java]
>>>>> spark/validators/NumberValidator/Methods/NV_validate_tester
>>>>> >NV_validate_default_valid_model_test20 Passed
>>>>> >     [java]
>>>>> spark/validators/NumberValidator/Methods/NV_validate_tester
>>>>> >NV_validate_default_invalid_model_test21 Passed
>>>>> >     [java]
>>>>> spark/validators/NumberValidator/Methods/NV_validate_tester
>>>>> >NV_validate_default_invalid_model_test22 Passed
>>>>> >     [java]
>>>>> spark/validators/NumberValidator/Methods/NV_validate_tester
>>>>> >NV_validate_default_invalid_model_test23 Passed
>>>>> >     [java]
>>>>> spark/validators/NumberValidator/Methods/NV_validate_tester
>>>>> >NV_validate_default_invalid_model_test24 Passed
>>>>> >     [java]
>>>>> spark/validators/NumberValidator/Methods/NV_validate_tester
>>>>> >NV_validate_default_valid_setListenerInScripts_test25 Passed
>>>>> >     [java]
>>>>> spark/validators/NumberValidator/Methods/NV_validate_tester
>>>>> >NV_validate_default_valid_setListenerInScripts_test26 Passed
>>>>> >     [java]
>>>>> spark/validators/NumberValidator/Methods/NV_validate_tester
>>>>> >NV_validate_default_valid_setListenerInScripts_test27 Passed
>>>>> >     [java]
>>>>> spark/validators/NumberValidator/Methods/NV_validate_tester
>>>>> >NV_validate_default_valid_setListenerInScripts_enabled_false_test28
>>>>> >Passed
>>>>> >     [java]
>>>>> spark/validators/NumberValidator/Methods/NV_validate_tester
>>>>> >NV_validate_default_invalid_setListenerInScripts_test29 Passed
>>>>> >     [java]
>>>>> spark/validators/NumberValidator/Methods/NV_validate_tester
>>>>> >NV_validate_default_invalid_setListenerInScripts_test30 Passed
>>>>> >     [java]
>>>>> spark/validators/NumberValidator/Methods/NV_validate_tester
>>>>> >NV_validate_default_invalid_setListenerInScripts_test31 Passed
>>>>> >     [java]
>>>>> spark/validators/NumberValidator/Methods/NV_validate_tester
>>>>> >NV_validate_default_invalid_setListenerInScripts_test32 Passed
>>>>> >     [java]
>>>>> spark/validators/NumberValidator/Methods/NV_validate_tester
>>>>> >NV_validate_method_invalid_trigger_decimalPointErr_test33 Passed
>>>>> >     [java]
>>>>> spark/validators/NumberValidator/Methods/NV_validate_tester
>>>>> >NV_validate_method_invalid_trigger_invalideCharErr_test34 Passed
>>>>> >     [java]
>>>>> spark/validators/NumberValidator/Methods/NV_validate_tester
>>>>> >NV_validate_method_invalid_trigger_invalideCharErr_test35 Passed
>>>>> >     [java]
>>>>> spark/validators/NumberValidator/Methods/NV_validate_tester
>>>>> >NV_validate_method_invalid_trigger_by_mouse_test36 Passed
>>>>> >     [java]
>>>>> spark/validators/NumberValidator/Methods/NV_validate_tester
>>>>> >NV_validate_inline_fr_FR_locale_valid_number_test37 Passed
>>>>> >     [java]
>>>>> spark/validators/NumberValidator/Methods/NV_validate_tester
>>>>> >NV_validate_inline_fr_FR_locale_valid_number_test38 Passed
>>>>> >     [java]
>>>>> spark/validators/NumberValidator/Methods/NV_validate_tester
>>>>> >NV_validate_inline_fr_FR_locale_invalid_number_test39 Passed
>>>>> >     [java]
>>>>> spark/validators/NumberValidator/Methods/NV_validate_tester
>>>>> >NV_validate_inline_fr_FR_locale_invalid_number_test40 Passed
>>>>> >     [java]
>>>>> spark/validators/NumberValidator/Methods/NV_validate_tester
>>>>> >NV_default_decimalPointCountError_buttonTrig_bitmap_test41 Passed
>>>>> >     [java]
>>>>> spark/validators/NumberValidator/Methods/NV_validate_tester
>>>>>
>>>>> >NV_default_decimalPointCountError_actionscripts_buttonTrig_bitmap_test42
>>>>> >Passed
>>>>> >     [java]
>>>>> spark/validators/NumberValidator/Methods/NV_validate_tester
>>>>> >NV_default_custom_decimalPointCountError_invalid_buttonTrig_test43
>>>>> Passed
>>>>> >
>>>>> >     [java]
>>>>> spark/validators/NumberValidator/Methods/NV_validate_tester
>>>>>
>>>>> >NV_decimalSeparator_colon_custom_decimalPointCountError_invalid_script_but
>>>>> >tonTrig_test44 Passed
>>>>> >     [java]
>>>>> spark/validators/NumberValidator/Methods/NV_validate_tester
>>>>> >NV_maxValue_greaterThanMaxError_buttonTrig_bitmap_test45 Passed
>>>>> >     [java]
>>>>> spark/validators/NumberValidator/Methods/NV_validate_tester
>>>>> >NV_maxValue_greaterThanMaxError_actionscripts_buttonTrig_bitmap_test46
>>>>> >Passed
>>>>> >     [java]
>>>>> spark/validators/NumberValidator/Methods/NV_validate_tester
>>>>> >NV_maxValue_custom_greaterThanMaxError_buttonTrig_test47 Passed
>>>>> >     [java]
>>>>> spark/validators/NumberValidator/Methods/NV_validate_tester
>>>>> >NV_maxValue_custom_greaterThanMaxError_actionscripts_buttonTrig_test48
>>>>> >Passed
>>>>> >     [java]
>>>>> spark/validators/NumberValidator/Methods/NV_validate_tester
>>>>> >NV_maxValue_lessThanMinError_buttonTrig_bitmap_test49 Passed
>>>>> >     [java]
>>>>> spark/validators/NumberValidator/Methods/NV_validate_tester
>>>>> >NV_maxValue_lessThanMinError_actionscripts_buttonTrig_bitmap_test50
>>>>> >Passed
>>>>> >     [java]
>>>>> spark/validators/NumberValidator/Methods/NV_validate_tester
>>>>> >NV_maxValue_custom_lessThanMinError_buttonTrig_test51 Passed
>>>>> >     [java]
>>>>> spark/validators/NumberValidator/Methods/NV_validate_tester
>>>>> >NV_maxValue_custom_lessThanMinError_actionscripts_buttonTrig_test52
>>>>> >Passed
>>>>> >     [java]
>>>>> spark/validators/NumberValidator/Methods/NV_validate_tester
>>>>> >NV_allowNegative_false_negativeError_invalid_buttonTrig_test53 Passed
>>>>> >     [java]
>>>>> spark/validators/NumberValidator/Methods/NV_validate_tester
>>>>>
>>>>> >NV_allowNegative_false_negativeError_invalid_actionscripts_buttonTrig_test
>>>>> >54 Passed
>>>>> >     [java]
>>>>> spark/validators/NumberValidator/Methods/NV_validate_tester
>>>>> >NV_allowNegative_false_custom__negativeError_invalid_buttonTrig_test55
>>>>> >Passed
>>>>> >     [java]
>>>>> spark/validators/NumberValidator/Methods/NV_validate_tester
>>>>>
>>>>> >NV_allowNegative_false_custom_negativeError_invalid_script_buttonTrig_test
>>>>> >56 Passed
>>>>> >     [java]
>>>>> spark/validators/NumberValidator/Methods/NV_validate_tester
>>>>> >NV_domain_notAnIntegerError_buttonTrig_bitmap_test57 Passed
>>>>> >     [java]
>>>>> spark/validators/NumberValidator/Methods/NV_validate_tester
>>>>> >NV_domain_notAnIntegerError_actionscripts_buttonTrig_bitmap_test58
>>>>> Passed
>>>>> >
>>>>> >     [java]
>>>>> spark/validators/NumberValidator/Methods/NV_validate_tester
>>>>> >NV_property_domain_custom_notAnIntegerError_errorString_test59 Passed
>>>>> >     [java]
>>>>> spark/validators/NumberValidator/Methods/NV_validate_tester
>>>>> >NV_property_domain_custom_notAnIntegerError_actionscripts_valid_test60
>>>>> >Passed
>>>>> >     [java]
>>>>> spark/validators/NumberValidator/Methods/NV_validate_tester
>>>>> >NV_fractionalDigitsError_buttonTrig_bitmap_test61 Passed
>>>>> >     [java]
>>>>> spark/validators/NumberValidator/Methods/NV_validate_tester
>>>>> >NV_fractionalDigitsError_actionscripts_buttonTrig_bitmap_test62 Passed
>>>>> >     [java]
>>>>> spark/validators/NumberValidator/Methods/NV_validate_tester
>>>>> >NV_custom_fractionalDigitsError_errorString_invalid_test63 Passed
>>>>> >     [java]
>>>>> spark/validators/NumberValidator/Methods/NV_validate_tester
>>>>> >NV_custom_fractionalDigitsError_actionscripts_valid_test64 Passed
>>>>> >     [java]
>>>>> spark/validators/NumberValidator/Methods/NV_validate_tester
>>>>> >NV_negativeNumberFormatError_buttonTrig_bitmap_test69 Passed
>>>>> >     [java]
>>>>> spark/validators/NumberValidator/Methods/NV_validate_tester
>>>>> >NV_negativeNumberFormatError_actionscripts_buttonTrig_bitmap_test70
>>>>> >Passed
>>>>> >     [java]
>>>>> spark/validators/NumberValidator/Methods/NV_validate_tester
>>>>> >NV_custom_negativeNumberFormatError_buttonTrig_errorString_test71
>>>>> Passed
>>>>> >     [java]
>>>>> spark/validators/NumberValidator/Methods/NV_validate_tester
>>>>> >NV_custom_negativeNumberFormatError_actionscripts_valid_test72 Passed
>>>>> >     [java]
>>>>> spark/validators/NumberValidator/Methods/NV_validate_tester
>>>>> >NV_negativeSymbolError_buttonTrig_bitmap_test73 Passed
>>>>> >     [java]
>>>>> spark/validators/NumberValidator/Methods/NV_validate_tester
>>>>> >NV_negativeSymbolError_actionscripts_buttonTrig_bitmap_test74 Passed
>>>>> >     [java]
>>>>> spark/validators/NumberValidator/Methods/NV_validate_tester
>>>>> >NV_custom_negativeSymbolError_buttonTrig_errorString_test75 Passed
>>>>> >     [java]
>>>>> spark/validators/NumberValidator/Methods/NV_validate_tester
>>>>> >NV_custom_negativeSymbolError_actionscripts_valid_test76 Passed
>>>>> >     [java]
>>>>> spark/validators/NumberValidator/Methods/NV_validate_tester
>>>>> >NV_invalidCharError_buttonTrig_bitmap_test77 Passed
>>>>> >     [java]
>>>>> spark/validators/NumberValidator/Methods/NV_validate_tester
>>>>> >NV_invalidCharError_actionscripts_buttonTrig_bitmap_test78 Passed
>>>>> >     [java]
>>>>> spark/validators/NumberValidator/Methods/NV_validate_tester
>>>>> >NV_custom_invalidCharError_buttonTrig_errorString_test79 Passed
>>>>> >     [java]
>>>>> spark/validators/NumberValidator/Methods/NV_validate_tester
>>>>> >NV_custom_invalidCharError_actionscripts_invalid_test80 Passed
>>>>> >     [java]
>>>>> spark/validators/NumberValidator/Methods/NV_validate_tester
>>>>> >NV_invalidFormatCharsError_buttonTrig_bitmap_test81 Passed
>>>>> >     [java]
>>>>> spark/validators/NumberValidator/Methods/NV_validate_tester
>>>>> >NV_invalidFormatCharsError_actionscripts_buttonTrig_bitmap_test82
>>>>> Passed
>>>>> >     [java]
>>>>> spark/validators/NumberValidator/Methods/NV_validate_tester
>>>>> >NV_custom_invalidFormatCharsError_buttonTrig_errorString_test83 Passed
>>>>> >     [java]
>>>>> spark/validators/NumberValidator/Methods/NV_validate_tester
>>>>> >NV_custom_invalidFormatCharsError_actionscripts_invalid_test84 Passed
>>>>> >     [java]
>>>>> spark/validators/NumberValidator/Methods/NV_validate_tester
>>>>> >NV_parseError_buttonTrig_bitmap_test85 Passed
>>>>> >     [java]
>>>>> spark/validators/NumberValidator/Methods/NV_validate_tester
>>>>> >NV_parseError_actionscripts_buttonTrig_bitmap_test86 Passed
>>>>> >     [java]
>>>>> spark/validators/NumberValidator/Methods/NV_validate_tester
>>>>> >NV_custom_parseError_buttonTrig_errorString_test87 Passed
>>>>> >     [java]
>>>>> spark/validators/NumberValidator/Methods/NV_validate_tester
>>>>> >NV_custom_parseError_actionscripts_invalid_test88 Passed
>>>>> >     [java]
>>>>> spark/validators/NumberValidator/Methods/NV_validate_tester
>>>>> >NV_validate_non_string_object_error_test89 Passed
>>>>> >     [java]
>>>>> >spark/validators/NumberValidator/Methods/NV_validateAll_tester
>>>>> >NV_validateAll_method_valid_program_test1 Passed
>>>>> >     [java]
>>>>> >spark/validators/NumberValidator/Methods/NV_validateAll_tester
>>>>> >NV_validateAll_method_negativeNumberFormatter_invalid_program_test2
>>>>> >Passed
>>>>> >     [java]
>>>>> >spark/validators/NumberValidator/Methods/NV_validateAll_tester
>>>>> >NV_validateAll_method_all_invalid_number_test3 Passed
>>>>> >     [java]
>>>>> >spark/validators/NumberValidator/Methods/NV_validateAll_tester
>>>>> >NV_validateAll_method_disabled_program_test4 Passed
>>>>> >     [java]
>>>>> >spark/validators/NumberValidator/Methods/NV_validateAll_tester
>>>>> >NV_validateAll_method_one_fr-FR_numberValidator_test5 Passed
>>>>> >     [java]
>>>>> >spark/validators/NumberValidator/Methods/NV_validateAll_tester
>>>>> >NV_validateAll_method_numberValidator_one_zh-CN_error_message_test6
>>>>> >Passed
>>>>> >     [java]
>>>>> >spark/validators/NumberValidator/Methods/NV_validateAll_tester
>>>>>
>>>>> >NV_spark_validateAll_mixed_numberValidator_CurrencyValidator_mxValidator_a
>>>>> >ll_invalid_test8 Passed
>>>>> >     [java]
>>>>> >spark/validators/NumberValidator/Methods/NV_validateAll_tester
>>>>>
>>>>> >NV_spark_validateAll_mixed_numberValidator_CurrencyValidator_mxValidator_i
>>>>> >nvalid_test9 Passed
>>>>> >     [java]
>>>>> >spark/validators/NumberValidator/Methods/NV_validateAll_tester
>>>>> >NV_spark_validateAll_all_mx_validator_in_array_test10 Passed
>>>>> >     [java]
>>>>> >spark/validators/NumberValidator/Methods/NV_validateAll_tester
>>>>> >NV_spark_validateAll_all_mx_validator_in_array_invalid_test11 Passed
>>>>> >     [java]
>>>>> >spark/validators/NumberValidator/Methods/NV_validateAll_tester
>>>>> >NV_MX_validateAll_all_mx_validator_in_array_test12 Passed
>>>>> >     [java]
>>>>> >spark/validators/NumberValidator/Methods/NV_validateAll_tester
>>>>> >NV_MX_validateAll_all_mx_validator_in_array_invalid_test13 Passed
>>>>> >     [java]
>>>>> >spark/validators/NumberValidator/Methods/NV_validateAll_tester
>>>>>
>>>>> >NV_MX_validateAll_mixed_numberValidator_CurrencyValidator_mxValidator_all_
>>>>> >invalid_test14 Passed
>>>>> >     [java]
>>>>> >spark/validators/NumberValidator/Methods/NV_validateAll_tester
>>>>>
>>>>> >NV_MX_validateAll_mixed_numberValidator_CurrencyValidator_mxValidator_inva
>>>>> >lid_test15 Passed
>>>>> >     [java]
>>>>> >spark/validators/NumberValidator/Methods/NV_validateAll_tester
>>>>> >NV_MX_validateAll_method_spark_validator_test16 Passed
>>>>> >     [java]
>>>>> >spark/validators/NumberValidator/Methods/NV_validateAll_tester
>>>>> >NV_MX_validateAll_method_spark_validator_invalid_test17 Passed
>>>>> >     [java]
>>>>> >spark/validators/NumberValidator/Methods/NV_validateNumber_tester
>>>>> >NV_validateNumber_Number_object_invalid_default_properties_test1
>>>>> Passed
>>>>> >     [java]
>>>>> >spark/validators/NumberValidator/Methods/NV_validateNumber_tester
>>>>> >NV_validateNumber_Number_object_valid_default_properties_test2 Passed
>>>>> >     [java]
>>>>> >spark/validators/NumberValidator/Methods/NV_validateNumber_tester
>>>>> >NV_validateNumber_Number_object_valid_with_properties_test3 Passed
>>>>> >     [java]
>>>>> >spark/validators/NumberValidator/Methods/NV_validateNumber_tester
>>>>> >NV_validateNumber_Number_object_invalid_with_properties_test4 Passed
>>>>> >     [java]
>>>>> >spark/validators/NumberValidator/Methods/NV_validateNumber_tester
>>>>> >NV_validateNumber_UI_TextInput_object_valid_program_test5 Passed
>>>>> >     [java]
>>>>> >spark/validators/NumberValidator/Methods/NV_validateNumber_tester
>>>>> >NV_validateNumber_UI_TextInput_object_invalid_program_test6 Passed
>>>>> >     [java]
>>>>> >spark/validators/NumberValidator/Methods/NV_validateNumber_tester
>>>>> >NV_validateNumber_UI_TextInput_object_valid_with_properties_test7
>>>>> Passed
>>>>> >     [java]
>>>>> >spark/validators/NumberValidator/Methods/NV_validateNumber_tester
>>>>> >NV_validateNumber_UI_TextInput_object_invalid_with_properties_test8
>>>>> >Passed
>>>>> >     [java]
>>>>> >spark/validators/NumberValidator/Methods/NV_validateNumber_tester
>>>>> >NV_validateNumber_non_object_error_message_test9 Passed
>>>>> >     [java]
>>>>> >spark/validators/NumberValidator/Methods/NV_validateNumber_tester
>>>>> >NV_validateNumber_Number_object_bindable_results_test10 Passed
>>>>> >     [java]
>>>>> >spark/validators/NumberValidator/Methods/NV_validateNumber_tester
>>>>> >NV_validateNumber_UI_TextInput_object_bindable_result_test11 Passed
>>>>> >     [java]
>>>>> >spark/validators/NumberValidator/Methods/NV_validateNumber_tester
>>>>> >NV_validateNumber_non_string_object_error_message_test12 Passed
>>>>> >     [java] =====================================================
>>>>> >     [java]    Failed:
>>>>> >     [java] =====================================================
>>>>> >     [java] components/Alert/Properties/Alert_Properties
>>>>> >Alert_layoutDirection_direction_rtl_with_alertIcon Failed
>>>>> >CompareBitmap(body:step 2)  compare returned[object BitmapData]
>>>>> >     [java] components/Charts/Area/Properties/AreaProperties
>>>>> >AreaSeries_multipleAxes_disabledDays Failed CompareBitmap(body:step 1)
>>>>> >compare returned[object BitmapData]
>>>>> >     [java] components/Charts/Area/Properties/AreaProperties
>>>>> >AreaSeries_axisRenderer_withPlacement Failed CompareBitmap(body:step
>>>>> 1)
>>>>> >compare returned[object BitmapData]
>>>>> >     [java] components/Charts/Area/Properties/AreaProperties
>>>>> >AreaSeries_sameAxis_diffRenderers Failed CompareBitmap(body:step 1)
>>>>> >compare returned[object BitmapData]
>>>>> >     [java] components/Charts/Area/Properties/AreaProperties
>>>>> >AreaSeries_axisAtSeriesLevel Failed CompareBitmap(body:step 1)
>>>>>  compare
>>>>> >returned[object BitmapData]
>>>>> >     [java] components/Charts/Bubble/Properties/BubbleProperties
>>>>> >BubbleSeries_filterData_filterDataValues Failed
>>>>> CompareBitmap(body:step
>>>>> >1)  compare returned[object BitmapData]
>>>>> >     [java] components/Charts/Bubble/Properties/BubbleProperties
>>>>> >BubbleSeries_multipleAxes_disabledDays Failed CompareBitmap(body:step
>>>>> 1)
>>>>> >compare returned[object BitmapData]
>>>>> >     [java] components/Charts/Bubble/Properties/BubbleProperties
>>>>> >BubbleSeries_axisRenderer_withPlacement Failed
>>>>> CompareBitmap(body:step 1)
>>>>> > compare returned[object BitmapData]
>>>>> >     [java] components/Charts/Bubble/Properties/BubbleProperties
>>>>> >BubbleSeries_sameAxis_diffRenderers Failed CompareBitmap(body:step 1)
>>>>> >compare returned[object BitmapData]
>>>>> >     [java] components/Charts/Bubble/Properties/BubbleProperties
>>>>> >BubbleSeries_axisAtSeriesLevel Failed CompareBitmap(body:step 1)
>>>>>  compare
>>>>> >returned[object BitmapData]
>>>>> >     [java] components/Charts/Candle/Properties/CandlestickProperties
>>>>> >CandlestickSeries_multipleAxes_disabledDays Failed
>>>>> >CompareBitmap(body:step 1)  compare returned[object BitmapData]
>>>>> >     [java] components/Charts/Candle/Properties/CandlestickProperties
>>>>> >CandlestickSeries_axisRenderer_withPlacement Failed
>>>>> >CompareBitmap(body:step 1)  compare returned[object BitmapData]
>>>>> >     [java] components/Charts/Candle/Properties/CandlestickProperties
>>>>> >CandlestickSeries_sameAxis_diffRenderers Failed
>>>>> CompareBitmap(body:step
>>>>> >1)  compare returned[object BitmapData]
>>>>> >     [java] components/Charts/Candle/Properties/CandlestickProperties
>>>>> >CandlestickSeries_axisAtSeriesLevel Failed CompareBitmap(body:step 1)
>>>>> >compare returned[object BitmapData]
>>>>> >     [java] components/Charts/Column/Properties/ColumnProperties
>>>>> >ColumnSeries_filterData_filterDataValues Failed
>>>>> CompareBitmap(body:step
>>>>> >1)  compare returned[object BitmapData]
>>>>> >     [java] components/Charts/Column/Properties/ColumnProperties
>>>>> >ColumnSeries_multipleAxes_disabledDays Failed CompareBitmap(body:step
>>>>> 1)
>>>>> >compare returned[object BitmapData]
>>>>> >     [java] components/Charts/Column/Properties/ColumnProperties
>>>>> >ColumnSeries_axisRenderer_withPlacement Failed
>>>>> CompareBitmap(body:step 1)
>>>>> > compare returned[object BitmapData]
>>>>> >     [java] components/Charts/Column/Properties/ColumnProperties
>>>>> >ColumnSeries_sameAxis_diffRenderers Failed CompareBitmap(body:step 1)
>>>>> >compare returned[object BitmapData]
>>>>> >     [java] components/Charts/Column/Properties/ColumnProperties
>>>>> >ColumnSeries_axisAtSeriesLevel Failed CompareBitmap(body:step 1)
>>>>>  compare
>>>>> >returned[object BitmapData]
>>>>> >     [java] components/Charts/HLOC/Properties/HLOCProperties
>>>>> >HLOCSeries_multipleAxes_disabledDays Failed CompareBitmap(body:step 1)
>>>>> >compare returned[object BitmapData]
>>>>> >     [java] components/Charts/HLOC/Properties/HLOCProperties
>>>>> >HLOCSeries_axisRenderer_withPlacement Failed CompareBitmap(body:step
>>>>> 1)
>>>>> >compare returned[object BitmapData]
>>>>> >     [java] components/Charts/HLOC/Properties/HLOCProperties
>>>>> >HLOCSeries_sameAxis_diffRenderers Failed CompareBitmap(body:step 1)
>>>>> >compare returned[object BitmapData]
>>>>> >     [java] components/Charts/HLOC/Properties/HLOCProperties
>>>>> >HLOCSeries_axisAtSeriesLevel Failed CompareBitmap(body:step 1)
>>>>>  compare
>>>>> >returned[object BitmapData]
>>>>> >     [java] components/Charts/Line/Properties/LineProperties
>>>>> >LineSeries_ChangeMinAndMax_LinearAxis Failed CompareBitmap(body:step
>>>>> 1)
>>>>> >compare returned[object BitmapData]
>>>>> >     [java] components/Charts/Line/Properties/LineProperties
>>>>> >LineSeries_filterData_filterDataValues Failed CompareBitmap(body:step
>>>>> 1)
>>>>> >compare returned[object BitmapData]
>>>>> >     [java] components/Charts/Line/Properties/LineProperties
>>>>> >LineSeries_multipleAxes_disabledDays Failed CompareBitmap(body:step 1)
>>>>> >compare returned[object BitmapData]
>>>>> >     [java] components/Charts/Line/Properties/LineProperties
>>>>> >LineSeries_axisRenderer_withPlacement Failed CompareBitmap(body:step
>>>>> 1)
>>>>> >compare returned[object BitmapData]
>>>>> >     [java] components/Charts/Line/Properties/LineProperties
>>>>> >LineSeries_sameAxis_diffRenderers Failed CompareBitmap(body:step 1)
>>>>> >compare returned[object BitmapData]
>>>>> >     [java] components/Charts/Line/Properties/LineProperties
>>>>> >LineSeries_axisAtSeriesLevel Failed CompareBitmap(body:step 1)
>>>>>  compare
>>>>> >returned[object BitmapData]
>>>>> >     [java] components/Charts/Plot/Properties/PlotProperties
>>>>> >PlotSeries_multipleAxes_disabledDays Failed CompareBitmap(body:step 1)
>>>>> >compare returned[object BitmapData]
>>>>> >     [java] components/Charts/Plot/Properties/PlotProperties
>>>>> >PlotSeries_axisRenderer_withPlacement Failed CompareBitmap(body:step
>>>>> 1)
>>>>> >compare returned[object BitmapData]
>>>>> >     [java] components/Charts/Plot/Properties/PlotProperties
>>>>> >PlotSeries_sameAxis_diffRenderers Failed CompareBitmap(body:step 1)
>>>>> >compare returned[object BitmapData]
>>>>> >     [java] components/Charts/Plot/Properties/PlotProperties
>>>>> >PlotSeries_axisAtSeriesLevel Failed CompareBitmap(body:step 1)
>>>>>  compare
>>>>> >returned[object BitmapData]
>>>>> >     [java]
>>>>> >components/NumericStepper/styles/NumericStepper_Styles_tester_spark
>>>>> >NumericStepper_Styles_upArrowDownSkin_jpg Failed
>>>>> CompareBitmap(body:step
>>>>> >1)  compare returned[object BitmapData]
>>>>> >     [java] gumbo/FCK/integration/FCK_Integration_main
>>>>> >FCK_integration_skin_up Failed CompareBitmap(body:step 1)  compare
>>>>> >returned[object BitmapData]
>>>>> >     [java] gumbo/FCK/integration/FCK_Integration_main
>>>>> >FCK_integration_skin_over Failed CompareBitmap(body:step 4)  compare
>>>>> >returned[object BitmapData]
>>>>> >     [java] gumbo/FCK/integration/FCK_Integration_main
>>>>> >FCK_integration_skin_down Failed CompareBitmap(body:step 5)  compare
>>>>> >returned[object BitmapData]
>>>>> >     [java]
>>>>> >gumbo/components/Application/properties/Application_Properties
>>>>> >Application_Properties_skin_test7 Failed Timed out
>>>>> >     [java] gumbo/components/Border/Properties/Border_Properties
>>>>> >Border_Properties_borderStroke_RGS4 Failed CompareBitmap(body:step 2)
>>>>> >compare returned[object BitmapData]
>>>>> >     [java]
>>>>> gumbo/components/Button/styles/FxButton_GlobalStyles_tester
>>>>> >FxButton_Style_baseColor_disabled Failed CompareBitmap(body:step 3)
>>>>> >compare returned[object BitmapData]
>>>>> >     [java]
>>>>> >gumbo/components/Label/Properties/Label_RichText_baselinePosition
>>>>> >baselinePosition_regression_24750_4 Failed AssertMethodValue (method
>>>>> >cannot be shown)(body:step 1)  method returned 41:baselinePosition=0,
>>>>> >expected 41:baselinePosition=13
>>>>> >     [java]
>>>>>
>>>>> >gumbo/components/ToggleButton/styles/FxToggleButton_GlobalStyles_tester
>>>>> >FxToggleButton_Style_baseColor_disabled Failed
>>>>> CompareBitmap(body:step 3)
>>>>> > compare returned[object BitmapData]
>>>>> >     [java]
>>>>> gumbo/components/ToggleButton/styles/togglebutton_icon_styles
>>>>> >togglebutton_icon_with_label_chromeColor_disabled Failed
>>>>> >CompareBitmap(body:step 2)  compare returned[object BitmapData]
>>>>> >     [java] gumbo/core/DataGroup/viewport/DataGroup_viewport_main
>>>>> >DataGroup_viewport_scrollPosition_gradient_minus50_minus50 Failed
>>>>> >CompareBitmap, url =
>>>>>
>>>>> >../viewport/baselines/DataGroup_viewport_scrollPosition_gradient_minus50_m
>>>>> >inus50@win.pn(body:step 11)  compare returned[object BitmapData]
>>>>> >     [java] gumbo/core/DataGroup/viewport/DataGroup_viewport_main
>>>>> >DataGroup_viewport_scrollPosition_gradient_0_0 Failed CompareBitmap,
>>>>> url
>>>>> >=
>>>>> >
>>>>> ../viewport/baselines/DataGroup_viewport_scrollPosition_gradient_0_0@win.p
>>>>> >n(body:step 11)  compare returned[object BitmapData]
>>>>> >     [java] gumbo/core/DataGroup/viewport/DataGroup_viewport_main
>>>>> >DataGroup_viewport_scrollPosition_gradient_450_minus50 Failed
>>>>> >CompareBitmap, url =
>>>>>
>>>>> >../viewport/baselines/DataGroup_viewport_scrollPosition_gradient_450_minus
>>>>> >50@win.pn(body:step 11)  compare returned[object BitmapData]
>>>>> >     [java] gumbo/core/DataGroup/viewport/DataGroup_viewport_main
>>>>> >DataGroup_viewport_scrollPosition_gradient_minus50_450 Failed
>>>>> >CompareBitmap, url =
>>>>>
>>>>> >../viewport/baselines/DataGroup_viewport_scrollPosition_gradient_minus50_4
>>>>> >50@win.pn(body:step 11)  compare returned[object BitmapData]
>>>>> >     [java] gumbo/core/DataGroup/viewport/DataGroup_viewport_main
>>>>> >DataGroup_viewport_scrollPosition_gradient_450_450 Failed
>>>>> CompareBitmap,
>>>>> >url =
>>>>>
>>>>> >../viewport/baselines/DataGroup_viewport_scrollPosition_gradient_450_450@w
>>>>> >in.pn(body:step 11)  compare returned[object BitmapData]
>>>>> >     [java] gumbo/core/DataGroup/viewport/DataGroup_viewport_main
>>>>> >DataGroup_viewport_scrollPosition_gradient_200_200 Failed
>>>>> CompareBitmap,
>>>>> >url =
>>>>>
>>>>> >../viewport/baselines/DataGroup_viewport_scrollPosition_gradient_200_200@w
>>>>> >in.pn(body:step 11)  compare returned[object BitmapData]
>>>>> >     [java] gumbo/core/DataGroup/viewport/DataGroup_viewport_main
>>>>> >DataGroup_viewport_scrollPosition_gradient_minus50_200 Failed
>>>>> >CompareBitmap, url =
>>>>>
>>>>> >../viewport/baselines/DataGroup_viewport_scrollPosition_gradient_minus50_2
>>>>> >00@win.pn(body:step 11)  compare returned[object BitmapData]
>>>>> >     [java] gumbo/core/DataGroup/viewport/DataGroup_viewport_main
>>>>> >DataGroup_viewport_scrollPosition_gradient_200_minus50 Failed
>>>>> >CompareBitmap, url =
>>>>>
>>>>> >../viewport/baselines/DataGroup_viewport_scrollPosition_gradient_200_minus
>>>>> >50@win.pn(body:step 11)  compare returned[object BitmapData]
>>>>> >     [java] gumbo/core/DataGroup/viewport/DataGroup_viewport_main
>>>>> >DataGroup_viewport_scrollPosition_gradient_450_200 Failed
>>>>> CompareBitmap,
>>>>> >url =
>>>>>
>>>>> >../viewport/baselines/DataGroup_viewport_scrollPosition_gradient_450_200@w
>>>>> >in.pn(body:step 11)  compare returned[object BitmapData]
>>>>> >     [java] gumbo/core/DataGroup/viewport/DataGroup_viewport_main
>>>>> >DataGroup_viewport_scrollPosition_gradient_200_450 Failed
>>>>> CompareBitmap,
>>>>> >url =
>>>>>
>>>>> >../viewport/baselines/DataGroup_viewport_scrollPosition_gradient_200_450@w
>>>>> >in.pn(body:step 11)  compare returned[object BitmapData]
>>>>> >     [java] gumbo/core/Group/viewport/Group_viewport_main
>>>>> >Group_viewport_scrollPosition_gradient_minus50_minus50 Failed
>>>>> >CompareBitmap, url =
>>>>>
>>>>> >../viewport/baselines/Group_viewport_scrollPosition_gradient_minus50_minus
>>>>> >50@win.pn(body:step 11)  compare returned[object BitmapData]
>>>>> >     [java] gumbo/core/Group/viewport/Group_viewport_main
>>>>> >Group_viewport_scrollPosition_gradient_0_0 Failed CompareBitmap, url =
>>>>> >../viewport/baselines/
>>>>> Group_viewport_scrollPosition_gradient_0_0@win.pn(bo
>>>>> >dy:step 11)  compare returned[object BitmapData]
>>>>> >     [java] gumbo/core/Group/viewport/Group_viewport_main
>>>>> >Group_viewport_scrollPosition_gradient_450_minus50 Failed
>>>>> CompareBitmap,
>>>>> >url =
>>>>>
>>>>> >../viewport/baselines/Group_viewport_scrollPosition_gradient_450_minus50@w
>>>>> >in.pn(body:step 11)  compare returned[object BitmapData]
>>>>> >     [java] gumbo/core/Group/viewport/Group_viewport_main
>>>>> >Group_viewport_scrollPosition_gradient_minus50_450 Failed
>>>>> CompareBitmap,
>>>>> >url =
>>>>>
>>>>> >../viewport/baselines/Group_viewport_scrollPosition_gradient_minus50_450@w
>>>>> >in.pn(body:step 11)  compare returned[object BitmapData]
>>>>> >     [java] gumbo/core/Group/viewport/Group_viewport_main
>>>>> >Group_viewport_scrollPosition_gradient_450_450 Failed CompareBitmap,
>>>>> url
>>>>> >=
>>>>> >
>>>>> ../viewport/baselines/Group_viewport_scrollPosition_gradient_450_450@win.p
>>>>> >n(body:step 11)  compare returned[object BitmapData]
>>>>> >     [java] gumbo/core/Group/viewport/Group_viewport_main
>>>>> >Group_viewport_scrollPosition_gradient_200_200 Failed CompareBitmap,
>>>>> url
>>>>> >=
>>>>> >
>>>>> ../viewport/baselines/Group_viewport_scrollPosition_gradient_200_200@win.p
>>>>> >n(body:step 11)  compare returned[object BitmapData]
>>>>> >     [java] gumbo/core/Group/viewport/Group_viewport_main
>>>>> >Group_viewport_scrollPosition_gradient_minus50_200 Failed
>>>>> CompareBitmap,
>>>>> >url =
>>>>>
>>>>> >../viewport/baselines/Group_viewport_scrollPosition_gradient_minus50_200@w
>>>>> >in.pn(body:step 11)  compare returned[object BitmapData]
>>>>> >     [java] gumbo/core/Group/viewport/Group_viewport_main
>>>>> >Group_viewport_scrollPosition_gradient_200_minus50 Failed
>>>>> CompareBitmap,
>>>>> >url =
>>>>>
>>>>> >../viewport/baselines/Group_viewport_scrollPosition_gradient_200_minus50@w
>>>>> >in.pn(body:step 11)  compare returned[object BitmapData]
>>>>> >     [java] gumbo/core/Group/viewport/Group_viewport_main
>>>>> >Group_viewport_scrollPosition_gradient_450_200 Failed CompareBitmap,
>>>>> url
>>>>> >=
>>>>> >
>>>>> ../viewport/baselines/Group_viewport_scrollPosition_gradient_450_200@win.p
>>>>> >n(body:step 11)  compare returned[object BitmapData]
>>>>> >     [java] gumbo/core/Group/viewport/Group_viewport_main
>>>>> >Group_viewport_scrollPosition_gradient_200_450 Failed CompareBitmap,
>>>>> url
>>>>> >=
>>>>> >
>>>>> ../viewport/baselines/Group_viewport_scrollPosition_gradient_200_450@win.p
>>>>> >n(body:step 11)  compare returned[object BitmapData]
>>>>> >     [java] gumbo/layout3D/properties/layout3D_properties_tester_main
>>>>> >Layout3D_property_offsets_rotation_scale_transform_e1 Failed
>>>>> >CompareBitmap(body:step 18)  compare returned[object BitmapData]
>>>>> >     [java]
>>>>>
>>>>> >resources/ResourceManager/Integration/ResourceManager_Integration_UICompon
>>>>> >ent_resourcesChanged
>>>>> >ResourceManager_Integration_UIComponent_resourcesChanged_localeChain
>>>>> >Failed Timed out
>>>>> >     [java] spark/core/fxg/properties/fxgtemplate_masks mask_clip_mask
>>>>> >Failed CompareBitmap(body:step 1)  compare returned[object BitmapData]
>>>>> >     [java] spark/core/fxg/properties/fxgtemplate_tester
>>>>> >blend_mode_radial_gradient_blends_blend_darken_radialgradient_fill
>>>>> Failed
>>>>> >CompareBitmap(body:step 1)  compare returned[object BitmapData]
>>>>> >     [java] spark/core/fxg/properties/fxgtemplate_tester
>>>>> >blend_mode_radial_gradient_blends_blend_difference_radialgradient_fill
>>>>> >Failed CompareBitmap(body:step 1)  compare returned[object BitmapData]
>>>>> >     [java] spark/core/fxg/properties/fxgtemplate_tester
>>>>> >blend_mode_radial_gradient_blends_blend_hardlight_radialgradient_fill
>>>>> >Failed CompareBitmap(body:step 1)  compare returned[object BitmapData]
>>>>> >     [java] spark/core/fxg/properties/fxgtemplate_tester
>>>>> >blend_mode_radial_gradient_blends_blend_layer_radialgradient_fill
>>>>> Failed
>>>>> >CompareBitmap(body:step 1)  compare returned[object BitmapData]
>>>>> >     [java] spark/core/fxg/properties/fxgtemplate_tester
>>>>> >blend_mode_radial_gradient_blends_blend_multiply_radialgradient_fill
>>>>> >Failed CompareBitmap(body:step 1)  compare returned[object BitmapData]
>>>>> >     [java] spark/core/fxg/properties/fxgtemplate_tester
>>>>> >blend_mode_radial_gradient_blends_blend_normal_radialgradient_fill
>>>>> Failed
>>>>> >CompareBitmap(body:step 1)  compare returned[object BitmapData]
>>>>> >     [java] spark/core/fxg/properties/fxgtemplate_tester
>>>>> >blend_mode_radial_gradient_blends_blend_subtract_radialgradient_fill
>>>>> >Failed CompareBitmap(body:step 1)  compare returned[object BitmapData]
>>>>> >     [java] spark/core/fxg/properties/fxgtemplate_tester
>>>>> >doc_structure_graphic_def Failed CompareBitmap(body:step 1)  compare
>>>>> >returned[object BitmapData]
>>>>> >     [java] spark/core/fxg/properties/fxgtemplate_tester
>>>>> >doc_structure_library_def Failed CompareBitmap(body:step 1)  compare
>>>>> >returned[object BitmapData]
>>>>> >     [java] spark/core/fxg/properties/fxgtemplate_tester
>>>>> >fill_radial_gradient_radial_gradient_fill_path_focal_point Failed
>>>>> >CompareBitmap(body:step 1)  compare returned[object BitmapData]
>>>>> >     [java] spark/core/fxg/properties/fxgtemplate_tester
>>>>> >fill_radial_gradient_radial_gradient_fill_path_interpolation Failed
>>>>> >CompareBitmap(body:step 1)  compare returned[object BitmapData]
>>>>> >     [java] spark/core/fxg/properties/fxgtemplate_tester
>>>>> >fill_radial_gradient_radial_gradient_fill_path_matrix Failed
>>>>> >CompareBitmap(body:step 1)  compare returned[object BitmapData]
>>>>> >     [java] spark/core/fxg/properties/fxgtemplate_tester
>>>>> >fill_radial_gradient_radial_gradient_fill_path_spread Failed
>>>>> >CompareBitmap(body:step 1)  compare returned[object BitmapData]
>>>>> >     [java] spark/core/fxg/properties/fxgtemplate_tester
>>>>> >fill_radial_gradient_radial_gradient_fill_path_spread2 Failed
>>>>> >CompareBitmap(body:step 1)  compare returned[object BitmapData]
>>>>> >     [java] spark/core/fxg/properties/fxgtemplate_tester
>>>>> >fill_radial_gradient_radial_gradient_fill_shape_focal_point Failed
>>>>> >CompareBitmap(body:step 1)  compare returned[object BitmapData]
>>>>> >     [java] spark/core/fxg/properties/fxgtemplate_tester
>>>>> >fill_radial_gradient_radial_gradient_fill_shape_interpolation Failed
>>>>> >CompareBitmap(body:step 1)  compare returned[object BitmapData]
>>>>> >     [java] spark/core/fxg/properties/fxgtemplate_tester
>>>>> >fill_radial_gradient_radial_gradient_fill_shape_matrix Failed
>>>>> >CompareBitmap(body:step 1)  compare returned[object BitmapData]
>>>>> >     [java] spark/core/fxg/properties/fxgtemplate_tester
>>>>> >fill_radial_gradient_radial_gradient_fill_shape_spread Failed
>>>>> >CompareBitmap(body:step 1)  compare returned[object BitmapData]
>>>>> >     [java] spark/core/fxg/properties/fxgtemplate_tester
>>>>> >filters_bevelfilter3 Failed CompareBitmap(body:step 1)  compare
>>>>> >returned[object BitmapData]
>>>>> >     [java] spark/core/fxg/properties/fxgtemplate_tester
>>>>> >filters_blurfilter Failed CompareBitmap(body:step 1)  compare
>>>>> >returned[object BitmapData]
>>>>> >     [java] spark/core/fxg/properties/fxgtemplate_tester
>>>>> >filters_filters_group Failed CompareBitmap(body:step 1)  compare
>>>>> >returned[object BitmapData]
>>>>> >     [java] spark/core/fxg/properties/fxgtemplate_tester
>>>>> >filters_filters_transform Failed CompareBitmap(body:step 1)  compare
>>>>> >returned[object BitmapData]
>>>>> >     [java] spark/core/fxg/properties/fxgtemplate_tester
>>>>> >filters_glowfilter3 Failed CompareBitmap(body:step 1)  compare
>>>>> >returned[object BitmapData]
>>>>> >     [java] spark/core/fxg/properties/fxgtemplate_tester
>>>>> >filters_gradientglowfilter3 Failed CompareBitmap(body:step 1)  compare
>>>>> >returned[object BitmapData]
>>>>> >     [java] spark/core/fxg/properties/fxgtemplate_tester
>>>>> >filters_hue_colormatrixfilter4 Failed CompareBitmap(body:step 1)
>>>>>  compare
>>>>> >returned[object BitmapData]
>>>>> >     [java] spark/core/fxg/properties/fxgtemplate_tester
>>>>> >filters_luminance_colormatrixfilter4 Failed CompareBitmap(body:step 1)
>>>>> >compare returned[object BitmapData]
>>>>> >     [java] spark/core/fxg/properties/fxgtemplate_tester
>>>>> >filters_saturation_colormatrixfilter4 Failed CompareBitmap(body:step
>>>>> 1)
>>>>> >compare returned[object BitmapData]
>>>>> >     [java] spark/core/fxg/properties/fxgtemplate_tester
>>>>> mask_clip_mask
>>>>> >Failed CompareBitmap(body:step 1)  compare returned[object BitmapData]
>>>>> >     [java] spark/core/fxg/properties/fxgtemplate_tester
>>>>> >stroke_radial_gradient_stroke_radial_gradient_stroke_path_focal_point
>>>>> >Failed CompareBitmap(body:step 1)  compare returned[object BitmapData]
>>>>> >     [java] spark/core/fxg/properties/fxgtemplate_tester
>>>>>
>>>>> >stroke_radial_gradient_stroke_radial_gradient_stroke_path_interpolation
>>>>> >Failed CompareBitmap(body:step 1)  compare returned[object BitmapData]
>>>>> >     [java] spark/core/fxg/properties/fxgtemplate_tester
>>>>> >stroke_radial_gradient_stroke_radial_gradient_stroke_path_matrix
>>>>> Failed
>>>>> >CompareBitmap(body:step 1)  compare returned[object BitmapData]
>>>>> >     [java] spark/core/fxg/properties/fxgtemplate_tester
>>>>> >stroke_radial_gradient_stroke_radial_gradient_stroke_path_spread
>>>>> Failed
>>>>> >CompareBitmap(body:step 1)  compare returned[object BitmapData]
>>>>> >     [java] spark/core/fxg/properties/fxgtemplate_tester
>>>>> >stroke_radial_gradient_stroke_radial_gradient_stroke_shape_focal_point
>>>>> >Failed CompareBitmap(body:step 1)  compare returned[object BitmapData]
>>>>> >     [java] spark/core/fxg/properties/fxgtemplate_tester
>>>>>
>>>>> >stroke_radial_gradient_stroke_radial_gradient_stroke_shape_interpolation
>>>>> >Failed CompareBitmap(body:step 1)  compare returned[object BitmapData]
>>>>> >     [java] spark/core/fxg/properties/fxgtemplate_tester
>>>>> >stroke_radial_gradient_stroke_radial_gradient_stroke_shape_matrix
>>>>> Failed
>>>>> >CompareBitmap(body:step 1)  compare returned[object BitmapData]
>>>>> >     [java] spark/core/fxg/properties/fxgtemplate_tester
>>>>> >stroke_radial_gradient_stroke_radial_gradient_stroke_shape_spread
>>>>> Failed
>>>>> >CompareBitmap(body:step 1)  compare returned[object BitmapData]
>>>>> >     [java]
>>>>>
>>>>> >C:\ApacheFlex\git\flex-sdk\mustella\tests\spark\effects\Regression\SWFs\Ca
>>>>> >talystMatrixTransitions.swf  Failed Timed out
>>>>> >     [java]
>>>>> spark/primitives/Ellipse/properties/FXG_Ellipse_PropertiesAS
>>>>> >FXG_Ellipse_RadialGradientStroke_xy_0_0 Failed
>>>>> CompareBitmap(body:step 1)
>>>>> > compare returned[object BitmapData]
>>>>> >     [java]
>>>>> spark/primitives/Ellipse/properties/FXG_Ellipse_PropertiesAS
>>>>> >FXG_Ellipse_RadialGradientStroke_xy_20_0 Failed
>>>>> CompareBitmap(body:step
>>>>> >2)  compare returned[object BitmapData]
>>>>> >     [java]
>>>>> spark/primitives/Ellipse/properties/FXG_Ellipse_PropertiesAS
>>>>> >FXG_Ellipse_RadialGradientStroke_xy_0_20 Failed
>>>>> CompareBitmap(body:step
>>>>> >2)  compare returned[object BitmapData]
>>>>> >     [java]
>>>>> spark/primitives/Ellipse/properties/FXG_Ellipse_PropertiesAS
>>>>> >FXG_Ellipse_RadialGradientStroke_xy_strokeRotation Failed
>>>>> >CompareBitmap(body:step 2)  compare returned[object BitmapData]
>>>>> >     [java]
>>>>> spark/primitives/Ellipse/properties/FXG_Ellipse_PropertiesAS
>>>>> >FXG_Ellipse_RadialGradientStroke_xy_fillRotation Failed
>>>>> >CompareBitmap(body:step 2)  compare returned[object BitmapData]
>>>>> >     [java]
>>>>> spark/primitives/Ellipse/properties/FXG_Ellipse_PropertiesAS
>>>>> >FXG_Ellipse_RadialGradientStroke_fillX Failed CompareBitmap(body:step
>>>>> 2)
>>>>> >compare returned[object BitmapData]
>>>>> >     [java]
>>>>> spark/primitives/Ellipse/properties/FXG_Ellipse_PropertiesAS
>>>>> >FXG_Ellipse_RadialGradientStroke_fillY Failed CompareBitmap(body:step
>>>>> 2)
>>>>> >compare returned[object BitmapData]
>>>>> >     [java]
>>>>> spark/primitives/Ellipse/properties/FXG_Ellipse_PropertiesAS
>>>>> >FXG_Ellipse_RadialGradientStroke_strokeX Failed
>>>>> CompareBitmap(body:step
>>>>> >2)  compare returned[object BitmapData]
>>>>> >     [java]
>>>>> spark/primitives/Ellipse/properties/FXG_Ellipse_PropertiesAS
>>>>> >FXG_Ellipse_RadialGradientStroke_strokeY Failed
>>>>> CompareBitmap(body:step
>>>>> >2)  compare returned[object BitmapData]
>>>>> >     [java]
>>>>> spark/primitives/Ellipse/properties/FXG_Ellipse_PropertiesAS
>>>>> >FXG_Ellipse_Rotation_matrix_onRadialGradient_fill Failed
>>>>> >CompareBitmap(body:step 1)  compare returned[object BitmapData]
>>>>> >     [java]
>>>>> spark/primitives/Ellipse/properties/FXG_Ellipse_PropertiesAS
>>>>> >FXG_Ellipse_XY_matrix_onRadialGradient_fill Failed
>>>>> >CompareBitmap(body:step 1)  compare returned[object BitmapData]
>>>>> >     [java]
>>>>> spark/primitives/Ellipse/properties/FXG_Ellipse_PropertiesAS
>>>>> >FXG_Ellipse_Rotation_matrix_onRadialGradient_stroke Failed
>>>>> >CompareBitmap(body:step 1)  compare returned[object BitmapData]
>>>>> >     [java]
>>>>> spark/primitives/Ellipse/properties/FXG_Ellipse_PropertiesAS
>>>>> >FXG_Ellipse_XY_matrix_onRadialGradient_stroke Failed
>>>>> >CompareBitmap(body:step 1)  compare returned[object BitmapData]
>>>>> >     [java] spark/primitives/Ellipse/properties/FXG_Ellipse_Mirroring
>>>>> >FXG_Ellipse_layoutDirectionRTL_RadialGradientStroke_xy_0_20 Failed
>>>>> >CompareBitmap(body:step 2)  compare returned[object BitmapData]
>>>>> >     [java] spark/primitives/Ellipse/properties/FXG_Ellipse_Mirroring
>>>>> >FXG_Ellipse_layoutDirectionRTL_RadialGradientStroke_strokeY Failed
>>>>> >CompareBitmap(body:step 2)  compare returned[object BitmapData]
>>>>> >     [java] spark/primitives/Rect/properties/FXG_Rect_PropertiesAS
>>>>> >FXG_Rect_RadialGradientStroke_xy_0_0 Failed CompareBitmap(body:step 1)
>>>>> >compare returned[object BitmapData]
>>>>> >     [java] spark/primitives/Rect/properties/FXG_Rect_PropertiesAS
>>>>> >FXG_Rect_RadialGradientStroke_xy_20_0 Failed CompareBitmap(body:step
>>>>> 2)
>>>>> >compare returned[object BitmapData]
>>>>> >     [java] spark/primitives/Rect/properties/FXG_Rect_PropertiesAS
>>>>> >FXG_Rect_RadialGradientStroke_xy_0_20 Failed CompareBitmap(body:step
>>>>> 2)
>>>>> >compare returned[object BitmapData]
>>>>> >     [java] spark/primitives/Rect/properties/FXG_Rect_PropertiesAS
>>>>> >FXG_Rect_RadialGradientStroke_xy_strokeRotation Failed
>>>>> >CompareBitmap(body:step 2)  compare returned[object BitmapData]
>>>>> >     [java] spark/primitives/Rect/properties/FXG_Rect_PropertiesAS
>>>>> >FXG_Rect_RadialGradientStroke_xy_fillRotation Failed
>>>>> >CompareBitmap(body:step 2)  compare returned[object BitmapData]
>>>>> >     [java] spark/primitives/Rect/properties/FXG_Rect_PropertiesAS
>>>>> >FXG_Rect_RadialGradientStroke_fillX Failed CompareBitmap(body:step 2)
>>>>> >compare returned[object BitmapData]
>>>>> >     [java] spark/primitives/Rect/properties/FXG_Rect_PropertiesAS
>>>>> >FXG_Rect_RadialGradientStroke_fillY Failed CompareBitmap(body:step 2)
>>>>> >compare returned[object BitmapData]
>>>>> >     [java] spark/primitives/Rect/properties/FXG_Rect_PropertiesAS
>>>>> >FXG_Rect_RadialGradientStroke_strokeX Failed CompareBitmap(body:step
>>>>> 2)
>>>>> >compare returned[object BitmapData]
>>>>> >     [java] spark/primitives/Rect/properties/FXG_Rect_PropertiesAS
>>>>> >FXG_Rect_RadialGradientStroke_strokeY Failed CompareBitmap(body:step
>>>>> 2)
>>>>> >compare returned[object BitmapData]
>>>>> >     [java] spark/primitives/Rect/properties/FXG_Rect_PropertiesAS
>>>>> >FXG_Rect_Rotation_matrix_onRadialGradient_fill Failed
>>>>> >CompareBitmap(body:step 1)  compare returned[object BitmapData]
>>>>> >     [java] spark/primitives/Rect/properties/FXG_Rect_PropertiesAS
>>>>> >FXG_Rect_XY_matrix_onRadialGradient_fill Failed
>>>>> CompareBitmap(body:step
>>>>> >1)  compare returned[object BitmapData]
>>>>> >     [java] spark/primitives/Rect/properties/FXG_Rect_PropertiesAS
>>>>> >FXG_Rect_Rotation_matrix_onRadialGradient_stroke Failed
>>>>> >CompareBitmap(body:step 1)  compare returned[object BitmapData]
>>>>> >     [java] spark/primitives/Rect/properties/FXG_Rect_PropertiesAS
>>>>> >FXG_Rect_XY_matrix_onRadialGradient_stroke Failed
>>>>> CompareBitmap(body:step
>>>>> >1)  compare returned[object BitmapData]
>>>>> >     [java]
>>>>> >spark/validators/CurrencyValidator/Properties/GVB_source_tester
>>>>> >GVB_source_noproperty_required_test_19 Failed Timed out
>>>>> >     [java]
>>>>> >     [java]
>>>>> >     [java] =====================================================
>>>>> >     [java]     Passes: 35563
>>>>> >     [java]     Fails: 132
>>>>> >     [java] =====================================================
>>>>> >     [java]
>>>>> >     [java]
>>>>> >     [java] Wrote summary to results.txt
>>>>> >     [java] Wrote failures to failures.txt
>>>>> >
>>>>> >BUILD FAILED
>>>>> >C:\ApacheFlex\git\flex-sdk\mustella\build.xml:1538: The following
>>>>> error
>>>>> >occurred while executing this line:
>>>>> >C:\ApacheFlex\git\flex-sdk\mustella\build.xml:1656: Java returned: 1
>>>>> >
>>>>> >Total time: 522 minutes 9 seconds
>>>>> >Build step 'Execute shell' marked build as failure
>>>>>
>>>>>
>>>>
>>>
>>
>

Mime
  • Unnamed multipart/alternative (inline, None, 0 bytes)
View raw message