flex-dev mailing list archives

Site index · List index
Message view « Date » · « Thread »
Top « Date » · « Thread »
From Apache Jenkins Server <jenk...@builds.apache.org>
Subject Build failed in Jenkins: flex-sdk #71
Date Sat, 08 Jun 2013 00:06:12 GMT
See <https://builds.apache.org/job/flex-sdk/71/changes>

Changes:

[bigosmallm] Using algorithm="md5" when generating md5 checksum because .md5 != .MD5

------------------------------------------
[...truncated 205 lines...]

airsdk-clean:
   [delete] Deleting directory <https://builds.apache.org/job/flex-sdk/ws/frameworks\libs\air>

clean:
   [delete] Deleting: <https://builds.apache.org/job/flex-sdk/ws/frameworks\flex-config.xml>

check-tlf-home:

bundles-clean:

clean-external:
     [echo] cleaning <https://builds.apache.org/job/flex-sdk/ws/../flex-tlf>
     [echo] FLEX_HOME is <https://builds.apache.org/job/flex-sdk/ws/>
  [taskdef] Could not load definitions from resource flexTasks.tasks. It could not be found.

clean:
   [delete] Deleting directory f:\hudson\hudson-slave\workspace\flex-tlf\bin
   [delete] Deleting: f:\hudson\hudson-slave\workspace\flex-tlf\bundles.properties

clean:

bundles-clean:

pixelbender-clean:

assets-clean:

clean:

bundles-clean:

clean:

bundles-clean:

assets-clean:

clean:

bundles-clean:

clean:

bundles-clean:

clean:

clean:

clean:

bundles-clean:

pixelbender-clean:

clean:

clean:

clean:

clean:

clean:

bundles-clean:

clean:

bundles-clean:

clean:

clean:

bundles-clean:

clean:

bundles-clean:

clean:

bundles-clean:

clean:

bundles-clean:

clean:

clean:

clean:
   [delete] Deleting: <https://builds.apache.org/job/flex-sdk/ws/frameworks\themes\AeonGraphical\AeonGraphical.swf>
   [delete] Deleting directory <https://builds.apache.org/job/flex-sdk/ws/frameworks\libs>
   [delete] Deleting: <https://builds.apache.org/job/flex-sdk/ws/frameworks\localFonts.ser>
   [delete] Deleting: <https://builds.apache.org/job/flex-sdk/ws/frameworks\macFonts.ser>
   [delete] Deleting: <https://builds.apache.org/job/flex-sdk/ws/frameworks\winFonts.ser>

frameworks-rsls-clean:

package-clean:

clean-temp:
   [delete] Deleting directory <https://builds.apache.org/job/flex-sdk/ws/temp>

clean-dependencychecker:

checkintests-clean:
   [delete] Deleting: <https://builds.apache.org/job/flex-sdk/ws/frameworks\tests\basicTests\BasicTests.swf>
   [delete] Deleting: <https://builds.apache.org/job/flex-sdk/ws/frameworks\tests\basicTests\basicLoader.swf>
   [delete] Deleting: <https://builds.apache.org/job/flex-sdk/ws/frameworks\tests\basicTests\spark\views\HelloWorld.swf>
   [delete] Deleting: <https://builds.apache.org/job/flex-sdk/ws/frameworks\tests\basicTests\spark\views\StyleManagerModuleTest.swf>
   [delete] Deleting: <https://builds.apache.org/job/flex-sdk/ws/mustella\MustellaResultsParser.class>
 [loadfile] <https://builds.apache.org/job/flex-sdk/ws/mustella\local.properties> doesn't
exist

cleanmustellaswc:
   [delete] Deleting: <https://builds.apache.org/job/flex-sdk/ws/mustella\mustella.swc>

clean:
   [delete] Deleting: <https://builds.apache.org/job/flex-sdk/ws/flex-sdk-description.xml>

clean:

clean:
   [delete] Deleting directory <https://builds.apache.org/job/flex-sdk/ws/ide\flashbuilder\config>
 [loadfile] <https://builds.apache.org/job/flex-sdk/ws/mustella\local.properties> doesn't
exist

cleanswfs:

clean:
     [echo] Deleting old results and files from previous testsuite build.
   [delete] Deleting directory <https://builds.apache.org/job/flex-sdk/ws/mustella\tmp>

super-clean:

BUILD SUCCESSFUL
Total time: 17 seconds
[flex-sdk] $ cmd.exe /C '"f:\hudson\hudson-slave\tools\hudson.tasks.Ant_AntInstallation\ant-1.8.2\bin\ant.bat
-file jenkins.xml main && exit %%ERRORLEVEL%%"'
Buildfile: <https://builds.apache.org/job/flex-sdk/ws/jenkins.xml>

clean:
   [delete] Deleting directory <https://builds.apache.org/job/flex-sdk/ws/air>

airsdk-check:

airsdk-download:
     [echo] Be patient.  This takes a few minutes...
    [mkdir] Created dir: <https://builds.apache.org/job/flex-sdk/ws/air>
    [mkdir] Created dir: <https://builds.apache.org/job/flex-sdk/ws/temp>
      [get] Getting: http://airdownload.adobe.com/air/win/download/3.7/AdobeAIRSDK.zip
      [get] To: <https://builds.apache.org/job/flex-sdk/ws/temp\AIR> Integration Kit.zip
    [unzip] Expanding: <https://builds.apache.org/job/flex-sdk/ws/temp\AIR> Integration
Kit.zip into <https://builds.apache.org/job/flex-sdk/ws/air\AIR> Integration Kit
     [copy] Copying 1 file to <https://builds.apache.org/job/flex-sdk/ws/lib\air>

playerglobal-check:

playerglobal-settarget:

playerglobal10.2-download:

playerglobal10.3-download:

playerglobal11.0-download:

playerglobal11.1-download:
    [mkdir] Created dir: <https://builds.apache.org/job/flex-sdk/ws/lib\player\11.1>
      [get] Getting: http://download.macromedia.com/pub/flashplayer/updaters/11/playerglobal11_1.swc
      [get] To: <https://builds.apache.org/job/flex-sdk/ws/lib\player\11.1\playerglobal.swc>

playerglobal11.2-download:

playerglobal11.3-download:

playerglobal11.4-download:

playerglobal11.5-download:

playerglobal11.6-download:

playerglobal-download:

thirdparty-downloads:

main:

BUILD SUCCESSFUL
Total time: 44 seconds
[flex-sdk] $ cmd.exe /C '"f:\hudson\hudson-slave\tools\hudson.tasks.Ant_AntInstallation\ant-1.8.2\bin\ant.bat
-file build.xml -Dbuild.number=2013-06-08_00-04-35 -Dbuild.noprompt=true main checkintests
&& exit %%ERRORLEVEL%%"'
Buildfile: <https://builds.apache.org/job/flex-sdk/ws/build.xml>

check-playerglobal-home:
     [echo] PLAYERGLOBAL_HOME is <https://builds.apache.org/job/flex-sdk/ws/lib/player>
     [echo] playerglobal.version is 11.1
     [echo] playerglobal.swc is <https://builds.apache.org/job/flex-sdk/ws/lib/player/11.1/playerglobal.swc>

check-air-home:
     [echo] AIR_HOME is <https://builds.apache.org/job/flex-sdk/ws/air/AIR> Integration
Kit

check-pixelbender-home:
     [echo] PIXELBENDER_HOME is C:/Program Files (x86)/Adobe/Adobe Utilities - CS5/Pixel Bender
Toolkit 2

check-tlf-home:

check-compile-env:
     [echo] OS: Windows Server 2008 / 6.0 / amd64
     [echo] VM: Java HotSpot(TM) 64-Bit Server VM / 20.2-b06
     [echo] Java: 1.6.0_27
     [echo] Ant: Apache Ant(TM) version 1.8.2 compiled on December 20 2010 Ant Java Version:
1.6

thirdparty-downloads:

thirdparty-downloads:

swfobject-check:

swfobject-download:
    [mkdir] Created dir: <https://builds.apache.org/job/flex-sdk/ws/in>
      [get] Getting: http://swfobject.googlecode.com/files/swfobject_2_2.zip
      [get] To: <https://builds.apache.org/job/flex-sdk/ws/in\swfobject_2_2.zip>
    [unzip] Expanding: <https://builds.apache.org/job/flex-sdk/ws/in\swfobject_2_2.zip>
into <https://builds.apache.org/job/flex-sdk/ws/templates>

swfobject-fabridge-download:
     [copy] Copying 1 file to <https://builds.apache.org/job/flex-sdk/ws/frameworks\javascript\FABridge\samples\fabridge\swfobject>

osmf-check:

osmf-download:

ask-osmf:

download-osmf-zip:
      [get] Getting: http://sourceforge.net/projects/osmf.adobe/files/OSMF%201.0%20%28final%20source%2C%20ASDocs%2C%20PDF%20guides%2C%20and%20release%20notes%29/OSMF_1.0.zip/download
      [get] To: <https://builds.apache.org/job/flex-sdk/ws/in\OSMF_1.0.zip>
      [get] Error opening connection java.io.IOException: Server returned HTTP response code:
503 for URL: http://sourceforge.net/projects/osmf.adobe/files/OSMF%201.0%20%28final%20source%2C%20ASDocs%2C%20PDF%20guides%2C%20and%20release%20notes%29/OSMF_1.0.zip/download
      [get] Error opening connection java.io.IOException: Server returned HTTP response code:
503 for URL: http://sourceforge.net/projects/osmf.adobe/files/OSMF%201.0%20%28final%20source%2C%20ASDocs%2C%20PDF%20guides%2C%20and%20release%20notes%29/OSMF_1.0.zip/download
      [get] Error opening connection java.io.IOException: Server returned HTTP response code:
503 for URL: http://sourceforge.net/projects/osmf.adobe/files/OSMF%201.0%20%28final%20source%2C%20ASDocs%2C%20PDF%20guides%2C%20and%20release%20notes%29/OSMF_1.0.zip/download
      [get] Can't get http://sourceforge.net/projects/osmf.adobe/files/OSMF%201.0%20%28final%20source%2C%20ASDocs%2C%20PDF%20guides%2C%20and%20release%20notes%29/OSMF_1.0.zip/download
to <https://builds.apache.org/job/flex-sdk/ws/in\OSMF_1.0.zip>

BUILD FAILED
<https://builds.apache.org/job/flex-sdk/ws/build.xml>:135: The following error occurred
while executing this line:
<https://builds.apache.org/job/flex-sdk/ws/frameworks\build.xml>:100: The following
error occurred while executing this line:
<https://builds.apache.org/job/flex-sdk/ws/frameworks\downloads.xml>:125: The following
error occurred while executing this line:
<https://builds.apache.org/job/flex-sdk/ws/frameworks\downloads.xml>:144: Can't get
http://sourceforge.net/projects/osmf.adobe/files/OSMF%201.0%20%28final%20source%2C%20ASDocs%2C%20PDF%20guides%2C%20and%20release%20notes%29/OSMF_1.0.zip/download
to <https://builds.apache.org/job/flex-sdk/ws/in\OSMF_1.0.zip>

Total time: 6 seconds
Build step 'Invoke Ant' marked build as failure

Mime
View raw message