flex-commits mailing list archives

Site index · List index
Message view « Date » · « Thread »
Top « Date » · « Thread »
From flex.ci.bui...@gmail.com
Subject Build failed in Jenkins: flex-utilities_installer #1300
Date Sat, 14 Oct 2017 09:09:48 GMT
See <http://apacheflexbuild.cloudapp.net:8080/job/flex-utilities_installer/1300/>

------------------------------------------
Started by timer
Building remotely on flex_sdk_slave2 in workspace <http://apacheflexbuild.cloudapp.net:8080/job/flex-utilities_installer/ws/>
 > C:\Program Files (x86)\Git\cmd\git.exe rev-parse --is-inside-work-tree # timeout=10
Fetching changes from the remote Git repository
 > C:\Program Files (x86)\Git\cmd\git.exe config remote.origin.url https://git-wip-us.apache.org/repos/asf/flex-utilities.git
# timeout=10
Fetching upstream changes from https://git-wip-us.apache.org/repos/asf/flex-utilities.git
 > C:\Program Files (x86)\Git\cmd\git.exe --version # timeout=10
 > C:\Program Files (x86)\Git\cmd\git.exe fetch --tags --progress https://git-wip-us.apache.org/repos/asf/flex-utilities.git
+refs/heads/*:refs/remotes/origin/*
 > C:\Program Files (x86)\Git\cmd\git.exe rev-parse "origin/develop^{commit}" # timeout=10
Checking out Revision b1a013c9694699081277dca2b690655cc9dbe6fc (origin/develop)
 > C:\Program Files (x86)\Git\cmd\git.exe config core.sparsecheckout # timeout=10
 > C:\Program Files (x86)\Git\cmd\git.exe checkout -f b1a013c9694699081277dca2b690655cc9dbe6fc
 > C:\Program Files (x86)\Git\cmd\git.exe rev-list b1a013c9694699081277dca2b690655cc9dbe6fc
# timeout=10
[ant_on_air] $ cmd.exe /C "c:\Jenkins\tools\hudson.tasks.Ant_AntInstallation\c_apache-ant-1.9.3\bin\ant.bat
-file build.xml -Dplayerglobal.version=11.7 main && exit %%ERRORLEVEL%%"
Buildfile: <http://apacheflexbuild.cloudapp.net:8080/job/flex-utilities_installer/ws/flex-installer/ant_on_air/build.xml>

clean:

init:

check-as3commons.swc:

get-as3commons.swc:

third-party:
      [get] Getting: http://as3-simple-untar.googlecode.com/svn/trunk/src/de/ketzler/utils/SimpleUntar.as
      [get] To: <http://apacheflexbuild.cloudapp.net:8080/job/flex-utilities_installer/ws/flex-installer/ant_on_air/external/de/ketzler/utils/SimpleUntar.as>
      [get] Error opening connection java.io.FileNotFoundException: http://as3-simple-untar.googlecode.com/svn/trunk/src/de/ketzler/utils/SimpleUntar.as
      [get] Error opening connection java.io.FileNotFoundException: http://as3-simple-untar.googlecode.com/svn/trunk/src/de/ketzler/utils/SimpleUntar.as
      [get] Error opening connection java.io.FileNotFoundException: http://as3-simple-untar.googlecode.com/svn/trunk/src/de/ketzler/utils/SimpleUntar.as
      [get] Can't get http://as3-simple-untar.googlecode.com/svn/trunk/src/de/ketzler/utils/SimpleUntar.as
to <http://apacheflexbuild.cloudapp.net:8080/job/flex-utilities_installer/ws/flex-installer/ant_on_air/external/de/ketzler/utils/SimpleUntar.as>

BUILD FAILED
<http://apacheflexbuild.cloudapp.net:8080/job/flex-utilities_installer/ws/flex-installer/ant_on_air/build.xml>:85:
Can't get http://as3-simple-untar.googlecode.com/svn/trunk/src/de/ketzler/utils/SimpleUntar.as
to <http://apacheflexbuild.cloudapp.net:8080/job/flex-utilities_installer/ws/flex-installer/ant_on_air/external/de/ketzler/utils/SimpleUntar.as>

Total time: 1 second
Picked up JAVA_TOOL_OPTIONS: -Dfile.encoding=UTF8
Build step 'Invoke Ant' marked build as failure
Archiving artifacts

Mime
View raw message