flex-commits mailing list archives

Site index · List index
Message view « Date » · « Thread »
Top « Date » · « Thread »
From flex.ci.bui...@gmail.com
Subject Build failed in Jenkins: flex-asjs-dual #80
Date Mon, 24 Apr 2017 17:29:56 GMT
See <http://apacheflexbuild.cloudapp.net:8080/job/flex-asjs-dual/80/>

------------------------------------------
[...truncated 7447 lines...]
    [mxmlc] Dependencies calculated for 'org.apache.flex.core.ILayoutChild'
    [mxmlc] Dependencies calculated for 'org.apache.flex.core.IBeadController'
    [mxmlc] Dependencies calculated for 'org.apache.flex.core.IBeadView'
    [mxmlc] Dependencies calculated for 'org.apache.flex.core.IMeasurementBead'
    [mxmlc] Dependencies calculated for 'org.apache.flex.utils.StringUtil'
    [mxmlc] Dependencies calculated for 'org.apache.flex.utils.StringTrimmer'
    [mxmlc] Dependencies calculated for 'org.apache.flex.utils.MXMLDataInterpreter'
    [mxmlc] Dependencies calculated for 'org.apache.flex.core.IContainer'
    [mxmlc] Dependencies calculated for 'org.apache.flex.core.IDocument'
    [mxmlc] Dependencies calculated for 'org.apache.flex.core.IMXMLDocument'
    [mxmlc] Dependencies calculated for 'org.apache.flex.utils.Timer'
    [mxmlc] Dependencies calculated for 'org.apache.flex.core.SimpleCSSValuesImpl'
    [mxmlc] Dependencies calculated for 'org.apache.flex.core.IValuesImpl'
    [mxmlc] Dependencies calculated for 'org.apache.flex.core.ICSSImpl'
    [mxmlc] Dependencies calculated for 'org.apache.flex.events.ValueChangeEvent'
    [mxmlc] Dependencies calculated for 'org.apache.flex.utils.CSSUtils'
    [mxmlc] Dependencies calculated for 'org.apache.flex.utils.StringPadder'
    [mxmlc] Dependencies calculated for 'BasicTests'
    [mxmlc] Dependencies calculated for 'org.apache.flex.core.View'
    [mxmlc] Dependencies calculated for 'org.apache.flex.core.ViewBase'
    [mxmlc] Dependencies calculated for 'org.apache.flex.core.GroupBase'
    [mxmlc] Dependencies calculated for 'org.apache.flex.core.IStatesObject'
    [mxmlc] Dependencies calculated for 'org.apache.flex.core.ILayoutParent'
    [mxmlc] Dependencies calculated for 'org.apache.flex.core.ILayoutView'
    [mxmlc] Dependencies calculated for 'org.apache.flex.core.IContentViewHost'
    [mxmlc] Dependencies calculated for 'org.apache.flex.core.IBeadLayout'
    [mxmlc] Dependencies calculated for 'org.apache.flex.core.ILayoutHost'
    [mxmlc] Dependencies calculated for 'org.apache.flex.core.IStatesImpl'
    [mxmlc] Dependencies calculated for 'org.apache.flex.core.IApplicationView'
    [mxmlc] Dependencies calculated for 'org.apache.flex.states.State'
    [mxmlc] Dependencies calculated for 'halo.views.ButtonTests'
    [mxmlc] Dependencies calculated for 'shim.VBox'
    [mxmlc] Dependencies calculated for 'org.apache.flex.html.Container'
    [mxmlc] Dependencies calculated for 'org.apache.flex.core.ContainerBase'
    [mxmlc] Dependencies calculated for 'org.apache.flex.core.IStrandPrivate'
    [mxmlc] Dependencies calculated for 'org.apache.flex.core.ContainerBaseStrandChildren'
    [mxmlc] Dependencies calculated for 'org.apache.flex.html.beads.layouts.VerticalLayout'
    [mxmlc] Dependencies calculated for 'org.apache.flex.core.LayoutBase'
    [mxmlc] Dependencies calculated for 'org.apache.flex.html.TextButton'
    [mxmlc] Dependencies calculated for 'org.apache.flex.html.Button'
    [mxmlc] Dependencies calculated for 'org.apache.flex.html.ButtonBase'
    [mxmlc] Dependencies calculated for 'org.apache.flex.html.Label'
    [mxmlc] Dependencies calculated for 'org.apache.flex.events.MouseEvent'
    [mxmlc] Dependencies calculated for 'org.apache.flex.geom.Point'
    [mxmlc] Dependencies calculated for 'org.apache.flex.utils.PointUtils'
    [mxmlc] Dependencies calculated for 'halo.views.CheckBoxTests'
    [mxmlc] Dependencies calculated for 'org.apache.flex.html.CheckBox'
    [mxmlc] Dependencies calculated for 'org.apache.flex.html.supportClasses.CheckBoxIcon'
    [mxmlc] Dependencies calculated for 'org.apache.flex.states.AddItems'
    [mxmlc] Dependencies calculated for 'org.apache.flex.states.ItemAndDescriptor'
    [mxmlc] Dependencies calculated for 'org.apache.flex.utils.MixinManager'
    [mxmlc] Dependencies calculated for 'org.apache.flex.core.CSSFontFaceBead'
    [mxmlc] Dependencies calculated for 'ExitWhenDone'
    [mxmlc] Dependencies calculated for 'FlexJSContext'
    [mxmlc] Dependencies calculated for 'SendFormattedResultsToLog'
    [mxmlc] Dependencies calculated for 'SetShowRTE'
    [mxmlc] Dependencies calculated for 'halo.scripts.ButtonTestScript'
    [mxmlc] Dependencies calculated for 'UnitTester'
    [mxmlc] Dependencies calculated for 'TestCase'
    [mxmlc] Dependencies calculated for 'SetProperty'
    [mxmlc] Dependencies calculated for 'AssertPropertyValue'
    [mxmlc] Dependencies calculated for 'DispatchMouseEvent'
    [mxmlc] Dependencies calculated for 'DispatchMouseClickEvent'
    [mxmlc] Dependencies calculated for 'halo.scripts.CheckBoxTestScript'
    [mxmlc] Dependencies calculated for 'org.apache.flex.html.beads.layouts.BasicLayout'
    [mxmlc] Dependencies calculated for 'org.apache.flex.html.supportClasses.Viewport'
    [mxmlc] Dependencies calculated for 'org.apache.flex.core.IViewport'
    [mxmlc] Dependencies calculated for 'org.apache.flex.core.IContentView'
    [mxmlc] Dependencies calculated for 'org.apache.flex.html.beads.ContainerView'
    [mxmlc] Dependencies calculated for 'org.apache.flex.html.beads.GroupView'
    [mxmlc] Dependencies calculated for 'org.apache.flex.core.BeadViewBase'
    [mxmlc] Dependencies calculated for 'org.apache.flex.html.beads.models.ViewportModel'
    [mxmlc] Dependencies calculated for 'org.apache.flex.core.IViewportModel'
    [mxmlc] Dependencies calculated for 'org.apache.flex.html.beads.layouts.HorizontalLayout'
    [mxmlc] Dependencies calculated for 'org.apache.flex.html.supportClasses.ScrollingViewport'
    [mxmlc] Dependencies calculated for 'org.apache.flex.html.beads.layouts.HorizontalFlexLayout'
    [mxmlc] Dependencies calculated for 'org.apache.flex.utils.EffectTimer'
    [mxmlc] Dependencies calculated for 'org.apache.flex.core.IEffectTimer'
    [mxmlc] Dependencies calculated for 'org.apache.flex.events.ValueEvent'
    [mxmlc] Dependencies calculated for 'org.apache.flex.core.SimpleStatesImpl'
    [mxmlc] Dependencies calculated for 'org.apache.flex.states.SetEventHandler'
    [mxmlc] Dependencies calculated for 'org.apache.flex.states.SetProperty'
    [mxmlc] The project 'BasicTestsApp' has been successfully compiled and optimized.
    [mxmlc] 70.7294045 seconds
    [mxmlc] Picked up JAVA_TOOL_OPTIONS: -Dfile.encoding=UTF8
     [copy] Copying 1 file to <http://apacheflexbuild.cloudapp.net:8080/job/flex-asjs-dual/ws/mustella/tests/basicTests/fonts>
     [echo] launching player and swf

mustellaresultsparser:
     [java] results: PASSED

basictests-mustella:

marmotinni-setup:

prepare:
     [echo] Making lib directory <http://apacheflexbuild.cloudapp.net:8080/job/flex-asjs-dual/ws/marmotinni/java/c>:\Jenkins\workspace\flex-asjs-dual\marmotinni\java/lib
    [mkdir] Created dir: <http://apacheflexbuild.cloudapp.net:8080/job/flex-asjs-dual/ws/marmotinni/java/lib>

selenium2-jar-check:

selenium2-jar:
    [mkdir] Created dir: <http://apacheflexbuild.cloudapp.net:8080/job/flex-asjs-dual/ws/marmotinni/java/lib/selenium>

download-zip:
    [mkdir] Created dir: <http://apacheflexbuild.cloudapp.net:8080/job/flex-asjs-dual/ws/marmotinni/java/in>
      [get] Getting: http://selenium-release.storage.googleapis.com/2.53/selenium-java-2.53.1.zip
      [get] To: <http://apacheflexbuild.cloudapp.net:8080/job/flex-asjs-dual/ws/marmotinni/java/in/selenium-java-2.53.1.zip>

untar-file:

unzip-file:
    [unzip] Expanding: <http://apacheflexbuild.cloudapp.net:8080/job/flex-asjs-dual/ws/marmotinni/java/in/selenium-java-2.53.1.zip>
into <http://apacheflexbuild.cloudapp.net:8080/job/flex-asjs-dual/ws/marmotinni/java/in/temp>

check-sum:

copy-downloaded-jar:
      [get] Getting: http://www.apache.org/licenses/LICENSE-2.0
      [get] To: <http://apacheflexbuild.cloudapp.net:8080/job/flex-asjs-dual/ws/marmotinni/java/lib/selenium/selenium-LICENSE.txt>
     [copy] Copying 26 files to <http://apacheflexbuild.cloudapp.net:8080/job/flex-asjs-dual/ws/marmotinni/java/lib/selenium>

clean:

main:

basictests-compile-js:

basictests-compile-java:
   [delete] Deleting directory <http://apacheflexbuild.cloudapp.net:8080/job/flex-asjs-dual/ws/mustella/java/bin>
    [mkdir] Created dir: <http://apacheflexbuild.cloudapp.net:8080/job/flex-asjs-dual/ws/mustella/java/bin>
    [javac] <http://apacheflexbuild.cloudapp.net:8080/job/flex-asjs-dual/ws/build.xml>:1285:
warning: 'includeantruntime' was not set, defaulting to build.sysclasspath=last; set to false
for repeatable builds
    [javac] Compiling 11 source files to <http://apacheflexbuild.cloudapp.net:8080/job/flex-asjs-dual/ws/mustella/java/bin>

basictests-run-js:
     [echo] url=file://<http://apacheflexbuild.cloudapp.net:8080/job/flex-asjs-dual/ws/mustella/tests/basicTests/bin/js-debug/index.html>
     [echo] script=<http://apacheflexbuild.cloudapp.net:8080/job/flex-asjs-dual/ws/mustella/tests/basicTests/halo/scripts/ButtonTestScript.mxml>
     [echo] script=<http://apacheflexbuild.cloudapp.net:8080/job/flex-asjs-dual/ws/mustella/tests/basicTests/halo/scripts/CheckBoxTestScript.mxml>
     [java] file://<http://apacheflexbuild.cloudapp.net:8080/job/flex-asjs-dual/ws/mustella/tests/basicTests/bin/js-debug/index.html>
     [java] org.openqa.selenium.firefox.NotConnectedException: Unable to connect to host 127.0.0.1
on port 7055 after 45000 ms. Firefox console output:
     [java] 	Updating XPIState for {"id":"loop@mozilla.org","syncGUID":"rB2dpn5kbs0I","location":"app-system-defaults","version":"0.1","type":"extension","internalName":null,"updateURL":null,"updateKey":null,"optionsURL":null,"optionsType":null,"aboutURL":null,"icons":{},"iconURL":null,"icon64URL":null,"defaultLocale":{"name":"Firefox
Hello Beta","description":"Web sharing for Firefox","creator":"Mozilla","homepageURL":null},"visible":true,"active":true,"userDisabled":false,"appDisabled":false,"descriptor":"C:\\Program
Files (x86)\\Mozilla Firefox\\browser\\features\\loop@mozilla.org.xpi","installDate":1457051706000,"updateDate":1457051706000,"applyBackgroundUpdates":1,"bootstrap":true,"skinnable":false,"size":3086125,"sourceURI":null,"releaseNotesURI":null,"softDisabled":false,"foreignInstall":false,"hasBinaryComponents":false,"strictCompatibility":false,"locales":[],"targetApplications":[{"id":"{ec8030f7-c20a-464f-9b0e-13a3a9e97384}","minVersion":"45.0a1","maxVersion":"45.0"},{"id":"xpcshell@tests.mozilla.org","minVersion":"0","maxVersion":"10"}],"targetPlatforms":[],"multiprocessCompatible":false,"seen":true}
     [java] 1493054968529	addons.xpi	DEBUG	getModTime: Recursive scan of loop@mozilla.org
     [java] 1493054968529	addons.xpi	DEBUG	Updating XPIState for {"id":"{972ce4c6-7e08-4474-a285-3208198ce6fd}","syncGUID":"A57kSiJFY8XG","location":"app-global","version":"45.0","type":"theme","internalName":"classic/1.0","updateURL":null,"updateKey":null,"optionsURL":null,"optionsType":null,"aboutURL":null,"icons":{"32":"icon.png","48":"icon.png"},"iconURL":null,"icon64URL":null,"defaultLocale":{"name":"Default","description":"The
default theme.","creator":"Mozilla","homepageURL":null,"contributors":["Mozilla Contributors"]},"visible":true,"active":true,"userDisabled":false,"appDisabled":false,"descriptor":"C:\\Program
Files (x86)\\Mozilla Firefox\\browser\\extensions\\{972ce4c6-7e08-4474-a285-3208198ce6fd}.xpi","installDate":1457051706000,"updateDate":1457051706000,"applyBackgroundUpdates":1,"skinnable":true,"size":22006,"sourceURI":null,"releaseNotesURI":null,"softDisabled":false,"foreignInstall":false,"hasBinaryComponents":false,"strictCompatibility":true,"locales":[],"targetApplications":[{"id":"{ec8030f7-c20a-464f-9b0e-13a3a9e97384}","minVersion":"45.0","maxVersion":"45.0"}],"targetPlatforms":[],"seen":true}
     [java] 1493054968529	addons.xpi	DEBUG	getModTime: Recursive scan of {972ce4c6-7e08-4474-a285-3208198ce6fd}
     [java] 1493054968530	DeferredSave.extensions.json	DEBUG	Save changes
     [java] 1493054968530	addons.xpi	DEBUG	Updating database with changes to installed add-ons
     [java] 1493054968530	addons.xpi-utils	DEBUG	Updating add-on states
     [java] 1493054968537	addons.xpi-utils	DEBUG	Writing add-ons list
     [java] 1493054968540	addons.xpi	DEBUG	Registering manifest for C:\Program Files (x86)\Mozilla
Firefox\browser\features\loop@mozilla.org.xpi
     [java] 1493054968547	addons.xpi	DEBUG	Calling bootstrap method startup on loop@mozilla.org
version 0.1
     [java] 1493054968586	addons.manager	DEBUG	Starting provider: <unnamed-provider>
     [java] 1493054968586	addons.manager	DEBUG	Registering shutdown blocker for <unnamed-provider>
     [java] 1493054968587	addons.manager	DEBUG	Provider finished startup: <unnamed-provider>
     [java] 1493054968657	addons.manager	DEBUG	Registering shutdown blocker for XPIProvider
     [java] 1493054968657	addons.manager	DEBUG	Provider finished startup: XPIProvider
     [java] 1493054968657	addons.manager	DEBUG	Starting provider: LightweightThemeManager
     [java] 1493054968657	addons.manager	DEBUG	Registering shutdown blocker for LightweightThemeManager
     [java] 1493054968658	addons.manager	DEBUG	Provider finished startup: LightweightThemeManager
     [java] 1493054968665	addons.manager	DEBUG	Starting provider: GMPProvider
     [java] 1493054968676	addons.manager	DEBUG	Registering shutdown blocker for GMPProvider
     [java] 1493054968677	addons.manager	DEBUG	Provider finished startup: GMPProvider
     [java] 1493054968677	addons.manager	DEBUG	Starting provider: PluginProvider
     [java] 1493054968677	addons.manager	DEBUG	Registering shutdown blocker for PluginProvider
     [java] 1493054968696	addons.manager	DEBUG	Provider finished startup: PluginProvider
     [java] 1493054968697	addons.manager	DEBUG	Completed startup sequence
     [java] 
     [java] 	at org.openqa.selenium.firefox.internal.NewProfileExtensionConnection.start(NewProfileExtensionConnection.java:112)
     [java] 	at org.openqa.selenium.firefox.FirefoxDriver.startClient(FirefoxDriver.java:271)
     [java] 	at org.openqa.selenium.remote.RemoteWebDriver.<init>(RemoteWebDriver.java:119)
     [java] 	at org.openqa.selenium.firefox.FirefoxDriver.<init>(FirefoxDriver.java:218)
     [java] 	at org.openqa.selenium.firefox.FirefoxDriver.<init>(FirefoxDriver.java:211)
     [java] 	at org.openqa.selenium.firefox.FirefoxDriver.<init>(FirefoxDriver.java:207)
     [java] 	at org.openqa.selenium.firefox.FirefoxDriver.<init>(FirefoxDriver.java:120)
     [java] 	at marmotinni.MarmotinniRunner.main(Unknown Source)
     [java] Exception in thread "main" org.openqa.selenium.WebDriverException: Failed to connect
to binary FirefoxBinary(C:\Program Files (x86)\Mozilla Firefox\firefox.exe) on port 7055;
process output follows: 
     [java] 	Updating XPIState for {"id":"loop@mozilla.org","syncGUID":"rB2dpn5kbs0I","location":"app-system-defaults","version":"0.1","type":"extension","internalName":null,"updateURL":null,"updateKey":null,"optionsURL":null,"optionsType":null,"aboutURL":null,"icons":{},"iconURL":null,"icon64URL":null,"defaultLocale":{"name":"Firefox
Hello Beta","description":"Web sharing for Firefox","creator":"Mozilla","homepageURL":null},"visible":true,"active":true,"userDisabled":false,"appDisabled":false,"descriptor":"C:\\Program
Files (x86)\\Mozilla Firefox\\browser\\features\\loop@mozilla.org.xpi","installDate":1457051706000,"updateDate":1457051706000,"applyBackgroundUpdates":1,"bootstrap":true,"skinnable":false,"size":3086125,"sourceURI":null,"releaseNotesURI":null,"softDisabled":false,"foreignInstall":false,"hasBinaryComponents":false,"strictCompatibility":false,"locales":[],"targetApplications":[{"id":"{ec8030f7-c20a-464f-9b0e-13a3a9e97384}","minVersion":"45.0a1","maxVersion":"45.0"},{"id":"xpcshell@tests.mozilla.org","minVersion":"0","maxVersion":"10"}],"targetPlatforms":[],"multiprocessCompatible":false,"seen":true}
     [java] 1493054968529	addons.xpi	DEBUG	getModTime: Recursive scan of loop@mozilla.org
     [java] 1493054968529	addons.xpi	DEBUG	Updating XPIState for {"id":"{972ce4c6-7e08-4474-a285-3208198ce6fd}","syncGUID":"A57kSiJFY8XG","location":"app-global","version":"45.0","type":"theme","internalName":"classic/1.0","updateURL":null,"updateKey":null,"optionsURL":null,"optionsType":null,"aboutURL":null,"icons":{"32":"icon.png","48":"icon.png"},"iconURL":null,"icon64URL":null,"defaultLocale":{"name":"Default","description":"The
default theme.","creator":"Mozilla","homepageURL":null,"contributors":["Mozilla Contributors"]},"visible":true,"active":true,"userDisabled":false,"appDisabled":false,"descriptor":"C:\\Program
Files (x86)\\Mozilla Firefox\\browser\\extensions\\{972ce4c6-7e08-4474-a285-3208198ce6fd}.xpi","installDate":1457051706000,"updateDate":1457051706000,"applyBackgroundUpdates":1,"skinnable":true,"size":22006,"sourceURI":null,"releaseNotesURI":null,"softDisabled":false,"foreignInstall":false,"hasBinaryComponents":false,"strictCompatibility":true,"locales":[],"targetApplications":[{"id":"{ec8030f7-c20a-464f-9b0e-13a3a9e97384}","minVersion":"45.0","maxVersion":"45.0"}],"targetPlatforms":[],"seen":true}
     [java] 1493054968529	addons.xpi	DEBUG	getModTime: Recursive scan of {972ce4c6-7e08-4474-a285-3208198ce6fd}
     [java] 1493054968530	DeferredSave.extensions.json	DEBUG	Save changes
     [java] 1493054968530	addons.xpi	DEBUG	Updating database with changes to installed add-ons
     [java] 1493054968530	addons.xpi-utils	DEBUG	Updating add-on states
     [java] 1493054968537	addons.xpi-utils	DEBUG	Writing add-ons list
     [java] 1493054968540	addons.xpi	DEBUG	Registering manifest for C:\Program Files (x86)\Mozilla
Firefox\browser\features\loop@mozilla.org.xpi
     [java] 1493054968547	addons.xpi	DEBUG	Calling bootstrap method startup on loop@mozilla.org
version 0.1
     [java] 1493054968586	addons.manager	DEBUG	Starting provider: <unnamed-provider>
     [java] 1493054968586	addons.manager	DEBUG	Registering shutdown blocker for <unnamed-provider>
     [java] 1493054968587	addons.manager	DEBUG	Provider finished startup: <unnamed-provider>
     [java] 1493054968657	addons.manager	DEBUG	Registering shutdown blocker for XPIProvider
     [java] 1493054968657	addons.manager	DEBUG	Provider finished startup: XPIProvider
     [java] 1493054968657	addons.manager	DEBUG	Starting provider: LightweightThemeManager
     [java] 1493054968657	addons.manager	DEBUG	Registering shutdown blocker for LightweightThemeManager
     [java] 1493054968658	addons.manager	DEBUG	Provider finished startup: LightweightThemeManager
     [java] 1493054968665	addons.manager	DEBUG	Starting provider: GMPProvider
     [java] 1493054968676	addons.manager	DEBUG	Registering shutdown blocker for GMPProvider
     [java] 1493054968677	addons.manager	DEBUG	Provider finished startup: GMPProvider
     [java] 1493054968677	addons.manager	DEBUG	Starting provider: PluginProvider
     [java] 1493054968677	addons.manager	DEBUG	Registering shutdown blocker for PluginProvider
     [java] 1493054968696	addons.manager	DEBUG	Provider finished startup: PluginProvider
     [java] 1493054968697	addons.manager	DEBUG	Completed startup sequence
     [java] 
     [java] Build info: version: '2.53.1', revision: 'a36b8b1', time: '2016-06-30 17:32:46'
     [java] System info: host: 'apacheflexbuild', ip: '100.109.32.245', os.name: 'Windows
Server 2008 R2', os.arch: 'amd64', os.version: '6.1', java.version: '1.7.0_55'
     [java] Driver info: driver.version: FirefoxDriver
     [java] 	at org.openqa.selenium.firefox.internal.NewProfileExtensionConnection.start(NewProfileExtensionConnection.java:124)
     [java] 	at org.openqa.selenium.firefox.FirefoxDriver.startClient(FirefoxDriver.java:271)
     [java] 	at org.openqa.selenium.remote.RemoteWebDriver.<init>(RemoteWebDriver.java:119)
     [java] 	at org.openqa.selenium.firefox.FirefoxDriver.<init>(FirefoxDriver.java:218)
     [java] 	at org.openqa.selenium.firefox.FirefoxDriver.<init>(FirefoxDriver.java:211)
     [java] 	at org.openqa.selenium.firefox.FirefoxDriver.<init>(FirefoxDriver.java:207)
     [java] 	at org.openqa.selenium.firefox.FirefoxDriver.<init>(FirefoxDriver.java:120)
     [java] 	at marmotinni.MarmotinniRunner.main(Unknown Source)
     [java] Caused by: org.openqa.selenium.firefox.NotConnectedException: Unable to connect
to host 127.0.0.1 on port 7055 after 45000 ms. Firefox console output:
     [java] 	Updating XPIState for {"id":"loop@mozilla.org","syncGUID":"rB2dpn5kbs0I","location":"app-system-defaults","version":"0.1","type":"extension","internalName":null,"updateURL":null,"updateKey":null,"optionsURL":null,"optionsType":null,"aboutURL":null,"icons":{},"iconURL":null,"icon64URL":null,"defaultLocale":{"name":"Firefox
Hello Beta","description":"Web sharing for Firefox","creator":"Mozilla","homepageURL":null},"visible":true,"active":true,"userDisabled":false,"appDisabled":false,"descriptor":"C:\\Program
Files (x86)\\Mozilla Firefox\\browser\\features\\loop@mozilla.org.xpi","installDate":1457051706000,"updateDate":1457051706000,"applyBackgroundUpdates":1,"bootstrap":true,"skinnable":false,"size":3086125,"sourceURI":null,"releaseNotesURI":null,"softDisabled":false,"foreignInstall":false,"hasBinaryComponents":false,"strictCompatibility":false,"locales":[],"targetApplications":[{"id":"{ec8030f7-c20a-464f-9b0e-13a3a9e97384}","minVersion":"45.0a1","maxVersion":"45.0"},{"id":"xpcshell@tests.mozilla.org","minVersion":"0","maxVersion":"10"}],"targetPlatforms":[],"multiprocessCompatible":false,"seen":true}
     [java] 1493054968529	addons.xpi	DEBUG	getModTime: Recursive scan of loop@mozilla.org
     [java] 1493054968529	addons.xpi	DEBUG	Updating XPIState for {"id":"{972ce4c6-7e08-4474-a285-3208198ce6fd}","syncGUID":"A57kSiJFY8XG","location":"app-global","version":"45.0","type":"theme","internalName":"classic/1.0","updateURL":null,"updateKey":null,"optionsURL":null,"optionsType":null,"aboutURL":null,"icons":{"32":"icon.png","48":"icon.png"},"iconURL":null,"icon64URL":null,"defaultLocale":{"name":"Default","description":"The
default theme.","creator":"Mozilla","homepageURL":null,"contributors":["Mozilla Contributors"]},"visible":true,"active":true,"userDisabled":false,"appDisabled":false,"descriptor":"C:\\Program
Files (x86)\\Mozilla Firefox\\browser\\extensions\\{972ce4c6-7e08-4474-a285-3208198ce6fd}.xpi","installDate":1457051706000,"updateDate":1457051706000,"applyBackgroundUpdates":1,"skinnable":true,"size":22006,"sourceURI":null,"releaseNotesURI":null,"softDisabled":false,"foreignInstall":false,"hasBinaryComponents":false,"strictCompatibility":true,"locales":[],"targetApplications":[{"id":"{ec8030f7-c20a-464f-9b0e-13a3a9e97384}","minVersion":"45.0","maxVersion":"45.0"}],"targetPlatforms":[],"seen":true}
     [java] 1493054968529	addons.xpi	DEBUG	getModTime: Recursive scan of {972ce4c6-7e08-4474-a285-3208198ce6fd}
     [java] 1493054968530	DeferredSave.extensions.json	DEBUG	Save changes
     [java] 1493054968530	addons.xpi	DEBUG	Updating database with changes to installed add-ons
     [java] 1493054968530	addons.xpi-utils	DEBUG	Updating add-on states
     [java] 1493054968537	addons.xpi-utils	DEBUG	Writing add-ons list
     [java] 1493054968540	addons.xpi	DEBUG	Registering manifest for C:\Program Files (x86)\Mozilla
Firefox\browser\features\loop@mozilla.org.xpi
     [java] 1493054968547	addons.xpi	DEBUG	Calling bootstrap method startup on loop@mozilla.org
version 0.1
     [java] 1493054968586	addons.manager	DEBUG	Starting provider: <unnamed-provider>
     [java] 1493054968586	addons.manager	DEBUG	Registering shutdown blocker for <unnamed-provider>
     [java] 1493054968587	addons.manager	DEBUG	Provider finished startup: <unnamed-provider>
     [java] 1493054968657	addons.manager	DEBUG	Registering shutdown blocker for XPIProvider
     [java] 1493054968657	addons.manager	DEBUG	Provider finished startup: XPIProvider
     [java] 1493054968657	addons.manager	DEBUG	Starting provider: LightweightThemeManager
     [java] 1493054968657	addons.manager	DEBUG	Registering shutdown blocker for LightweightThemeManager
     [java] 1493054968658	addons.manager	DEBUG	Provider finished startup: LightweightThemeManager
     [java] 1493054968665	addons.manager	DEBUG	Starting provider: GMPProvider
     [java] 1493054968676	addons.manager	DEBUG	Registering shutdown blocker for GMPProvider
     [java] 1493054968677	addons.manager	DEBUG	Provider finished startup: GMPProvider
     [java] 1493054968677	addons.manager	DEBUG	Starting provider: PluginProvider
     [java] 1493054968677	addons.manager	DEBUG	Registering shutdown blocker for PluginProvider
     [java] 1493054968696	addons.manager	DEBUG	Provider finished startup: PluginProvider
     [java] 1493054968697	addons.manager	DEBUG	Completed startup sequence
     [java] 
     [java] 	at org.openqa.selenium.firefox.internal.NewProfileExtensionConnection.start(NewProfileExtensionConnection.java:112)
     [java] 	... 7 more
     [java] Picked up JAVA_TOOL_OPTIONS: -Dfile.encoding=UTF8

BUILD FAILED
<http://apacheflexbuild.cloudapp.net:8080/job/flex-asjs-dual/ws/build.xml>:1177: Java
returned: 1

Total time: 41 minutes 47 seconds
Picked up JAVA_TOOL_OPTIONS: -Dfile.encoding=UTF8
Build step 'Invoke Ant' marked build as failure
Skipped archiving because build is not successful

Mime
View raw message