flex-commits mailing list archives

Site index · List index
Message view « Date » · « Thread »
Top « Date » · « Thread »
From flex.ci.bui...@gmail.com
Subject Build failed in Jenkins: flex-asjs #1447
Date Wed, 05 Oct 2016 04:20:13 GMT
See <http://apacheflexbuild.cloudapp.net:8080/job/flex-asjs/1447/>

------------------------------------------
[...truncated 2969 lines...]
     [java] Compiling file: <http://apacheflexbuild.cloudapp.net:8080/job/flex-asjs/ws/mustella/tests/bin/js-debug/halo/views/CheckBoxTests.js>
     [java] using SWC: c:\Adobe\flashPlayer\11.7\playerglobal.swc
     [java] using SWC: <http://apacheflexbuild.cloudapp.net:8080/job/flex-asjs/ws/frameworks/libs/Binding.swc>
     [java] using SWC: <http://apacheflexbuild.cloudapp.net:8080/job/flex-asjs/ws/frameworks/libs/Charts.swc>
     [java] using SWC: <http://apacheflexbuild.cloudapp.net:8080/job/flex-asjs/ws/frameworks/libs/Collections.swc>
     [java] using SWC: <http://apacheflexbuild.cloudapp.net:8080/job/flex-asjs/ws/frameworks/libs/Core.swc>
     [java] using SWC: <http://apacheflexbuild.cloudapp.net:8080/job/flex-asjs/ws/frameworks/libs/CreateJS.swc>
     [java] using SWC: <http://apacheflexbuild.cloudapp.net:8080/job/flex-asjs/ws/frameworks/libs/DragDrop.swc>
     [java] using SWC: <http://apacheflexbuild.cloudapp.net:8080/job/flex-asjs/ws/frameworks/libs/Effects.swc>
     [java] using SWC: <http://apacheflexbuild.cloudapp.net:8080/job/flex-asjs/ws/frameworks/libs/Flat.swc>
     [java] using SWC: <http://apacheflexbuild.cloudapp.net:8080/job/flex-asjs/ws/frameworks/libs/Formatters.swc>
     [java] using SWC: <http://apacheflexbuild.cloudapp.net:8080/job/flex-asjs/ws/frameworks/libs/GoogleMaps.swc>
     [java] using SWC: <http://apacheflexbuild.cloudapp.net:8080/job/flex-asjs/ws/frameworks/libs/Graphics.swc>
     [java] using SWC: <http://apacheflexbuild.cloudapp.net:8080/job/flex-asjs/ws/frameworks/libs/HTML.swc>
     [java] using SWC: <http://apacheflexbuild.cloudapp.net:8080/job/flex-asjs/ws/frameworks/libs/HTML5.swc>
     [java] using SWC: <http://apacheflexbuild.cloudapp.net:8080/job/flex-asjs/ws/frameworks/libs/jQuery.swc>
     [java] using SWC: <http://apacheflexbuild.cloudapp.net:8080/job/flex-asjs/ws/frameworks/libs/Language.swc>
     [java] using SWC: <http://apacheflexbuild.cloudapp.net:8080/job/flex-asjs/ws/frameworks/libs/Mobile.swc>
     [java] using SWC: <http://apacheflexbuild.cloudapp.net:8080/job/flex-asjs/ws/frameworks/libs/Network.swc>
     [java] using SWC: <http://apacheflexbuild.cloudapp.net:8080/job/flex-asjs/ws/frameworks/libs/Reflection.swc>
     [java] using SWC: <http://apacheflexbuild.cloudapp.net:8080/job/flex-asjs/ws/frameworks/libs/Storage.swc>
     [java] using SWC: <http://apacheflexbuild.cloudapp.net:8080/job/flex-asjs/ws/frameworks/libs/XML.swc>
     [java] using SWC: c:\Jenkins\workspace\flex-sdk\mustella\mustella.swc
     [java] Dependencies calculated for '<http://apacheflexbuild.cloudapp.net:8080/job/flex-asjs/ws/mustella/tests/bin/js-debug/BasicTestsApp.js'>
     [java] Dependencies calculated for '<http://apacheflexbuild.cloudapp.net:8080/job/flex-asjs/ws/mustella/tests/bin/js-debug/org/apache/flex/utils/EffectTimer.js'>
     [java] Dependencies calculated for '<http://apacheflexbuild.cloudapp.net:8080/job/flex-asjs/ws/mustella/tests/bin/js-debug/org/apache/flex/core/ValuesManager.js'>
     [java] Dependencies calculated for '<http://apacheflexbuild.cloudapp.net:8080/job/flex-asjs/ws/mustella/tests/bin/js-debug/org/apache/flex/utils/Language.js'>
     [java] Dependencies calculated for '<http://apacheflexbuild.cloudapp.net:8080/job/flex-asjs/ws/mustella/tests/bin/js-debug/org/apache/flex/events/EventDispatcher.js'>
     [java] Dependencies calculated for '<http://apacheflexbuild.cloudapp.net:8080/job/flex-asjs/ws/mustella/tests/bin/js-debug/org/apache/flex/events/Event.js'>
     [java] Dependencies calculated for '<http://apacheflexbuild.cloudapp.net:8080/job/flex-asjs/ws/mustella/tests/bin/js-debug/org/apache/flex/events/IEventDispatcher.js'>
     [java] Dependencies calculated for '<http://apacheflexbuild.cloudapp.net:8080/job/flex-asjs/ws/mustella/tests/bin/js-debug/org/apache/flex/events/ValueEvent.js'>
     [java] Dependencies calculated for '<http://apacheflexbuild.cloudapp.net:8080/job/flex-asjs/ws/mustella/tests/bin/js-debug/org/apache/flex/core/IEffectTimer.js'>
     [java] Dependencies calculated for '<http://apacheflexbuild.cloudapp.net:8080/job/flex-asjs/ws/mustella/tests/bin/js-debug/org/apache/flex/core/SimpleStatesImpl.js'>
     [java] Dependencies calculated for '<http://apacheflexbuild.cloudapp.net:8080/job/flex-asjs/ws/mustella/tests/bin/js-debug/org/apache/flex/events/ValueChangeEvent.js'>
     [java] Dependencies calculated for '<http://apacheflexbuild.cloudapp.net:8080/job/flex-asjs/ws/mustella/tests/bin/js-debug/org/apache/flex/states/AddItems.js'>
     [java] Dependencies calculated for '<http://apacheflexbuild.cloudapp.net:8080/job/flex-asjs/ws/mustella/tests/bin/js-debug/org/apache/flex/states/ItemAndDescriptor.js'>
     [java] Dependencies calculated for '<http://apacheflexbuild.cloudapp.net:8080/job/flex-asjs/ws/mustella/tests/bin/js-debug/org/apache/flex/core/IDocument.js'>
     [java] Dependencies calculated for '<http://apacheflexbuild.cloudapp.net:8080/job/flex-asjs/ws/mustella/tests/bin/js-debug/org/apache/flex/states/SetEventHandler.js'>
     [java] Dependencies calculated for '<http://apacheflexbuild.cloudapp.net:8080/job/flex-asjs/ws/mustella/tests/bin/js-debug/org/apache/flex/states/SetProperty.js'>
     [java] Dependencies calculated for '<http://apacheflexbuild.cloudapp.net:8080/job/flex-asjs/ws/mustella/tests/bin/js-debug/org/apache/flex/utils/MXMLDataInterpreter.js'>
     [java] Dependencies calculated for '<http://apacheflexbuild.cloudapp.net:8080/job/flex-asjs/ws/mustella/tests/bin/js-debug/org/apache/flex/core/IBead.js'>
     [java] Dependencies calculated for '<http://apacheflexbuild.cloudapp.net:8080/job/flex-asjs/ws/mustella/tests/bin/js-debug/org/apache/flex/core/IContainer.js'>
     [java] Dependencies calculated for '<http://apacheflexbuild.cloudapp.net:8080/job/flex-asjs/ws/mustella/tests/bin/js-debug/org/apache/flex/core/IParent.js'>
     [java] Dependencies calculated for '<http://apacheflexbuild.cloudapp.net:8080/job/flex-asjs/ws/mustella/tests/bin/js-debug/org/apache/flex/core/IMXMLDocument.js'>
     [java] Dependencies calculated for '<http://apacheflexbuild.cloudapp.net:8080/job/flex-asjs/ws/mustella/tests/bin/js-debug/org/apache/flex/core/IStrand.js'>
     [java] Dependencies calculated for '<http://apacheflexbuild.cloudapp.net:8080/job/flex-asjs/ws/mustella/tests/bin/js-debug/org/apache/flex/core/IUIBase.js'>
     [java] Dependencies calculated for '<http://apacheflexbuild.cloudapp.net:8080/job/flex-asjs/ws/mustella/tests/bin/js-debug/org/apache/flex/core/IStatesImpl.js'>
     [java] Dependencies calculated for '<http://apacheflexbuild.cloudapp.net:8080/job/flex-asjs/ws/mustella/tests/bin/js-debug/org/apache/flex/core/IStatesObject.js'>
     [java] Dependencies calculated for '<http://apacheflexbuild.cloudapp.net:8080/job/flex-asjs/ws/mustella/tests/bin/js-debug/org/apache/flex/html/supportClasses/ContainerContentArea.js'>
     [java] Dependencies calculated for '<http://apacheflexbuild.cloudapp.net:8080/job/flex-asjs/ws/mustella/tests/bin/js-debug/org/apache/flex/core/UIBase.js'>
     [java] Dependencies calculated for '<http://apacheflexbuild.cloudapp.net:8080/job/flex-asjs/ws/mustella/tests/bin/js-debug/org/apache/flex/core/HTMLElementWrapper.js'>
     [java] Dependencies calculated for '<http://apacheflexbuild.cloudapp.net:8080/job/flex-asjs/ws/mustella/tests/bin/js-debug/org/apache/flex/events/BrowserEvent.js'>
     [java] Dependencies calculated for '<http://apacheflexbuild.cloudapp.net:8080/job/flex-asjs/ws/mustella/tests/bin/js-debug/org/apache/flex/events/ElementEvents.js'>
     [java] Dependencies calculated for '<http://apacheflexbuild.cloudapp.net:8080/job/flex-asjs/ws/mustella/tests/bin/js-debug/org/apache/flex/core/IBeadModel.js'>
     [java] Dependencies calculated for '<http://apacheflexbuild.cloudapp.net:8080/job/flex-asjs/ws/mustella/tests/bin/js-debug/org/apache/flex/core/IBeadController.js'>
     [java] Dependencies calculated for '<http://apacheflexbuild.cloudapp.net:8080/job/flex-asjs/ws/mustella/tests/bin/js-debug/org/apache/flex/core/IBeadView.js'>
     [java] Dependencies calculated for '<http://apacheflexbuild.cloudapp.net:8080/job/flex-asjs/ws/mustella/tests/bin/js-debug/org/apache/flex/core/IFlexJSElement.js'>
     [java] Dependencies calculated for '<http://apacheflexbuild.cloudapp.net:8080/job/flex-asjs/ws/mustella/tests/bin/js-debug/org/apache/flex/core/ILayoutChild.js'>
     [java] Dependencies calculated for '<http://apacheflexbuild.cloudapp.net:8080/job/flex-asjs/ws/mustella/tests/bin/js-debug/org/apache/flex/core/IChild.js'>
     [java] Dependencies calculated for '<http://apacheflexbuild.cloudapp.net:8080/job/flex-asjs/ws/mustella/tests/bin/js-debug/org/apache/flex/core/IMeasurementBead.js'>
     [java] Dependencies calculated for '<http://apacheflexbuild.cloudapp.net:8080/job/flex-asjs/ws/mustella/tests/bin/js-debug/org/apache/flex/core/IParentIUIBase.js'>
     [java] Dependencies calculated for '<http://apacheflexbuild.cloudapp.net:8080/job/flex-asjs/ws/mustella/tests/bin/js-debug/org/apache/flex/core/IStrandWithModel.js'>
     [java] Dependencies calculated for '<http://apacheflexbuild.cloudapp.net:8080/job/flex-asjs/ws/mustella/tests/bin/js-debug/org/apache/flex/core/IStyleableObject.js'>
     [java] Dependencies calculated for '<http://apacheflexbuild.cloudapp.net:8080/job/flex-asjs/ws/mustella/tests/bin/js-debug/org/apache/flex/core/IContentView.js'>
     [java] Dependencies calculated for '<http://apacheflexbuild.cloudapp.net:8080/job/flex-asjs/ws/mustella/tests/bin/js-debug/org/apache/flex/html/beads/layouts/BasicLayout.js'>
     [java] Dependencies calculated for '<http://apacheflexbuild.cloudapp.net:8080/job/flex-asjs/ws/mustella/tests/bin/js-debug/org/apache/flex/core/IBeadLayout.js'>
     [java] Dependencies calculated for '<http://apacheflexbuild.cloudapp.net:8080/job/flex-asjs/ws/mustella/tests/bin/js-debug/org/apache/flex/core/ILayoutHost.js'>
     [java] Dependencies calculated for '<http://apacheflexbuild.cloudapp.net:8080/job/flex-asjs/ws/mustella/tests/bin/js-debug/org/apache/flex/html/supportClasses/Viewport.js'>
     [java] Dependencies calculated for '<http://apacheflexbuild.cloudapp.net:8080/job/flex-asjs/ws/mustella/tests/bin/js-debug/org/apache/flex/geom/Size.js'>
     [java] Dependencies calculated for '<http://apacheflexbuild.cloudapp.net:8080/job/flex-asjs/ws/mustella/tests/bin/js-debug/org/apache/flex/utils/CSSContainerUtils.js'>
     [java] Dependencies calculated for '<http://apacheflexbuild.cloudapp.net:8080/job/flex-asjs/ws/mustella/tests/bin/js-debug/org/apache/flex/geom/Rectangle.js'>
     [java] Dependencies calculated for '<http://apacheflexbuild.cloudapp.net:8080/job/flex-asjs/ws/mustella/tests/bin/js-debug/org/apache/flex/geom/Point.js'>
     [java] Dependencies calculated for '<http://apacheflexbuild.cloudapp.net:8080/job/flex-asjs/ws/mustella/tests/bin/js-debug/org/apache/flex/utils/CSSUtils.js'>
     [java] Dependencies calculated for '<http://apacheflexbuild.cloudapp.net:8080/job/flex-asjs/ws/mustella/tests/bin/js-debug/org/apache/flex/utils/StringPadder.js'>
     [java] Dependencies calculated for '<http://apacheflexbuild.cloudapp.net:8080/job/flex-asjs/ws/mustella/tests/bin/js-debug/org/apache/flex/core/IViewport.js'>
     [java] Dependencies calculated for '<http://apacheflexbuild.cloudapp.net:8080/job/flex-asjs/ws/mustella/tests/bin/js-debug/org/apache/flex/html/beads/ContainerView.js'>
     [java] Dependencies calculated for '<http://apacheflexbuild.cloudapp.net:8080/job/flex-asjs/ws/mustella/tests/bin/js-debug/org/apache/flex/core/BeadViewBase.js'>
     [java] Dependencies calculated for '<http://apacheflexbuild.cloudapp.net:8080/job/flex-asjs/ws/mustella/tests/bin/js-debug/org/apache/flex/core/IContainerView.js'>
     [java] Dependencies calculated for '<http://apacheflexbuild.cloudapp.net:8080/job/flex-asjs/ws/mustella/tests/bin/js-debug/org/apache/flex/core/IContentViewHost.js'>
     [java] Dependencies calculated for '<http://apacheflexbuild.cloudapp.net:8080/job/flex-asjs/ws/mustella/tests/bin/js-debug/org/apache/flex/core/IViewportModel.js'>
     [java] Dependencies calculated for '<http://apacheflexbuild.cloudapp.net:8080/job/flex-asjs/ws/mustella/tests/bin/js-debug/org/apache/flex/html/beads/IBackgroundBead.js'>
     [java] Dependencies calculated for '<http://apacheflexbuild.cloudapp.net:8080/job/flex-asjs/ws/mustella/tests/bin/js-debug/org/apache/flex/html/beads/IBorderBead.js'>
     [java] Dependencies calculated for '<http://apacheflexbuild.cloudapp.net:8080/job/flex-asjs/ws/mustella/tests/bin/js-debug/org/apache/flex/html/beads/models/ViewportModel.js'>
     [java] Dependencies calculated for '<http://apacheflexbuild.cloudapp.net:8080/job/flex-asjs/ws/mustella/tests/bin/js-debug/org/apache/flex/html/beads/layouts/VerticalLayout.js'>
     [java] Dependencies calculated for '<http://apacheflexbuild.cloudapp.net:8080/job/flex-asjs/ws/mustella/tests/bin/js-debug/org/apache/flex/core/Application.js'>
     [java] Dependencies calculated for '<http://apacheflexbuild.cloudapp.net:8080/job/flex-asjs/ws/mustella/tests/bin/js-debug/org/apache/flex/core/ApplicationBase.js'>
     [java] Dependencies calculated for '<http://apacheflexbuild.cloudapp.net:8080/job/flex-asjs/ws/mustella/tests/bin/js-debug/org/apache/flex/core/IFlexInfo.js'>
     [java] Dependencies calculated for '<http://apacheflexbuild.cloudapp.net:8080/job/flex-asjs/ws/mustella/tests/bin/js-debug/org/apache/flex/utils/Timer.js'>
     [java] Dependencies calculated for '<http://apacheflexbuild.cloudapp.net:8080/job/flex-asjs/ws/mustella/tests/bin/js-debug/org/apache/flex/core/SimpleCSSValuesImpl.js'>
     [java] Dependencies calculated for '<http://apacheflexbuild.cloudapp.net:8080/job/flex-asjs/ws/mustella/tests/bin/js-debug/org/apache/flex/core/ICSSImpl.js'>
     [java] Dependencies calculated for '<http://apacheflexbuild.cloudapp.net:8080/job/flex-asjs/ws/mustella/tests/bin/js-debug/org/apache/flex/core/IValuesImpl.js'>
     [java] Dependencies calculated for '<http://apacheflexbuild.cloudapp.net:8080/job/flex-asjs/ws/mustella/tests/bin/js-debug/BasicTests.js'>
     [java] Dependencies calculated for '<http://apacheflexbuild.cloudapp.net:8080/job/flex-asjs/ws/mustella/tests/bin/js-debug/org/apache/flex/core/View.js'>
     [java] Dependencies calculated for '<http://apacheflexbuild.cloudapp.net:8080/job/flex-asjs/ws/mustella/tests/bin/js-debug/org/apache/flex/core/ViewBase.js'>
     [java] Dependencies calculated for '<http://apacheflexbuild.cloudapp.net:8080/job/flex-asjs/ws/mustella/tests/bin/js-debug/org/apache/flex/core/ContainerBase.js'>
     [java] Dependencies calculated for '<http://apacheflexbuild.cloudapp.net:8080/job/flex-asjs/ws/mustella/tests/bin/js-debug/org/apache/flex/core/ContainerBaseStrandChildren.js'>
     [java] Dependencies calculated for '<http://apacheflexbuild.cloudapp.net:8080/job/flex-asjs/ws/mustella/tests/bin/js-debug/org/apache/flex/core/IApplicationView.js'>
     [java] Dependencies calculated for '<http://apacheflexbuild.cloudapp.net:8080/job/flex-asjs/ws/mustella/tests/bin/js-debug/org/apache/flex/core/IPopUpHost.js'>
     [java] Dependencies calculated for '<http://apacheflexbuild.cloudapp.net:8080/job/flex-asjs/ws/mustella/tests/bin/js-debug/org/apache/flex/states/State.js'>
     [java] Dependencies calculated for '<http://apacheflexbuild.cloudapp.net:8080/job/flex-asjs/ws/mustella/tests/bin/js-debug/halo/views/ButtonTests.js'>
     [java] Dependencies calculated for '<http://apacheflexbuild.cloudapp.net:8080/job/flex-asjs/ws/mustella/tests/bin/js-debug/shim/VBox.js'>
     [java] Dependencies calculated for '<http://apacheflexbuild.cloudapp.net:8080/job/flex-asjs/ws/mustella/tests/bin/js-debug/org/apache/flex/html/Container.js'>
     [java] Dependencies calculated for '<http://apacheflexbuild.cloudapp.net:8080/job/flex-asjs/ws/mustella/tests/bin/js-debug/org/apache/flex/html/TextButton.js'>
     [java] Dependencies calculated for '<http://apacheflexbuild.cloudapp.net:8080/job/flex-asjs/ws/mustella/tests/bin/js-debug/org/apache/flex/html/Button.js'>
     [java] Dependencies calculated for '<http://apacheflexbuild.cloudapp.net:8080/job/flex-asjs/ws/mustella/tests/bin/js-debug/org/apache/flex/html/Label.js'>
     [java] Dependencies calculated for '<http://apacheflexbuild.cloudapp.net:8080/job/flex-asjs/ws/mustella/tests/bin/js-debug/org/apache/flex/events/MouseEvent.js'>
     [java] Dependencies calculated for '<http://apacheflexbuild.cloudapp.net:8080/job/flex-asjs/ws/mustella/tests/bin/js-debug/org/apache/flex/utils/PointUtils.js'>
     [java] Dependencies calculated for '<http://apacheflexbuild.cloudapp.net:8080/job/flex-asjs/ws/mustella/tests/bin/js-debug/halo/views/CheckBoxTests.js'>
     [java] Dependencies calculated for '<http://apacheflexbuild.cloudapp.net:8080/job/flex-asjs/ws/mustella/tests/bin/js-debug/org/apache/flex/html/CheckBox.js'>
     [java] Dependencies calculated for '<http://apacheflexbuild.cloudapp.net:8080/job/flex-asjs/ws/mustella/tests/bin/js-debug/org/apache/flex/html/supportClasses/CheckBoxIcon.js'>
     [java] Dependencies calculated for '<http://apacheflexbuild.cloudapp.net:8080/job/flex-asjs/ws/mustella/tests/bin/js-debug/org/apache/flex/utils/MixinManager.js'>
     [java] Dependencies calculated for '<http://apacheflexbuild.cloudapp.net:8080/job/flex-asjs/ws/mustella/tests/bin/js-debug/org/apache/flex/core/CSSFontFaceBead.js'>
     [java] Dependencies calculated for '<http://apacheflexbuild.cloudapp.net:8080/job/flex-asjs/ws/mustella/tests/bin/js-debug/halo/scripts/CheckBoxTestScript.js'>
     [java] Dependencies calculated for '<http://apacheflexbuild.cloudapp.net:8080/job/flex-asjs/ws/mustella/tests/bin/js-debug/UnitTester.js'>
     [java] Dependencies calculated for '<http://apacheflexbuild.cloudapp.net:8080/job/flex-asjs/ws/mustella/tests/bin/js-debug/TestCase.js'>
     [java] Dependencies calculated for '<http://apacheflexbuild.cloudapp.net:8080/job/flex-asjs/ws/mustella/tests/bin/js-debug/SetProperty.js'>
     [java] Dependencies calculated for '<http://apacheflexbuild.cloudapp.net:8080/job/flex-asjs/ws/mustella/tests/bin/js-debug/AssertPropertyValue.js'>
     [java] Dependencies calculated for '<http://apacheflexbuild.cloudapp.net:8080/job/flex-asjs/ws/mustella/tests/bin/js-debug/DispatchMouseEvent.js'>
     [java] Dependencies calculated for '<http://apacheflexbuild.cloudapp.net:8080/job/flex-asjs/ws/mustella/tests/bin/js-debug/DispatchMouseClickEvent.js'>
     [java] Dependencies calculated for '<http://apacheflexbuild.cloudapp.net:8080/job/flex-asjs/ws/mustella/tests/bin/js-debug/halo/scripts/ButtonTestScript.js'>
     [java] Dependencies calculated for '<http://apacheflexbuild.cloudapp.net:8080/job/flex-asjs/ws/mustella/tests/bin/js-debug/SetShowRTE.js'>
     [java] Dependencies calculated for '<http://apacheflexbuild.cloudapp.net:8080/job/flex-asjs/ws/mustella/tests/bin/js-debug/SendFormattedResultsToLog.js'>
     [java] Dependencies calculated for '<http://apacheflexbuild.cloudapp.net:8080/job/flex-asjs/ws/mustella/tests/bin/js-debug/FlexJSContext.js'>
     [java] Dependencies calculated for '<http://apacheflexbuild.cloudapp.net:8080/job/flex-asjs/ws/mustella/tests/bin/js-debug/ExitWhenDone.js'>
     [java] The project 'BasicTestsApp' has been successfully compiled and optimized.
     [java] Picked up JAVA_TOOL_OPTIONS: -Dfile.encoding=UTF8

basictests-compile-java:
   [delete] Deleting directory <http://apacheflexbuild.cloudapp.net:8080/job/flex-asjs/ws/mustella/java/bin>
    [mkdir] Created dir: <http://apacheflexbuild.cloudapp.net:8080/job/flex-asjs/ws/mustella/java/bin>
    [javac] <http://apacheflexbuild.cloudapp.net:8080/job/flex-asjs/ws/build.xml>:1280:
warning: 'includeantruntime' was not set, defaulting to build.sysclasspath=last; set to false
for repeatable builds
    [javac] Compiling 11 source files to <http://apacheflexbuild.cloudapp.net:8080/job/flex-asjs/ws/mustella/java/bin>

basictests-run-js:
     [echo] url=file://<http://apacheflexbuild.cloudapp.net:8080/job/flex-asjs/ws/mustella/tests/basicTests/bin/js-debug/index.html>
     [echo] script=<http://apacheflexbuild.cloudapp.net:8080/job/flex-asjs/ws/mustella/tests/basicTests/halo/scripts/ButtonTestScript.mxml>
     [echo] script=<http://apacheflexbuild.cloudapp.net:8080/job/flex-asjs/ws/mustella/tests/basicTests/halo/scripts/CheckBoxTestScript.mxml>
     [java] file://<http://apacheflexbuild.cloudapp.net:8080/job/flex-asjs/ws/mustella/tests/bin/js-debug/index.html>
     [java] org.openqa.selenium.firefox.NotConnectedException: Unable to connect to host 127.0.0.1
on port 7055 after 45000 ms. Firefox console output:
     [java] 	Updating XPIState for {"id":"loop@mozilla.org","syncGUID":"gC_h0aSUAqCV","location":"app-system-defaults","version":"0.1","type":"extension","internalName":null,"updateURL":null,"updateKey":null,"optionsURL":null,"optionsType":null,"aboutURL":null,"icons":{},"iconURL":null,"icon64URL":null,"defaultLocale":{"name":"Firefox
Hello Beta","description":"Web sharing for Firefox","creator":"Mozilla","homepageURL":null},"visible":true,"active":true,"userDisabled":false,"appDisabled":false,"descriptor":"C:\\Program
Files (x86)\\Mozilla Firefox\\browser\\features\\loop@mozilla.org.xpi","installDate":1457051706000,"updateDate":1457051706000,"applyBackgroundUpdates":1,"bootstrap":true,"skinnable":false,"size":3086125,"sourceURI":null,"releaseNotesURI":null,"softDisabled":false,"foreignInstall":false,"hasBinaryComponents":false,"strictCompatibility":false,"locales":[],"targetApplications":[{"id":"{ec8030f7-c20a-464f-9b0e-13a3a9e97384}","minVersion":"45.0a1","maxVersion":"45.0"},{"id":"xpcshell@tests.mozilla.org","minVersion":"0","maxVersion":"10"}],"targetPlatforms":[],"multiprocessCompatible":false,"seen":true}
     [java] 1475641171857	addons.xpi	DEBUG	getModTime: Recursive scan of loop@mozilla.org
     [java] 1475641171858	addons.xpi	DEBUG	Updating XPIState for {"id":"{972ce4c6-7e08-4474-a285-3208198ce6fd}","syncGUID":"Klr21q08WqSJ","location":"app-global","version":"45.0","type":"theme","internalName":"classic/1.0","updateURL":null,"updateKey":null,"optionsURL":null,"optionsType":null,"aboutURL":null,"icons":{"32":"icon.png","48":"icon.png"},"iconURL":null,"icon64URL":null,"defaultLocale":{"name":"Default","description":"The
default theme.","creator":"Mozilla","homepageURL":null,"contributors":["Mozilla Contributors"]},"visible":true,"active":true,"userDisabled":false,"appDisabled":false,"descriptor":"C:\\Program
Files (x86)\\Mozilla Firefox\\browser\\extensions\\{972ce4c6-7e08-4474-a285-3208198ce6fd}.xpi","installDate":1457051706000,"updateDate":1457051706000,"applyBackgroundUpdates":1,"skinnable":true,"size":22006,"sourceURI":null,"releaseNotesURI":null,"softDisabled":false,"foreignInstall":false,"hasBinaryComponents":false,"strictCompatibility":true,"locales":[],"targetApplications":[{"id":"{ec8030f7-c20a-464f-9b0e-13a3a9e97384}","minVersion":"45.0","maxVersion":"45.0"}],"targetPlatforms":[],"seen":true}
     [java] 1475641171858	addons.xpi	DEBUG	getModTime: Recursive scan of {972ce4c6-7e08-4474-a285-3208198ce6fd}
     [java] 1475641171867	DeferredSave.extensions.json	DEBUG	Save changes
     [java] 1475641171867	addons.xpi	DEBUG	Updating database with changes to installed add-ons
     [java] 1475641171867	addons.xpi-utils	DEBUG	Updating add-on states
     [java] 1475641171868	addons.xpi-utils	DEBUG	Writing add-ons list
     [java] 1475641171998	addons.xpi	DEBUG	Registering manifest for C:\Program Files (x86)\Mozilla
Firefox\browser\features\loop@mozilla.org.xpi
     [java] 1475641171999	addons.xpi	DEBUG	Calling bootstrap method startup on loop@mozilla.org
version 0.1
     [java] 1475641172264	addons.manager	DEBUG	Starting provider: <unnamed-provider>
     [java] 1475641172264	addons.manager	DEBUG	Registering shutdown blocker for <unnamed-provider>
     [java] 1475641172264	addons.manager	DEBUG	Provider finished startup: <unnamed-provider>
     [java] 1475641172579	addons.manager	DEBUG	Registering shutdown blocker for XPIProvider
     [java] 1475641172580	addons.manager	DEBUG	Provider finished startup: XPIProvider
     [java] 1475641172580	addons.manager	DEBUG	Starting provider: LightweightThemeManager
     [java] 1475641172580	addons.manager	DEBUG	Registering shutdown blocker for LightweightThemeManager
     [java] 1475641172581	addons.manager	DEBUG	Provider finished startup: LightweightThemeManager
     [java] 1475641172587	addons.manager	DEBUG	Starting provider: GMPProvider
     [java] 1475641172637	addons.manager	DEBUG	Registering shutdown blocker for GMPProvider
     [java] 1475641172637	addons.manager	DEBUG	Provider finished startup: GMPProvider
     [java] 1475641172637	addons.manager	DEBUG	Starting provider: PluginProvider
     [java] 1475641172638	addons.manager	DEBUG	Registering shutdown blocker for PluginProvider
     [java] 1475641172666	addons.manager	DEBUG	Provider finished startup: PluginProvider
     [java] 1475641172667	addons.manager	DEBUG	Completed startup sequence
     [java] 
     [java] 	at org.openqa.selenium.firefox.internal.NewProfileExtensionConnection.start(NewProfileExtensionConnection.java:112)
     [java] 	at org.openqa.selenium.firefox.FirefoxDriver.startClient(FirefoxDriver.java:271)
     [java] 	at org.openqa.selenium.remote.RemoteWebDriver.<init>(RemoteWebDriver.java:119)
     [java] 	at org.openqa.selenium.firefox.FirefoxDriver.<init>(FirefoxDriver.java:218)
     [java] 	at org.openqa.selenium.firefox.FirefoxDriver.<init>(FirefoxDriver.java:211)
     [java] 	at org.openqa.selenium.firefox.FirefoxDriver.<init>(FirefoxDriver.java:207)
     [java] 	at org.openqa.selenium.firefox.FirefoxDriver.<init>(FirefoxDriver.java:120)
     [java] 	at marmotinni.MarmotinniRunner.main(Unknown Source)
     [java] Exception in thread "main" org.openqa.selenium.WebDriverException: Failed to connect
to binary FirefoxBinary(C:\Program Files (x86)\Mozilla Firefox\firefox.exe) on port 7055;
process output follows: 
     [java] 	Updating XPIState for {"id":"loop@mozilla.org","syncGUID":"gC_h0aSUAqCV","location":"app-system-defaults","version":"0.1","type":"extension","internalName":null,"updateURL":null,"updateKey":null,"optionsURL":null,"optionsType":null,"aboutURL":null,"icons":{},"iconURL":null,"icon64URL":null,"defaultLocale":{"name":"Firefox
Hello Beta","description":"Web sharing for Firefox","creator":"Mozilla","homepageURL":null},"visible":true,"active":true,"userDisabled":false,"appDisabled":false,"descriptor":"C:\\Program
Files (x86)\\Mozilla Firefox\\browser\\features\\loop@mozilla.org.xpi","installDate":1457051706000,"updateDate":1457051706000,"applyBackgroundUpdates":1,"bootstrap":true,"skinnable":false,"size":3086125,"sourceURI":null,"releaseNotesURI":null,"softDisabled":false,"foreignInstall":false,"hasBinaryComponents":false,"strictCompatibility":false,"locales":[],"targetApplications":[{"id":"{ec8030f7-c20a-464f-9b0e-13a3a9e97384}","minVersion":"45.0a1","maxVersion":"45.0"},{"id":"xpcshell@tests.mozilla.org","minVersion":"0","maxVersion":"10"}],"targetPlatforms":[],"multiprocessCompatible":false,"seen":true}
     [java] 1475641171857	addons.xpi	DEBUG	getModTime: Recursive scan of loop@mozilla.org
     [java] 1475641171858	addons.xpi	DEBUG	Updating XPIState for {"id":"{972ce4c6-7e08-4474-a285-3208198ce6fd}","syncGUID":"Klr21q08WqSJ","location":"app-global","version":"45.0","type":"theme","internalName":"classic/1.0","updateURL":null,"updateKey":null,"optionsURL":null,"optionsType":null,"aboutURL":null,"icons":{"32":"icon.png","48":"icon.png"},"iconURL":null,"icon64URL":null,"defaultLocale":{"name":"Default","description":"The
default theme.","creator":"Mozilla","homepageURL":null,"contributors":["Mozilla Contributors"]},"visible":true,"active":true,"userDisabled":false,"appDisabled":false,"descriptor":"C:\\Program
Files (x86)\\Mozilla Firefox\\browser\\extensions\\{972ce4c6-7e08-4474-a285-3208198ce6fd}.xpi","installDate":1457051706000,"updateDate":1457051706000,"applyBackgroundUpdates":1,"skinnable":true,"size":22006,"sourceURI":null,"releaseNotesURI":null,"softDisabled":false,"foreignInstall":false,"hasBinaryComponents":false,"strictCompatibility":true,"locales":[],"targetApplications":[{"id":"{ec8030f7-c20a-464f-9b0e-13a3a9e97384}","minVersion":"45.0","maxVersion":"45.0"}],"targetPlatforms":[],"seen":true}
     [java] 1475641171858	addons.xpi	DEBUG	getModTime: Recursive scan of {972ce4c6-7e08-4474-a285-3208198ce6fd}
     [java] 1475641171867	DeferredSave.extensions.json	DEBUG	Save changes
     [java] 1475641171867	addons.xpi	DEBUG	Updating database with changes to installed add-ons
     [java] 1475641171867	addons.xpi-utils	DEBUG	Updating add-on states
     [java] 1475641171868	addons.xpi-utils	DEBUG	Writing add-ons list
     [java] 1475641171998	addons.xpi	DEBUG	Registering manifest for C:\Program Files (x86)\Mozilla
Firefox\browser\features\loop@mozilla.org.xpi
     [java] 1475641171999	addons.xpi	DEBUG	Calling bootstrap method startup on loop@mozilla.org
version 0.1
     [java] 1475641172264	addons.manager	DEBUG	Starting provider: <unnamed-provider>
     [java] 1475641172264	addons.manager	DEBUG	Registering shutdown blocker for <unnamed-provider>
     [java] 1475641172264	addons.manager	DEBUG	Provider finished startup: <unnamed-provider>
     [java] 1475641172579	addons.manager	DEBUG	Registering shutdown blocker for XPIProvider
     [java] 1475641172580	addons.manager	DEBUG	Provider finished startup: XPIProvider
     [java] 1475641172580	addons.manager	DEBUG	Starting provider: LightweightThemeManager
     [java] 1475641172580	addons.manager	DEBUG	Registering shutdown blocker for LightweightThemeManager
     [java] 1475641172581	addons.manager	DEBUG	Provider finished startup: LightweightThemeManager
     [java] 1475641172587	addons.manager	DEBUG	Starting provider: GMPProvider
     [java] 1475641172637	addons.manager	DEBUG	Registering shutdown blocker for GMPProvider
     [java] 1475641172637	addons.manager	DEBUG	Provider finished startup: GMPProvider
     [java] 1475641172637	addons.manager	DEBUG	Starting provider: PluginProvider
     [java] 1475641172638	addons.manager	DEBUG	Registering shutdown blocker for PluginProvider
     [java] 1475641172666	addons.manager	DEBUG	Provider finished startup: PluginProvider
     [java] 1475641172667	addons.manager	DEBUG	Completed startup sequence
     [java] 
     [java] Build info: version: '2.53.1', revision: 'a36b8b1', time: '2016-06-30 17:32:46'
     [java] System info: host: 'apacheflexbuild', ip: '100.68.242.38', os.name: 'Windows Server
2008 R2', os.arch: 'amd64', os.version: '6.1', java.version: '1.7.0_55'
     [java] Driver info: driver.version: FirefoxDriver
     [java] 	at org.openqa.selenium.firefox.internal.NewProfileExtensionConnection.start(NewProfileExtensionConnection.java:124)
     [java] 	at org.openqa.selenium.firefox.FirefoxDriver.startClient(FirefoxDriver.java:271)
     [java] 	at org.openqa.selenium.remote.RemoteWebDriver.<init>(RemoteWebDriver.java:119)
     [java] 	at org.openqa.selenium.firefox.FirefoxDriver.<init>(FirefoxDriver.java:218)
     [java] 	at org.openqa.selenium.firefox.FirefoxDriver.<init>(FirefoxDriver.java:211)
     [java] 	at org.openqa.selenium.firefox.FirefoxDriver.<init>(FirefoxDriver.java:207)
     [java] 	at org.openqa.selenium.firefox.FirefoxDriver.<init>(FirefoxDriver.java:120)
     [java] 	at marmotinni.MarmotinniRunner.main(Unknown Source)
     [java] Caused by: org.openqa.selenium.firefox.NotConnectedException: Unable to connect
to host 127.0.0.1 on port 7055 after 45000 ms. Firefox console output:
     [java] 	Updating XPIState for {"id":"loop@mozilla.org","syncGUID":"gC_h0aSUAqCV","location":"app-system-defaults","version":"0.1","type":"extension","internalName":null,"updateURL":null,"updateKey":null,"optionsURL":null,"optionsType":null,"aboutURL":null,"icons":{},"iconURL":null,"icon64URL":null,"defaultLocale":{"name":"Firefox
Hello Beta","description":"Web sharing for Firefox","creator":"Mozilla","homepageURL":null},"visible":true,"active":true,"userDisabled":false,"appDisabled":false,"descriptor":"C:\\Program
Files (x86)\\Mozilla Firefox\\browser\\features\\loop@mozilla.org.xpi","installDate":1457051706000,"updateDate":1457051706000,"applyBackgroundUpdates":1,"bootstrap":true,"skinnable":false,"size":3086125,"sourceURI":null,"releaseNotesURI":null,"softDisabled":false,"foreignInstall":false,"hasBinaryComponents":false,"strictCompatibility":false,"locales":[],"targetApplications":[{"id":"{ec8030f7-c20a-464f-9b0e-13a3a9e97384}","minVersion":"45.0a1","maxVersion":"45.0"},{"id":"xpcshell@tests.mozilla.org","minVersion":"0","maxVersion":"10"}],"targetPlatforms":[],"multiprocessCompatible":false,"seen":true}
     [java] 1475641171857	addons.xpi	DEBUG	getModTime: Recursive scan of loop@mozilla.org
     [java] 1475641171858	addons.xpi	DEBUG	Updating XPIState for {"id":"{972ce4c6-7e08-4474-a285-3208198ce6fd}","syncGUID":"Klr21q08WqSJ","location":"app-global","version":"45.0","type":"theme","internalName":"classic/1.0","updateURL":null,"updateKey":null,"optionsURL":null,"optionsType":null,"aboutURL":null,"icons":{"32":"icon.png","48":"icon.png"},"iconURL":null,"icon64URL":null,"defaultLocale":{"name":"Default","description":"The
default theme.","creator":"Mozilla","homepageURL":null,"contributors":["Mozilla Contributors"]},"visible":true,"active":true,"userDisabled":false,"appDisabled":false,"descriptor":"C:\\Program
Files (x86)\\Mozilla Firefox\\browser\\extensions\\{972ce4c6-7e08-4474-a285-3208198ce6fd}.xpi","installDate":1457051706000,"updateDate":1457051706000,"applyBackgroundUpdates":1,"skinnable":true,"size":22006,"sourceURI":null,"releaseNotesURI":null,"softDisabled":false,"foreignInstall":false,"hasBinaryComponents":false,"strictCompatibility":true,"locales":[],"targetApplications":[{"id":"{ec8030f7-c20a-464f-9b0e-13a3a9e97384}","minVersion":"45.0","maxVersion":"45.0"}],"targetPlatforms":[],"seen":true}
     [java] 1475641171858	addons.xpi	DEBUG	getModTime: Recursive scan of {972ce4c6-7e08-4474-a285-3208198ce6fd}
     [java] 1475641171867	DeferredSave.extensions.json	DEBUG	Save changes
     [java] 1475641171867	addons.xpi	DEBUG	Updating database with changes to installed add-ons
     [java] 1475641171867	addons.xpi-utils	DEBUG	Updating add-on states
     [java] 1475641171868	addons.xpi-utils	DEBUG	Writing add-ons list
     [java] 1475641171998	addons.xpi	DEBUG	Registering manifest for C:\Program Files (x86)\Mozilla
Firefox\browser\features\loop@mozilla.org.xpi
     [java] 1475641171999	addons.xpi	DEBUG	Calling bootstrap method startup on loop@mozilla.org
version 0.1
     [java] 1475641172264	addons.manager	DEBUG	Starting provider: <unnamed-provider>
     [java] 1475641172264	addons.manager	DEBUG	Registering shutdown blocker for <unnamed-provider>
     [java] 1475641172264	addons.manager	DEBUG	Provider finished startup: <unnamed-provider>
     [java] 1475641172579	addons.manager	DEBUG	Registering shutdown blocker for XPIProvider
     [java] 1475641172580	addons.manager	DEBUG	Provider finished startup: XPIProvider
     [java] 1475641172580	addons.manager	DEBUG	Starting provider: LightweightThemeManager
     [java] 1475641172580	addons.manager	DEBUG	Registering shutdown blocker for LightweightThemeManager
     [java] 1475641172581	addons.manager	DEBUG	Provider finished startup: LightweightThemeManager
     [java] 1475641172587	addons.manager	DEBUG	Starting provider: GMPProvider
     [java] 1475641172637	addons.manager	DEBUG	Registering shutdown blocker for GMPProvider
     [java] 1475641172637	addons.manager	DEBUG	Provider finished startup: GMPProvider
     [java] 1475641172637	addons.manager	DEBUG	Starting provider: PluginProvider
     [java] 1475641172638	addons.manager	DEBUG	Registering shutdown blocker for PluginProvider
     [java] 1475641172666	addons.manager	DEBUG	Provider finished startup: PluginProvider
     [java] 1475641172667	addons.manager	DEBUG	Completed startup sequence
     [java] 
     [java] 	at org.openqa.selenium.firefox.internal.NewProfileExtensionConnection.start(NewProfileExtensionConnection.java:112)
     [java] 	... 7 more
     [java] Picked up JAVA_TOOL_OPTIONS: -Dfile.encoding=UTF8

BUILD FAILED
<http://apacheflexbuild.cloudapp.net:8080/job/flex-asjs/ws/build.xml>:1174: Java returned:
1

Total time: 32 minutes 16 seconds
Picked up JAVA_TOOL_OPTIONS: -Dfile.encoding=UTF8
Build step 'Invoke Ant' marked build as failure
Skipped archiving because build is not successful


Mime
View raw message