flex-commits mailing list archives

Site index · List index
Message view « Date » · « Thread »
Top « Date » · « Thread »
From flex.ci.bui...@gmail.com
Subject Build failed in Jenkins: flex-falcon #1265
Date Tue, 11 Oct 2016 15:42:17 GMT
See <http://apacheflexbuild.cloudapp.net:8080/job/flex-falcon/1265/>

------------------------------------------
[...truncated 2663 lines...]
     [java] Warning: pattern assignPlusToRuntimeNameExpr has no reduction - ignored.
     [java] Warning: pattern assignRightShiftToDescendantsExpr has no reduction - ignored.
     [java] Warning: pattern assignRightShiftToRuntimeNameExpr has no reduction - ignored.
     [java] Warning: pattern assignToQualifiedRuntimeAttributeExpr has no reduction - ignored.
     [java] Warning: pattern assignUnsignedRightShiftToDescendantsExpr has no reduction -
ignored.
     [java] Warning: pattern assignUnsignedRightShiftToRuntimeNameExpr has no reduction -
ignored.
     [java] Warning: pattern blockStmt has no reduction - ignored.
     [java] Warning: pattern breakStmt has no reduction - ignored.
     [java] Warning: pattern catchBlockTyped has no reduction - ignored.
     [java] Warning: pattern catchBlockUntyped has no reduction - ignored.
     [java] Warning: pattern configBlockStmt has no reduction - ignored.
     [java] Warning: pattern constantDottedName has no reduction - ignored.
     [java] Warning: pattern constantSwitchCase has no reduction - ignored.
     [java] Warning: pattern continueStmt has no reduction - ignored.
     [java] Warning: pattern countedForStmt has no reduction - ignored.
     [java] Warning: pattern defaultXMLNamespace has no reduction - ignored.
     [java] Warning: pattern doStmt has no reduction - ignored.
     [java] Warning: pattern emptyConstructor has no reduction - ignored.
     [java] Warning: pattern forEachArrayStmt has no reduction - ignored.
     [java] Warning: pattern forEachInDescendantStmt has no reduction - ignored.
     [java] Warning: pattern forEachMemberStmt has no reduction - ignored.
     [java] Warning: pattern forEachStmt has no reduction - ignored.
     [java] Warning: pattern forEachSuperBracketStmt has no reduction - ignored.
     [java] Warning: pattern forEachSuperStmt has no reduction - ignored.
     [java] Warning: pattern forEachVarDeclInStmt has no reduction - ignored.
     [java] Warning: pattern forInArrayStmt has no reduction - ignored.
     [java] Warning: pattern forInDescendantStmt has no reduction - ignored.
     [java] Warning: pattern forInMemberStmt has no reduction - ignored.
     [java] Warning: pattern forInStmt has no reduction - ignored.
     [java] Warning: pattern forInSuperBracketStmt has no reduction - ignored.
     [java] Warning: pattern forInSuperStmt has no reduction - ignored.
     [java] Warning: pattern forVarDeclInStmt has no reduction - ignored.
     [java] Warning: pattern gotoStmt has no reduction - ignored.
     [java] Warning: pattern groupedVoidExpression has no reduction - ignored.
     [java] Warning: pattern ifElseIf has no reduction - ignored.
     [java] Warning: pattern importDirective has no reduction - ignored.
     [java] Warning: pattern instructionListExpression has no reduction - ignored.
     [java] Warning: pattern integerLiteral has no reduction - ignored.
     [java] Warning: pattern labeledBreakStmt has no reduction - ignored.
     [java] Warning: pattern labeledContinueStmt has no reduction - ignored.
     [java] Warning: pattern labeledStmt has no reduction - ignored.
     [java] Warning: pattern lastElse has no reduction - ignored.
     [java] Warning: pattern logicalAndExpr has no reduction - ignored.
     [java] Warning: pattern logicalOrExpr has no reduction - ignored.
     [java] Warning: pattern mxmlEventSpecifier has no reduction - ignored.
     [java] Warning: pattern namespaceDeclaration has no reduction - ignored.
     [java] Warning: pattern namespaceDeclarationConstantInitializer has no reduction - ignored.
     [java] Warning: pattern namespaceDeclarationInitializer has no reduction - ignored.
     [java] Warning: pattern optionalParameter has no reduction - ignored.
     [java] Warning: pattern plist has no reduction - ignored.
     [java] Warning: pattern requiredParameter has no reduction - ignored.
     [java] Warning: pattern restParameter has no reduction - ignored.
     [java] Warning: pattern returnNil has no reduction - ignored.
     [java] Warning: pattern returnValue has no reduction - ignored.
     [java] Warning: pattern returnVoid has no reduction - ignored.
     [java] Warning: pattern returnVoidSideEffect has no reduction - ignored.
     [java] Warning: pattern returnVoidValue has no reduction - ignored.
     [java] Warning: pattern superCallExpr has no reduction - ignored.
     [java] Warning: pattern superThisAccess has no reduction - ignored.
     [java] Warning: pattern switchCase has no reduction - ignored.
     [java] Warning: pattern switchDefault has no reduction - ignored.
     [java] Warning: pattern switchStmt has no reduction - ignored.
     [java] Warning: pattern throwStmt has no reduction - ignored.
     [java] Warning: pattern tryCatchFinallyStmt has no reduction - ignored.
     [java] Warning: pattern tryCatchStmt has no reduction - ignored.
     [java] Warning: pattern tryFinallyStmt has no reduction - ignored.
     [java] Warning: pattern typedBindableVariableDecl has no reduction - ignored.
     [java] Warning: pattern typedBindableVariableDeclWithInitializer has no reduction - ignored.
     [java] Warning: pattern typedFunction has no reduction - ignored.
     [java] Warning: pattern typedFunctionObject has no reduction - ignored.
     [java] Warning: pattern typedGetter has no reduction - ignored.
     [java] Warning: pattern typedSetter has no reduction - ignored.
     [java] Warning: pattern typedVariableDecl has no reduction - ignored.
     [java] Warning: pattern typedVariableDeclWithConstantInitializer has no reduction - ignored.
     [java] Warning: pattern typedVariableDeclWithInitializer has no reduction - ignored.
     [java] Warning: pattern typelessFunction has no reduction - ignored.
     [java] Warning: pattern typelessFunctionObject has no reduction - ignored.
     [java] Warning: pattern typelessGetter has no reduction - ignored.
     [java] Warning: pattern typelessSetter has no reduction - ignored.
     [java] Warning: pattern uintLiteral has no reduction - ignored.
     [java] Warning: pattern useNamespaceDirective has no reduction - ignored.
     [java] Warning: pattern variableExpression has no reduction - ignored.
     [java] Warning: pattern whileStmt has no reduction - ignored.
     [java] Warning: pattern withStmt has no reduction - ignored.
     [java] Using Language Adaptor : jburg.burg.emitlangs.EmitJava
     [java] Using i-node adapter org.apache.flex.compiler.internal.as.codegen.IASNodeAdapter
     [java] Picked up JAVA_TOOL_OPTIONS: -Dfile.encoding=UTF8

main:

compile:
    [javac] <http://apacheflexbuild.cloudapp.net:8080/job/flex-falcon/ws/debugger/build.xml>:102:
warning: 'includeantruntime' was not set, defaulting to build.sysclasspath=last; set to false
for repeatable builds
    [javac] Compiling 294 source files to <http://apacheflexbuild.cloudapp.net:8080/job/flex-falcon/ws/debugger/target>
    [javac] Note: Some input files use or override a deprecated API.
    [javac] Note: Recompile with -Xlint:deprecation for details.
    [javac] Note: <http://apacheflexbuild.cloudapp.net:8080/job/flex-falcon/ws/debugger/target/generated-sources/jburg/flash/tools/debugger/expression/AS3DebuggerBURM.java>
uses unchecked or unsafe operations.
    [javac] Note: Recompile with -Xlint:unchecked for details.
     [copy] Copying 83 files to <http://apacheflexbuild.cloudapp.net:8080/job/flex-falcon/ws/debugger/target>

jar:
     [copy] Copying 1 file to <http://apacheflexbuild.cloudapp.net:8080/job/flex-falcon/ws/debugger/target/META-INF>
     [copy] Copying 1 file to <http://apacheflexbuild.cloudapp.net:8080/job/flex-falcon/ws/debugger/target/META-INF>
      [jar] Building jar: <http://apacheflexbuild.cloudapp.net:8080/job/flex-falcon/ws/compiler/lib/fdb.jar>

anttasks:

compile:
    [mkdir] Created dir: <http://apacheflexbuild.cloudapp.net:8080/job/flex-falcon/ws/flexjs-ant-tasks/target/classes>
    [javac] Compiling 22 source files to <http://apacheflexbuild.cloudapp.net:8080/job/flex-falcon/ws/flexjs-ant-tasks/target/classes>
    [javac] warning: [options] bootstrap class path not set in conjunction with -source 1.6
    [javac] <http://apacheflexbuild.cloudapp.net:8080/job/flex-falcon/ws/flexjs-ant-tasks/src/main/java/org/apache/flex/compiler/ant/FlexTask.java>:309:
warning: [rawtypes] found raw type: Class
    [javac]                 Method toolMethod = toolClass.getMethod(toolMethodName, new Class[]
{String[].class});
    [javac]                                                                             ^
    [javac]   missing type arguments for generic class Class<T>
    [javac]   where T is a type-variable:
    [javac]     T extends Object declared in class Class
    [javac] <http://apacheflexbuild.cloudapp.net:8080/job/flex-falcon/ws/flexjs-ant-tasks/src/main/java/org/apache/flex/compiler/ant/FlexTask.java>:338:
warning: [rawtypes] found raw type: Class
    [javac] 			Method toolFailureMethod = toolClass.getMethod(toolFailureMethodName, new Class[]
{int.class});
    [javac] 			                                                                          ^
    [javac]   missing type arguments for generic class Class<T>
    [javac]   where T is a type-variable:
    [javac]     T extends Object declared in class Class
    [javac] 3 warnings

set.falcon.flextasks.jar.uptodate:

falcon.flextasks.jar:
    [mkdir] Created dir: <http://apacheflexbuild.cloudapp.net:8080/job/flex-falcon/ws/flexjs-ant-tasks/target/classes/META-INF>
     [copy] Copying 1 file to <http://apacheflexbuild.cloudapp.net:8080/job/flex-falcon/ws/flexjs-ant-tasks/target/classes/META-INF>
     [copy] Copying 1 file to <http://apacheflexbuild.cloudapp.net:8080/job/flex-falcon/ws/flexjs-ant-tasks/target/classes/META-INF>
      [jar] Building jar: <http://apacheflexbuild.cloudapp.net:8080/job/flex-falcon/ws/compiler/lib/falcon-flexTasks.jar>

jar:

all:

binary-package:

stage-source:

clean-temp:
   [delete] Deleting directory <http://apacheflexbuild.cloudapp.net:8080/job/flex-falcon/ws/temp>
     [copy] Copying 45 files to <http://apacheflexbuild.cloudapp.net:8080/job/flex-falcon/ws/temp>

stage-compiler:
     [copy] Copying 1996 files to <http://apacheflexbuild.cloudapp.net:8080/job/flex-falcon/ws/temp/compiler>
     [copy] Copying 10 files to <http://apacheflexbuild.cloudapp.net:8080/job/flex-falcon/ws/temp/compiler-build-tools>
     [copy] Copying 9 files to <http://apacheflexbuild.cloudapp.net:8080/job/flex-falcon/ws/temp/compiler-test-utils>
     [copy] Copying 3 files to <http://apacheflexbuild.cloudapp.net:8080/job/flex-falcon/ws/temp/compiler-jburg-types>

stage-fb-integration:

download_check:

downloads:
     [copy] Copying 392 files to <http://apacheflexbuild.cloudapp.net:8080/job/flex-falcon/ws/temp/debugger>

download_check:

downloads:
     [copy] Copying 251 files to <http://apacheflexbuild.cloudapp.net:8080/job/flex-falcon/ws/temp/flex-compiler-oem>

stage-ant-tasks:
     [copy] Copying 31 files to <http://apacheflexbuild.cloudapp.net:8080/job/flex-falcon/ws/temp/flexjs-ant-tasks>

check-typedefs-home:
     [echo] FLEXJS_TYPEDEFS_HOME is ${env.FLEXJS_TYPEDEFS_HOME}

stage-typedefs:
     [copy] Copying 67 files to <http://apacheflexbuild.cloudapp.net:8080/job/flex-falcon/ws/temp/flex-typedefs>
     [copy] Copying 10 files to <http://apacheflexbuild.cloudapp.net:8080/job/flex-falcon/ws/temp/compiler/lib>

binary-package-zip:
      [zip] Building zip: <http://apacheflexbuild.cloudapp.net:8080/job/flex-falcon/1265/artifact/out/apache-flex-falcon-0.8.0-bin.zip>

binary-package-tgz:
      [tar] Building tar: <http://apacheflexbuild.cloudapp.net:8080/job/flex-falcon/1265/artifact/out/apache-flex-falcon-0.8.0-bin.tar.gz>

stage-source-jx:
     [copy] Copying 1 file to <http://apacheflexbuild.cloudapp.net:8080/job/flex-falcon/ws/temp>
     [copy] Copying 5 files to <http://apacheflexbuild.cloudapp.net:8080/job/flex-falcon/ws/temp>
     [copy] Copying 499 files to <http://apacheflexbuild.cloudapp.net:8080/job/flex-falcon/ws/temp/compiler-jx>
     [copy] Copying 2 files to <http://apacheflexbuild.cloudapp.net:8080/job/flex-falcon/ws/temp/flex-typedefs>
   [delete] Deleting: <http://apacheflexbuild.cloudapp.net:8080/job/flex-falcon/ws/temp/LICENSE>
    [mkdir] Created dir: <http://apacheflexbuild.cloudapp.net:8080/job/flex-falcon/ws/temp/js>
     [copy] Copying 4 files to <http://apacheflexbuild.cloudapp.net:8080/job/flex-falcon/ws/temp/js>
    [mkdir] Created dir: <http://apacheflexbuild.cloudapp.net:8080/job/flex-falcon/ws/temp/js/libs>
     [copy] Copying 1 file to <http://apacheflexbuild.cloudapp.net:8080/job/flex-falcon/ws/temp/js/libs>
     [copy] Copying 1 file to <http://apacheflexbuild.cloudapp.net:8080/job/flex-falcon/ws/temp/js/libs>
     [copy] Copying 1 file to <http://apacheflexbuild.cloudapp.net:8080/job/flex-falcon/ws/temp/js/libs>
     [copy] Copying 1 file to <http://apacheflexbuild.cloudapp.net:8080/job/flex-falcon/ws/temp/js/libs>
     [copy] Copying 1 file to <http://apacheflexbuild.cloudapp.net:8080/job/flex-falcon/ws/temp/js/libs>
     [copy] Copying 1 file to <http://apacheflexbuild.cloudapp.net:8080/job/flex-falcon/ws/temp/js/libs>
     [copy] Copying 1 file to <http://apacheflexbuild.cloudapp.net:8080/job/flex-falcon/ws/temp/js/libs>
     [copy] Copying 1 file to <http://apacheflexbuild.cloudapp.net:8080/job/flex-falcon/ws/temp/js/libs>
     [copy] Copying 94 files to <http://apacheflexbuild.cloudapp.net:8080/job/flex-falcon/ws/temp/flex-typedefs>
     [echo] copy easel and tween
     [copy] Copying 53 files to <http://apacheflexbuild.cloudapp.net:8080/job/flex-falcon/ws/temp/flex-typedefs>

binary-package-jx-zip:
      [zip] Building zip: <http://apacheflexbuild.cloudapp.net:8080/job/flex-falcon/1265/artifact/out/apache-flex-falconjx-0.8.0-bin.zip>

binary-package-jx-tgz:
      [tar] Building tar: <http://apacheflexbuild.cloudapp.net:8080/job/flex-falcon/1265/artifact/out/apache-flex-falconjx-0.8.0-bin.tar.gz>
     [copy] Copying 2 files to <http://apacheflexbuild.cloudapp.net:8080/job/flex-falcon/ws/out>

binary-release:

rat-taskdef:

have-rattasks:

no-rattasks:

rat-check:

rat-unzip:

clean-temp:
   [delete] Deleting directory <http://apacheflexbuild.cloudapp.net:8080/job/flex-falcon/ws/temp>
    [unzip] Expanding: <http://apacheflexbuild.cloudapp.net:8080/job/flex-falcon/1265/artifact/out/apache-flex-falconjx-0.8.0-src.zip>
into <http://apacheflexbuild.cloudapp.net:8080/job/flex-falcon/ws/temp>
     [echo] Checking files at <http://apacheflexbuild.cloudapp.net:8080/job/flex-falcon/ws/temp,>
report is <http://apacheflexbuild.cloudapp.net:8080/job/flex-falcon/ws/rat.report>

release:

create-md5:
     [echo] Generating MD5 hashes for release artifacts

copyLastSuccessfulBuild:

check_asjs:

get_asjs:
      [get] Getting: http://apacheflexbuild.cloudapp.net:8080/job/flex-asjs/lastSuccessfulBuild/artifact/out/apache-flex-flexjs-0.7.0-bin.zip
      [get] To: <http://apacheflexbuild.cloudapp.net:8080/job/flex-falcon/ws/compiler-jx/target/junit-temp/flexjs.zip>
      [get] Error opening connection java.io.FileNotFoundException: http://apacheflexbuild.cloudapp.net:8080/job/flex-asjs/lastSuccessfulBuild/artifact/out/apache-flex-flexjs-0.7.0-bin.zip
      [get] Error opening connection java.io.FileNotFoundException: http://apacheflexbuild.cloudapp.net:8080/job/flex-asjs/lastSuccessfulBuild/artifact/out/apache-flex-flexjs-0.7.0-bin.zip
      [get] Error opening connection java.io.FileNotFoundException: http://apacheflexbuild.cloudapp.net:8080/job/flex-asjs/lastSuccessfulBuild/artifact/out/apache-flex-flexjs-0.7.0-bin.zip
      [get] Can't get http://apacheflexbuild.cloudapp.net:8080/job/flex-asjs/lastSuccessfulBuild/artifact/out/apache-flex-flexjs-0.7.0-bin.zip
to <http://apacheflexbuild.cloudapp.net:8080/job/flex-falcon/ws/compiler-jx/target/junit-temp/flexjs.zip>

BUILD FAILED
<http://apacheflexbuild.cloudapp.net:8080/job/flex-falcon/ws/build.xml>:136: The following
error occurred while executing this line:
<http://apacheflexbuild.cloudapp.net:8080/job/flex-falcon/ws/compiler-jx/src/test/build.xml>:187:
Can't get http://apacheflexbuild.cloudapp.net:8080/job/flex-asjs/lastSuccessfulBuild/artifact/out/apache-flex-flexjs-0.7.0-bin.zip
to <http://apacheflexbuild.cloudapp.net:8080/job/flex-falcon/ws/compiler-jx/target/junit-temp/flexjs.zip>

Total time: 26 minutes 0 seconds
Picked up JAVA_TOOL_OPTIONS: -Dfile.encoding=UTF8
Build step 'Invoke Ant' marked build as failure
Skipped archiving because build is not successful
Recording test results

Mime
View raw message