flex-commits mailing list archives

Site index · List index
Message view « Date » · « Thread »
Top « Date » · « Thread »
From flex.ci.bui...@gmail.com
Subject Build failed in Jenkins: flex-asjs #1411
Date Sun, 11 Sep 2016 15:06:43 GMT
See <http://apacheflexbuild.cloudapp.net:8080/job/flex-asjs/1411/changes>

Changes:

[Alex Harui] add a script to update version numbers

[Alex Harui] test update from 0.6.0 to 0.7.0

[Alex Harui] also fix up nightly.properties

[Alex Harui] update to 0.8.0

[Alex Harui] try selenium 2.53.1

------------------------------------------
[...truncated 3033 lines...]

selenium2-jar:

download-zip:
    [mkdir] Created dir: <http://apacheflexbuild.cloudapp.net:8080/job/flex-asjs/ws/marmotinni/java/in>
      [get] Getting: http://selenium-release.storage.googleapis.com/2.53/selenium-java-2.53.1.zip
      [get] To: <http://apacheflexbuild.cloudapp.net:8080/job/flex-asjs/ws/marmotinni/java/in/selenium-java-2.53.1.zip>

untar-file:

unzip-file:
    [unzip] Expanding: <http://apacheflexbuild.cloudapp.net:8080/job/flex-asjs/ws/marmotinni/java/in/selenium-java-2.53.1.zip>
into <http://apacheflexbuild.cloudapp.net:8080/job/flex-asjs/ws/marmotinni/java/in/temp>

check-sum:

copy-downloaded-jar:
      [get] Getting: http://www.apache.org/licenses/LICENSE-2.0
      [get] To: <http://apacheflexbuild.cloudapp.net:8080/job/flex-asjs/ws/marmotinni/java/lib/selenium/selenium-LICENSE.txt>
     [copy] Copying 26 files to <http://apacheflexbuild.cloudapp.net:8080/job/flex-asjs/ws/marmotinni/java/lib/selenium>

clean:

main:

basictests-compile-js:
     [echo] FLEX_HOME: <http://apacheflexbuild.cloudapp.net:8080/job/flex-asjs/ws/>
     [echo] FALCONJX_HOME: <http://apacheflexbuild.cloudapp.net:8080/job/flex-asjs/ws/../flex-falcon/compiler-jx>
     [echo] GOOG_HOME: C:\google\closure\Library
     [java] Compiling file: <http://apacheflexbuild.cloudapp.net:8080/job/flex-asjs/ws/mustella/tests/bin/js-debug/halo/scripts/CheckBoxTestScript.js>
     [java] Compiling file: <http://apacheflexbuild.cloudapp.net:8080/job/flex-asjs/ws/mustella/tests/bin/js-debug/halo/scripts/ButtonTestScript.js>
     [java] Compiling file: <http://apacheflexbuild.cloudapp.net:8080/job/flex-asjs/ws/mustella/tests/bin/js-debug/BasicTestsApp.js>
     [java] Compiling file: <http://apacheflexbuild.cloudapp.net:8080/job/flex-asjs/ws/mustella/tests/bin/js-debug/FlexJSContext.js>
     [java] Compiling file: <http://apacheflexbuild.cloudapp.net:8080/job/flex-asjs/ws/mustella/tests/bin/js-debug/BasicTests.js>
     [java] Compiling file: <http://apacheflexbuild.cloudapp.net:8080/job/flex-asjs/ws/mustella/tests/bin/js-debug/shim/VBox.js>
     [java] Compiling file: <http://apacheflexbuild.cloudapp.net:8080/job/flex-asjs/ws/mustella/tests/bin/js-debug/halo/views/ButtonTests.js>
     [java] Compiling file: <http://apacheflexbuild.cloudapp.net:8080/job/flex-asjs/ws/mustella/tests/bin/js-debug/halo/views/CheckBoxTests.js>
     [java] using SWC: c:\Adobe\flashPlayer\11.7\playerglobal.swc
     [java] using SWC: <http://apacheflexbuild.cloudapp.net:8080/job/flex-asjs/ws/frameworks/libs/Binding.swc>
     [java] using SWC: <http://apacheflexbuild.cloudapp.net:8080/job/flex-asjs/ws/frameworks/libs/Charts.swc>
     [java] using SWC: <http://apacheflexbuild.cloudapp.net:8080/job/flex-asjs/ws/frameworks/libs/Collections.swc>
     [java] using SWC: <http://apacheflexbuild.cloudapp.net:8080/job/flex-asjs/ws/frameworks/libs/Core.swc>
     [java] using SWC: <http://apacheflexbuild.cloudapp.net:8080/job/flex-asjs/ws/frameworks/libs/CreateJS.swc>
     [java] using SWC: <http://apacheflexbuild.cloudapp.net:8080/job/flex-asjs/ws/frameworks/libs/DragDrop.swc>
     [java] using SWC: <http://apacheflexbuild.cloudapp.net:8080/job/flex-asjs/ws/frameworks/libs/Effects.swc>
     [java] using SWC: <http://apacheflexbuild.cloudapp.net:8080/job/flex-asjs/ws/frameworks/libs/Flat.swc>
     [java] using SWC: <http://apacheflexbuild.cloudapp.net:8080/job/flex-asjs/ws/frameworks/libs/Formatters.swc>
     [java] using SWC: <http://apacheflexbuild.cloudapp.net:8080/job/flex-asjs/ws/frameworks/libs/GoogleMaps.swc>
     [java] using SWC: <http://apacheflexbuild.cloudapp.net:8080/job/flex-asjs/ws/frameworks/libs/Graphics.swc>
     [java] using SWC: <http://apacheflexbuild.cloudapp.net:8080/job/flex-asjs/ws/frameworks/libs/HTML.swc>
     [java] using SWC: <http://apacheflexbuild.cloudapp.net:8080/job/flex-asjs/ws/frameworks/libs/HTML5.swc>
     [java] using SWC: <http://apacheflexbuild.cloudapp.net:8080/job/flex-asjs/ws/frameworks/libs/jQuery.swc>
     [java] using SWC: <http://apacheflexbuild.cloudapp.net:8080/job/flex-asjs/ws/frameworks/libs/Language.swc>
     [java] using SWC: <http://apacheflexbuild.cloudapp.net:8080/job/flex-asjs/ws/frameworks/libs/Mobile.swc>
     [java] using SWC: <http://apacheflexbuild.cloudapp.net:8080/job/flex-asjs/ws/frameworks/libs/Network.swc>
     [java] using SWC: <http://apacheflexbuild.cloudapp.net:8080/job/flex-asjs/ws/frameworks/libs/Reflection.swc>
     [java] using SWC: <http://apacheflexbuild.cloudapp.net:8080/job/flex-asjs/ws/frameworks/libs/Storage.swc>
     [java] using SWC: <http://apacheflexbuild.cloudapp.net:8080/job/flex-asjs/ws/frameworks/libs/XML.swc>
     [java] using SWC: c:\Jenkins\workspace\flex-sdk\mustella\mustella.swc
     [java] Dependencies calculated for '<http://apacheflexbuild.cloudapp.net:8080/job/flex-asjs/ws/mustella/tests/bin/js-debug/BasicTestsApp.js'>
     [java] Dependencies calculated for '<http://apacheflexbuild.cloudapp.net:8080/job/flex-asjs/ws/mustella/tests/bin/js-debug/org/apache/flex/utils/EffectTimer.js'>
     [java] Dependencies calculated for '<http://apacheflexbuild.cloudapp.net:8080/job/flex-asjs/ws/mustella/tests/bin/js-debug/org/apache/flex/core/ValuesManager.js'>
     [java] Dependencies calculated for '<http://apacheflexbuild.cloudapp.net:8080/job/flex-asjs/ws/mustella/tests/bin/js-debug/org/apache/flex/utils/Language.js'>
     [java] Dependencies calculated for '<http://apacheflexbuild.cloudapp.net:8080/job/flex-asjs/ws/mustella/tests/bin/js-debug/org/apache/flex/events/EventDispatcher.js'>
     [java] Dependencies calculated for '<http://apacheflexbuild.cloudapp.net:8080/job/flex-asjs/ws/mustella/tests/bin/js-debug/org/apache/flex/events/Event.js'>
     [java] Dependencies calculated for '<http://apacheflexbuild.cloudapp.net:8080/job/flex-asjs/ws/mustella/tests/bin/js-debug/org/apache/flex/events/IEventDispatcher.js'>
     [java] Dependencies calculated for '<http://apacheflexbuild.cloudapp.net:8080/job/flex-asjs/ws/mustella/tests/bin/js-debug/org/apache/flex/events/ValueEvent.js'>
     [java] Dependencies calculated for '<http://apacheflexbuild.cloudapp.net:8080/job/flex-asjs/ws/mustella/tests/bin/js-debug/org/apache/flex/core/IEffectTimer.js'>
     [java] Dependencies calculated for '<http://apacheflexbuild.cloudapp.net:8080/job/flex-asjs/ws/mustella/tests/bin/js-debug/org/apache/flex/core/SimpleStatesImpl.js'>
     [java] Dependencies calculated for '<http://apacheflexbuild.cloudapp.net:8080/job/flex-asjs/ws/mustella/tests/bin/js-debug/org/apache/flex/events/ValueChangeEvent.js'>
     [java] Dependencies calculated for '<http://apacheflexbuild.cloudapp.net:8080/job/flex-asjs/ws/mustella/tests/bin/js-debug/org/apache/flex/states/AddItems.js'>
     [java] Dependencies calculated for '<http://apacheflexbuild.cloudapp.net:8080/job/flex-asjs/ws/mustella/tests/bin/js-debug/org/apache/flex/states/ItemAndDescriptor.js'>
     [java] Dependencies calculated for '<http://apacheflexbuild.cloudapp.net:8080/job/flex-asjs/ws/mustella/tests/bin/js-debug/org/apache/flex/core/IDocument.js'>
     [java] Dependencies calculated for '<http://apacheflexbuild.cloudapp.net:8080/job/flex-asjs/ws/mustella/tests/bin/js-debug/org/apache/flex/states/SetEventHandler.js'>
     [java] Dependencies calculated for '<http://apacheflexbuild.cloudapp.net:8080/job/flex-asjs/ws/mustella/tests/bin/js-debug/org/apache/flex/states/SetProperty.js'>
     [java] Dependencies calculated for '<http://apacheflexbuild.cloudapp.net:8080/job/flex-asjs/ws/mustella/tests/bin/js-debug/org/apache/flex/utils/MXMLDataInterpreter.js'>
     [java] Dependencies calculated for '<http://apacheflexbuild.cloudapp.net:8080/job/flex-asjs/ws/mustella/tests/bin/js-debug/org/apache/flex/core/IBead.js'>
     [java] Dependencies calculated for '<http://apacheflexbuild.cloudapp.net:8080/job/flex-asjs/ws/mustella/tests/bin/js-debug/org/apache/flex/core/IContainer.js'>
     [java] Dependencies calculated for '<http://apacheflexbuild.cloudapp.net:8080/job/flex-asjs/ws/mustella/tests/bin/js-debug/org/apache/flex/core/IParent.js'>
     [java] Dependencies calculated for '<http://apacheflexbuild.cloudapp.net:8080/job/flex-asjs/ws/mustella/tests/bin/js-debug/org/apache/flex/core/IMXMLDocument.js'>
     [java] Dependencies calculated for '<http://apacheflexbuild.cloudapp.net:8080/job/flex-asjs/ws/mustella/tests/bin/js-debug/org/apache/flex/core/IStrand.js'>
     [java] Dependencies calculated for '<http://apacheflexbuild.cloudapp.net:8080/job/flex-asjs/ws/mustella/tests/bin/js-debug/org/apache/flex/core/IUIBase.js'>
     [java] Dependencies calculated for '<http://apacheflexbuild.cloudapp.net:8080/job/flex-asjs/ws/mustella/tests/bin/js-debug/org/apache/flex/core/IStatesImpl.js'>
     [java] Dependencies calculated for '<http://apacheflexbuild.cloudapp.net:8080/job/flex-asjs/ws/mustella/tests/bin/js-debug/org/apache/flex/core/IStatesObject.js'>
     [java] Dependencies calculated for '<http://apacheflexbuild.cloudapp.net:8080/job/flex-asjs/ws/mustella/tests/bin/js-debug/org/apache/flex/html/supportClasses/ContainerContentArea.js'>
     [java] Dependencies calculated for '<http://apacheflexbuild.cloudapp.net:8080/job/flex-asjs/ws/mustella/tests/bin/js-debug/org/apache/flex/core/UIBase.js'>
     [java] Dependencies calculated for '<http://apacheflexbuild.cloudapp.net:8080/job/flex-asjs/ws/mustella/tests/bin/js-debug/org/apache/flex/core/HTMLElementWrapper.js'>
     [java] Dependencies calculated for '<http://apacheflexbuild.cloudapp.net:8080/job/flex-asjs/ws/mustella/tests/bin/js-debug/org/apache/flex/events/BrowserEvent.js'>
     [java] Dependencies calculated for '<http://apacheflexbuild.cloudapp.net:8080/job/flex-asjs/ws/mustella/tests/bin/js-debug/org/apache/flex/events/ElementEvents.js'>
     [java] Dependencies calculated for '<http://apacheflexbuild.cloudapp.net:8080/job/flex-asjs/ws/mustella/tests/bin/js-debug/org/apache/flex/core/IBeadModel.js'>
     [java] Dependencies calculated for '<http://apacheflexbuild.cloudapp.net:8080/job/flex-asjs/ws/mustella/tests/bin/js-debug/org/apache/flex/core/IBeadController.js'>
     [java] Dependencies calculated for '<http://apacheflexbuild.cloudapp.net:8080/job/flex-asjs/ws/mustella/tests/bin/js-debug/org/apache/flex/core/IBeadView.js'>
     [java] Dependencies calculated for '<http://apacheflexbuild.cloudapp.net:8080/job/flex-asjs/ws/mustella/tests/bin/js-debug/org/apache/flex/core/IFlexJSElement.js'>
     [java] Dependencies calculated for '<http://apacheflexbuild.cloudapp.net:8080/job/flex-asjs/ws/mustella/tests/bin/js-debug/org/apache/flex/core/ILayoutChild.js'>
     [java] Dependencies calculated for '<http://apacheflexbuild.cloudapp.net:8080/job/flex-asjs/ws/mustella/tests/bin/js-debug/org/apache/flex/core/IChild.js'>
     [java] Dependencies calculated for '<http://apacheflexbuild.cloudapp.net:8080/job/flex-asjs/ws/mustella/tests/bin/js-debug/org/apache/flex/core/IMeasurementBead.js'>
     [java] Dependencies calculated for '<http://apacheflexbuild.cloudapp.net:8080/job/flex-asjs/ws/mustella/tests/bin/js-debug/org/apache/flex/core/IParentIUIBase.js'>
     [java] Dependencies calculated for '<http://apacheflexbuild.cloudapp.net:8080/job/flex-asjs/ws/mustella/tests/bin/js-debug/org/apache/flex/core/IStrandWithModel.js'>
     [java] Dependencies calculated for '<http://apacheflexbuild.cloudapp.net:8080/job/flex-asjs/ws/mustella/tests/bin/js-debug/org/apache/flex/core/IStyleableObject.js'>
     [java] Dependencies calculated for '<http://apacheflexbuild.cloudapp.net:8080/job/flex-asjs/ws/mustella/tests/bin/js-debug/org/apache/flex/core/IContentView.js'>
     [java] Dependencies calculated for '<http://apacheflexbuild.cloudapp.net:8080/job/flex-asjs/ws/mustella/tests/bin/js-debug/org/apache/flex/html/beads/layouts/BasicLayout.js'>
     [java] Dependencies calculated for '<http://apacheflexbuild.cloudapp.net:8080/job/flex-asjs/ws/mustella/tests/bin/js-debug/org/apache/flex/core/IBeadLayout.js'>
     [java] Dependencies calculated for '<http://apacheflexbuild.cloudapp.net:8080/job/flex-asjs/ws/mustella/tests/bin/js-debug/org/apache/flex/core/ILayoutHost.js'>
     [java] Dependencies calculated for '<http://apacheflexbuild.cloudapp.net:8080/job/flex-asjs/ws/mustella/tests/bin/js-debug/org/apache/flex/html/supportClasses/Viewport.js'>
     [java] Dependencies calculated for '<http://apacheflexbuild.cloudapp.net:8080/job/flex-asjs/ws/mustella/tests/bin/js-debug/org/apache/flex/geom/Size.js'>
     [java] Dependencies calculated for '<http://apacheflexbuild.cloudapp.net:8080/job/flex-asjs/ws/mustella/tests/bin/js-debug/org/apache/flex/utils/CSSContainerUtils.js'>
     [java] Dependencies calculated for '<http://apacheflexbuild.cloudapp.net:8080/job/flex-asjs/ws/mustella/tests/bin/js-debug/org/apache/flex/geom/Rectangle.js'>
     [java] Dependencies calculated for '<http://apacheflexbuild.cloudapp.net:8080/job/flex-asjs/ws/mustella/tests/bin/js-debug/org/apache/flex/geom/Point.js'>
     [java] Dependencies calculated for '<http://apacheflexbuild.cloudapp.net:8080/job/flex-asjs/ws/mustella/tests/bin/js-debug/org/apache/flex/utils/CSSUtils.js'>
     [java] Dependencies calculated for '<http://apacheflexbuild.cloudapp.net:8080/job/flex-asjs/ws/mustella/tests/bin/js-debug/org/apache/flex/utils/StringPadder.js'>
     [java] Dependencies calculated for '<http://apacheflexbuild.cloudapp.net:8080/job/flex-asjs/ws/mustella/tests/bin/js-debug/org/apache/flex/core/IViewport.js'>
     [java] Dependencies calculated for '<http://apacheflexbuild.cloudapp.net:8080/job/flex-asjs/ws/mustella/tests/bin/js-debug/org/apache/flex/html/beads/ContainerView.js'>
     [java] Dependencies calculated for '<http://apacheflexbuild.cloudapp.net:8080/job/flex-asjs/ws/mustella/tests/bin/js-debug/org/apache/flex/core/BeadViewBase.js'>
     [java] Dependencies calculated for '<http://apacheflexbuild.cloudapp.net:8080/job/flex-asjs/ws/mustella/tests/bin/js-debug/org/apache/flex/core/IContainerView.js'>
     [java] Dependencies calculated for '<http://apacheflexbuild.cloudapp.net:8080/job/flex-asjs/ws/mustella/tests/bin/js-debug/org/apache/flex/core/IContentViewHost.js'>
     [java] Dependencies calculated for '<http://apacheflexbuild.cloudapp.net:8080/job/flex-asjs/ws/mustella/tests/bin/js-debug/org/apache/flex/core/IViewportModel.js'>
     [java] Dependencies calculated for '<http://apacheflexbuild.cloudapp.net:8080/job/flex-asjs/ws/mustella/tests/bin/js-debug/org/apache/flex/html/beads/IBackgroundBead.js'>
     [java] Dependencies calculated for '<http://apacheflexbuild.cloudapp.net:8080/job/flex-asjs/ws/mustella/tests/bin/js-debug/org/apache/flex/html/beads/IBorderBead.js'>
     [java] Dependencies calculated for '<http://apacheflexbuild.cloudapp.net:8080/job/flex-asjs/ws/mustella/tests/bin/js-debug/org/apache/flex/html/beads/models/ViewportModel.js'>
     [java] Dependencies calculated for '<http://apacheflexbuild.cloudapp.net:8080/job/flex-asjs/ws/mustella/tests/bin/js-debug/org/apache/flex/html/beads/DataItemRendererFactoryForArrayList.js'>
     [java] Dependencies calculated for '<http://apacheflexbuild.cloudapp.net:8080/job/flex-asjs/ws/mustella/tests/bin/js-debug/org/apache/flex/core/SimpleCSSStyles.js'>
     [java] Dependencies calculated for '<http://apacheflexbuild.cloudapp.net:8080/job/flex-asjs/ws/mustella/tests/bin/js-debug/org/apache/flex/events/ItemRendererEvent.js'>
     [java] Dependencies calculated for '<http://apacheflexbuild.cloudapp.net:8080/job/flex-asjs/ws/mustella/tests/bin/js-debug/org/apache/flex/events/CustomEvent.js'>
     [java] Dependencies calculated for '<http://apacheflexbuild.cloudapp.net:8080/job/flex-asjs/ws/mustella/tests/bin/js-debug/org/apache/flex/html/List.js'>
     [java] Dependencies calculated for '<http://apacheflexbuild.cloudapp.net:8080/job/flex-asjs/ws/mustella/tests/bin/js-debug/org/apache/flex/core/ListBase.js'>
     [java] Dependencies calculated for '<http://apacheflexbuild.cloudapp.net:8080/job/flex-asjs/ws/mustella/tests/bin/js-debug/org/apache/flex/core/ListBaseStrandChildren.js'>
     [java] Dependencies calculated for '<http://apacheflexbuild.cloudapp.net:8080/job/flex-asjs/ws/mustella/tests/bin/js-debug/org/apache/flex/html/beads/ListView.js'>
     [java] Dependencies calculated for '<http://apacheflexbuild.cloudapp.net:8080/job/flex-asjs/ws/mustella/tests/bin/js-debug/org/apache/flex/core/IItemRendererParent.js'>
     [java] Dependencies calculated for '<http://apacheflexbuild.cloudapp.net:8080/job/flex-asjs/ws/mustella/tests/bin/js-debug/org/apache/flex/core/IRollOverModel.js'>
     [java] Dependencies calculated for '<http://apacheflexbuild.cloudapp.net:8080/job/flex-asjs/ws/mustella/tests/bin/js-debug/org/apache/flex/core/ISelectableItemRenderer.js'>
     [java] Dependencies calculated for '<http://apacheflexbuild.cloudapp.net:8080/job/flex-asjs/ws/mustella/tests/bin/js-debug/org/apache/flex/core/IItemRenderer.js'>
     [java] Dependencies calculated for '<http://apacheflexbuild.cloudapp.net:8080/job/flex-asjs/ws/mustella/tests/bin/js-debug/org/apache/flex/core/ISelectionModel.js'>
     [java] Dependencies calculated for '<http://apacheflexbuild.cloudapp.net:8080/job/flex-asjs/ws/mustella/tests/bin/js-debug/org/apache/flex/html/beads/IListView.js'>
     [java] Dependencies calculated for '<http://apacheflexbuild.cloudapp.net:8080/job/flex-asjs/ws/mustella/tests/bin/js-debug/org/apache/flex/html/beads/models/ListPresentationModel.js'>
     [java] Dependencies calculated for '<http://apacheflexbuild.cloudapp.net:8080/job/flex-asjs/ws/mustella/tests/bin/js-debug/org/apache/flex/core/IListPresentationModel.js'>
     [java] Dependencies calculated for '<http://apacheflexbuild.cloudapp.net:8080/job/flex-asjs/ws/mustella/tests/bin/js-debug/org/apache/flex/core/IDataProviderItemRendererMapper.js'>
     [java] Dependencies calculated for '<http://apacheflexbuild.cloudapp.net:8080/job/flex-asjs/ws/mustella/tests/bin/js-debug/org/apache/flex/core/IItemRendererClassFactory.js'>
     [java] Dependencies calculated for '<http://apacheflexbuild.cloudapp.net:8080/job/flex-asjs/ws/mustella/tests/bin/js-debug/org/apache/flex/core/IItemRendererProvider.js'>
     [java] Dependencies calculated for '<http://apacheflexbuild.cloudapp.net:8080/job/flex-asjs/ws/mustella/tests/bin/js-debug/org/apache/flex/collections/IArrayList.js'>
     [java] Dependencies calculated for '<http://apacheflexbuild.cloudapp.net:8080/job/flex-asjs/ws/mustella/tests/bin/js-debug/org/apache/flex/html/supportClasses/DataGroup.js'>
     [java] Dependencies calculated for '<http://apacheflexbuild.cloudapp.net:8080/job/flex-asjs/ws/mustella/tests/bin/js-debug/org/apache/flex/events/ItemAddedEvent.js'>
     [java] Dependencies calculated for '<http://apacheflexbuild.cloudapp.net:8080/job/flex-asjs/ws/mustella/tests/bin/js-debug/org/apache/flex/events/ItemRemovedEvent.js'>
     [java] Dependencies calculated for '<http://apacheflexbuild.cloudapp.net:8080/job/flex-asjs/ws/mustella/tests/bin/js-debug/org/apache/flex/html/supportClasses/DataItemRenderer.js'>
     [java] Dependencies calculated for '<http://apacheflexbuild.cloudapp.net:8080/job/flex-asjs/ws/mustella/tests/bin/js-debug/org/apache/flex/html/beads/controllers/ItemRendererMouseController.js'>
     [java] Dependencies calculated for '<http://apacheflexbuild.cloudapp.net:8080/job/flex-asjs/ws/mustella/tests/bin/js-debug/org/apache/flex/events/ItemClickedEvent.js'>
     [java] Dependencies calculated for '<http://apacheflexbuild.cloudapp.net:8080/job/flex-asjs/ws/mustella/tests/bin/js-debug/org/apache/flex/html/supportClasses/UIItemRendererBase.js'>
     [java] Dependencies calculated for '<http://apacheflexbuild.cloudapp.net:8080/job/flex-asjs/ws/mustella/tests/bin/js-debug/org/apache/flex/html/beads/layouts/VerticalLayout.js'>
     [java] Dependencies calculated for '<http://apacheflexbuild.cloudapp.net:8080/job/flex-asjs/ws/mustella/tests/bin/js-debug/org/apache/flex/html/beads/controllers/ListSingleSelectionMouseController.js'>
     [java] Dependencies calculated for '<http://apacheflexbuild.cloudapp.net:8080/job/flex-asjs/ws/mustella/tests/bin/js-debug/org/apache/flex/core/ItemRendererClassFactory.js'>
     [java] Dependencies calculated for '<http://apacheflexbuild.cloudapp.net:8080/job/flex-asjs/ws/mustella/tests/bin/js-debug/org/apache/flex/core/ClassFactory.js'>
     [java] Dependencies calculated for '<http://apacheflexbuild.cloudapp.net:8080/job/flex-asjs/ws/mustella/tests/bin/js-debug/org/apache/flex/core/IFactory.js'>
     [java] Dependencies calculated for '<http://apacheflexbuild.cloudapp.net:8080/job/flex-asjs/ws/mustella/tests/bin/js-debug/org/apache/flex/core/Strand.js'>
     [java] Dependencies calculated for '<http://apacheflexbuild.cloudapp.net:8080/job/flex-asjs/ws/mustella/tests/bin/js-debug/org/apache/flex/html/supportClasses/StringItemRenderer.js'>
     [java] Dependencies calculated for '<http://apacheflexbuild.cloudapp.net:8080/job/flex-asjs/ws/mustella/tests/bin/js-debug/org/apache/flex/html/beads/ITextItemRenderer.js'>
     [java] Dependencies calculated for '<http://apacheflexbuild.cloudapp.net:8080/job/flex-asjs/ws/mustella/tests/bin/js-debug/org/apache/flex/html/beads/models/DataGridModel.js'>
     [java] Dependencies calculated for '<http://apacheflexbuild.cloudapp.net:8080/job/flex-asjs/ws/mustella/tests/bin/js-debug/org/apache/flex/html/beads/models/ArrayListSelectionModel.js'>
     [java] Dependencies calculated for '<http://apacheflexbuild.cloudapp.net:8080/job/flex-asjs/ws/mustella/tests/bin/js-debug/org/apache/flex/core/IDataGridModel.js'>
     [java] Dependencies calculated for '<http://apacheflexbuild.cloudapp.net:8080/job/flex-asjs/ws/mustella/tests/bin/js-debug/org/apache/flex/html/beads/DataItemRendererFactoryForArrayData.js'>
     [java] Dependencies calculated for '<http://apacheflexbuild.cloudapp.net:8080/job/flex-asjs/ws/mustella/tests/bin/js-debug/org/apache/flex/html/supportClasses/ScrollingViewport.js'>
     [java] Dependencies calculated for '<http://apacheflexbuild.cloudapp.net:8080/job/flex-asjs/ws/mustella/tests/bin/js-debug/org/apache/flex/html/beads/models/ArraySelectionModel.js'>
     [java] Dependencies calculated for '<http://apacheflexbuild.cloudapp.net:8080/job/flex-asjs/ws/mustella/tests/bin/js-debug/org/apache/flex/core/Application.js'>
     [java] Dependencies calculated for '<http://apacheflexbuild.cloudapp.net:8080/job/flex-asjs/ws/mustella/tests/bin/js-debug/org/apache/flex/core/ApplicationBase.js'>
     [java] Dependencies calculated for '<http://apacheflexbuild.cloudapp.net:8080/job/flex-asjs/ws/mustella/tests/bin/js-debug/org/apache/flex/core/IFlexInfo.js'>
     [java] Dependencies calculated for '<http://apacheflexbuild.cloudapp.net:8080/job/flex-asjs/ws/mustella/tests/bin/js-debug/org/apache/flex/utils/Timer.js'>
     [java] Dependencies calculated for '<http://apacheflexbuild.cloudapp.net:8080/job/flex-asjs/ws/mustella/tests/bin/js-debug/org/apache/flex/core/SimpleCSSValuesImpl.js'>
     [java] Dependencies calculated for '<http://apacheflexbuild.cloudapp.net:8080/job/flex-asjs/ws/mustella/tests/bin/js-debug/org/apache/flex/core/ICSSImpl.js'>
     [java] Dependencies calculated for '<http://apacheflexbuild.cloudapp.net:8080/job/flex-asjs/ws/mustella/tests/bin/js-debug/org/apache/flex/core/IValuesImpl.js'>
     [java] Dependencies calculated for '<http://apacheflexbuild.cloudapp.net:8080/job/flex-asjs/ws/mustella/tests/bin/js-debug/BasicTests.js'>
     [java] Dependencies calculated for '<http://apacheflexbuild.cloudapp.net:8080/job/flex-asjs/ws/mustella/tests/bin/js-debug/org/apache/flex/core/View.js'>
     [java] Dependencies calculated for '<http://apacheflexbuild.cloudapp.net:8080/job/flex-asjs/ws/mustella/tests/bin/js-debug/org/apache/flex/core/ViewBase.js'>
     [java] Dependencies calculated for '<http://apacheflexbuild.cloudapp.net:8080/job/flex-asjs/ws/mustella/tests/bin/js-debug/org/apache/flex/core/ContainerBase.js'>
     [java] Dependencies calculated for '<http://apacheflexbuild.cloudapp.net:8080/job/flex-asjs/ws/mustella/tests/bin/js-debug/org/apache/flex/core/ContainerBaseStrandChildren.js'>
     [java] Dependencies calculated for '<http://apacheflexbuild.cloudapp.net:8080/job/flex-asjs/ws/mustella/tests/bin/js-debug/org/apache/flex/core/IApplicationView.js'>
     [java] Dependencies calculated for '<http://apacheflexbuild.cloudapp.net:8080/job/flex-asjs/ws/mustella/tests/bin/js-debug/org/apache/flex/core/IPopUpHost.js'>
     [java] Dependencies calculated for '<http://apacheflexbuild.cloudapp.net:8080/job/flex-asjs/ws/mustella/tests/bin/js-debug/org/apache/flex/states/State.js'>
     [java] Dependencies calculated for '<http://apacheflexbuild.cloudapp.net:8080/job/flex-asjs/ws/mustella/tests/bin/js-debug/halo/views/ButtonTests.js'>
     [java] Dependencies calculated for '<http://apacheflexbuild.cloudapp.net:8080/job/flex-asjs/ws/mustella/tests/bin/js-debug/shim/VBox.js'>
     [java] Dependencies calculated for '<http://apacheflexbuild.cloudapp.net:8080/job/flex-asjs/ws/mustella/tests/bin/js-debug/org/apache/flex/html/Container.js'>
     [java] Dependencies calculated for '<http://apacheflexbuild.cloudapp.net:8080/job/flex-asjs/ws/mustella/tests/bin/js-debug/org/apache/flex/html/TextButton.js'>
     [java] Dependencies calculated for '<http://apacheflexbuild.cloudapp.net:8080/job/flex-asjs/ws/mustella/tests/bin/js-debug/org/apache/flex/html/Button.js'>
     [java] Dependencies calculated for '<http://apacheflexbuild.cloudapp.net:8080/job/flex-asjs/ws/mustella/tests/bin/js-debug/org/apache/flex/html/Label.js'>
     [java] Dependencies calculated for '<http://apacheflexbuild.cloudapp.net:8080/job/flex-asjs/ws/mustella/tests/bin/js-debug/org/apache/flex/events/MouseEvent.js'>
     [java] Dependencies calculated for '<http://apacheflexbuild.cloudapp.net:8080/job/flex-asjs/ws/mustella/tests/bin/js-debug/org/apache/flex/utils/PointUtils.js'>
     [java] Dependencies calculated for '<http://apacheflexbuild.cloudapp.net:8080/job/flex-asjs/ws/mustella/tests/bin/js-debug/halo/views/CheckBoxTests.js'>
     [java] Dependencies calculated for '<http://apacheflexbuild.cloudapp.net:8080/job/flex-asjs/ws/mustella/tests/bin/js-debug/org/apache/flex/html/CheckBox.js'>
     [java] Dependencies calculated for '<http://apacheflexbuild.cloudapp.net:8080/job/flex-asjs/ws/mustella/tests/bin/js-debug/org/apache/flex/html/supportClasses/CheckBoxIcon.js'>
     [java] Dependencies calculated for '<http://apacheflexbuild.cloudapp.net:8080/job/flex-asjs/ws/mustella/tests/bin/js-debug/org/apache/flex/utils/MixinManager.js'>
     [java] Dependencies calculated for '<http://apacheflexbuild.cloudapp.net:8080/job/flex-asjs/ws/mustella/tests/bin/js-debug/org/apache/flex/core/CSSFontFaceBead.js'>
     [java] Dependencies calculated for '<http://apacheflexbuild.cloudapp.net:8080/job/flex-asjs/ws/mustella/tests/bin/js-debug/FlexJSContext.js'>
     [java] Dependencies calculated for '<http://apacheflexbuild.cloudapp.net:8080/job/flex-asjs/ws/mustella/tests/bin/js-debug/SendFormattedResultsToLog.js'>
     [java] Dependencies calculated for '<http://apacheflexbuild.cloudapp.net:8080/job/flex-asjs/ws/mustella/tests/bin/js-debug/SetShowRTE.js'>
     [java] Dependencies calculated for '<http://apacheflexbuild.cloudapp.net:8080/job/flex-asjs/ws/mustella/tests/bin/js-debug/ExitWhenDone.js'>
     [java] Dependencies calculated for '<http://apacheflexbuild.cloudapp.net:8080/job/flex-asjs/ws/mustella/tests/bin/js-debug/halo/scripts/CheckBoxTestScript.js'>
     [java] Dependencies calculated for '<http://apacheflexbuild.cloudapp.net:8080/job/flex-asjs/ws/mustella/tests/bin/js-debug/UnitTester.js'>
     [java] Dependencies calculated for '<http://apacheflexbuild.cloudapp.net:8080/job/flex-asjs/ws/mustella/tests/bin/js-debug/TestCase.js'>
     [java] Dependencies calculated for '<http://apacheflexbuild.cloudapp.net:8080/job/flex-asjs/ws/mustella/tests/bin/js-debug/SetProperty.js'>
     [java] Dependencies calculated for '<http://apacheflexbuild.cloudapp.net:8080/job/flex-asjs/ws/mustella/tests/bin/js-debug/AssertPropertyValue.js'>
     [java] Dependencies calculated for '<http://apacheflexbuild.cloudapp.net:8080/job/flex-asjs/ws/mustella/tests/bin/js-debug/DispatchMouseEvent.js'>
     [java] Dependencies calculated for '<http://apacheflexbuild.cloudapp.net:8080/job/flex-asjs/ws/mustella/tests/bin/js-debug/DispatchMouseClickEvent.js'>
     [java] Dependencies calculated for '<http://apacheflexbuild.cloudapp.net:8080/job/flex-asjs/ws/mustella/tests/bin/js-debug/halo/scripts/ButtonTestScript.js'>
     [java] The project 'BasicTestsApp' has been successfully compiled and optimized.
     [java] Picked up JAVA_TOOL_OPTIONS: -Dfile.encoding=UTF8

basictests-compile-java:
   [delete] Deleting directory <http://apacheflexbuild.cloudapp.net:8080/job/flex-asjs/ws/mustella/java/bin>
    [mkdir] Created dir: <http://apacheflexbuild.cloudapp.net:8080/job/flex-asjs/ws/mustella/java/bin>
    [javac] <http://apacheflexbuild.cloudapp.net:8080/job/flex-asjs/ws/build.xml>:1282:
warning: 'includeantruntime' was not set, defaulting to build.sysclasspath=last; set to false
for repeatable builds
    [javac] Compiling 11 source files to <http://apacheflexbuild.cloudapp.net:8080/job/flex-asjs/ws/mustella/java/bin>

basictests-run-js:
     [echo] url=file://<http://apacheflexbuild.cloudapp.net:8080/job/flex-asjs/ws/mustella/tests/basicTests/bin/js-debug/index.html>
     [echo] script=<http://apacheflexbuild.cloudapp.net:8080/job/flex-asjs/ws/mustella/tests/basicTests/halo/scripts/ButtonTestScript.mxml>
     [echo] script=<http://apacheflexbuild.cloudapp.net:8080/job/flex-asjs/ws/mustella/tests/basicTests/halo/scripts/CheckBoxTestScript.mxml>
     [java] file://<http://apacheflexbuild.cloudapp.net:8080/job/flex-asjs/ws/mustella/tests/bin/js-debug/index.html>
     [java] org.openqa.selenium.firefox.NotConnectedException: Unable to connect to host 127.0.0.1
on port 7055 after 45000 ms. Firefox console output:
     [java] 
     [java] 	at org.openqa.selenium.firefox.internal.NewProfileExtensionConnection.start(NewProfileExtensionConnection.java:112)
     [java] 	at org.openqa.selenium.firefox.FirefoxDriver.startClient(FirefoxDriver.java:271)
     [java] 	at org.openqa.selenium.remote.RemoteWebDriver.<init>(RemoteWebDriver.java:119)
     [java] 	at org.openqa.selenium.firefox.FirefoxDriver.<init>(FirefoxDriver.java:218)
     [java] 	at org.openqa.selenium.firefox.FirefoxDriver.<init>(FirefoxDriver.java:211)
     [java] 	at org.openqa.selenium.firefox.FirefoxDriver.<init>(FirefoxDriver.java:207)
     [java] 	at org.openqa.selenium.firefox.FirefoxDriver.<init>(FirefoxDriver.java:120)
     [java] 	at marmotinni.MarmotinniRunner.main(Unknown Source)
     [java] Exception in thread "main" org.openqa.selenium.WebDriverException: Failed to connect
to binary FirefoxBinary(C:\Program Files (x86)\Mozilla Firefox\firefox.exe) on port 7055;
process output follows: 
     [java] 
     [java] Build info: version: '2.53.1', revision: 'a36b8b1', time: '2016-06-30 17:32:46'
     [java] System info: host: 'apacheflexbuild', ip: '100.68.242.38', os.name: 'Windows Server
2008 R2', os.arch: 'amd64', os.version: '6.1', java.version: '1.7.0_55'
     [java] Driver info: driver.version: FirefoxDriver
     [java] 	at org.openqa.selenium.firefox.internal.NewProfileExtensionConnection.start(NewProfileExtensionConnection.java:124)
     [java] 	at org.openqa.selenium.firefox.FirefoxDriver.startClient(FirefoxDriver.java:271)
     [java] 	at org.openqa.selenium.remote.RemoteWebDriver.<init>(RemoteWebDriver.java:119)
     [java] 	at org.openqa.selenium.firefox.FirefoxDriver.<init>(FirefoxDriver.java:218)
     [java] 	at org.openqa.selenium.firefox.FirefoxDriver.<init>(FirefoxDriver.java:211)
     [java] 	at org.openqa.selenium.firefox.FirefoxDriver.<init>(FirefoxDriver.java:207)
     [java] 	at org.openqa.selenium.firefox.FirefoxDriver.<init>(FirefoxDriver.java:120)
     [java] 	at marmotinni.MarmotinniRunner.main(Unknown Source)
     [java] Caused by: org.openqa.selenium.firefox.NotConnectedException: Unable to connect
to host 127.0.0.1 on port 7055 after 45000 ms. Firefox console output:
     [java] 
     [java] 	at org.openqa.selenium.firefox.internal.NewProfileExtensionConnection.start(NewProfileExtensionConnection.java:112)
     [java] 	... 7 more
     [java] Picked up JAVA_TOOL_OPTIONS: -Dfile.encoding=UTF8

BUILD FAILED
<http://apacheflexbuild.cloudapp.net:8080/job/flex-asjs/ws/build.xml>:1176: Java returned:
1

Total time: 31 minutes 6 seconds
Picked up JAVA_TOOL_OPTIONS: -Dfile.encoding=UTF8
Build step 'Invoke Ant' marked build as failure
Skipped archiving because build is not successful

Mime
View raw message