flex-commits mailing list archives

Site index · List index
Message view « Date » · « Thread »
Top « Date » · « Thread »
From flex.ci.bui...@gmail.com
Subject Build failed in Jenkins: flex-asjs #1188
Date Mon, 27 Jun 2016 06:34:52 GMT
See <http://apacheflexbuild.cloudapp.net:8080/job/flex-asjs/1188/>

------------------------------------------
[...truncated 2900 lines...]
     [java] Dependencies calculated for '<http://apacheflexbuild.cloudapp.net:8080/job/flex-asjs/ws/mustella/tests/bin/js-debug/org/apache/flex/states/SetEventHandler.js'>
     [java] Dependencies calculated for '<http://apacheflexbuild.cloudapp.net:8080/job/flex-asjs/ws/mustella/tests/bin/js-debug/org/apache/flex/states/SetProperty.js'>
     [java] Dependencies calculated for '<http://apacheflexbuild.cloudapp.net:8080/job/flex-asjs/ws/mustella/tests/bin/js-debug/org/apache/flex/utils/MXMLDataInterpreter.js'>
     [java] Dependencies calculated for '<http://apacheflexbuild.cloudapp.net:8080/job/flex-asjs/ws/mustella/tests/bin/js-debug/org/apache/flex/core/IBead.js'>
     [java] Dependencies calculated for '<http://apacheflexbuild.cloudapp.net:8080/job/flex-asjs/ws/mustella/tests/bin/js-debug/org/apache/flex/core/IContainer.js'>
     [java] Dependencies calculated for '<http://apacheflexbuild.cloudapp.net:8080/job/flex-asjs/ws/mustella/tests/bin/js-debug/org/apache/flex/core/IParent.js'>
     [java] Dependencies calculated for '<http://apacheflexbuild.cloudapp.net:8080/job/flex-asjs/ws/mustella/tests/bin/js-debug/org/apache/flex/core/IMXMLDocument.js'>
     [java] Dependencies calculated for '<http://apacheflexbuild.cloudapp.net:8080/job/flex-asjs/ws/mustella/tests/bin/js-debug/org/apache/flex/core/IStrand.js'>
     [java] Dependencies calculated for '<http://apacheflexbuild.cloudapp.net:8080/job/flex-asjs/ws/mustella/tests/bin/js-debug/org/apache/flex/core/IUIBase.js'>
     [java] Dependencies calculated for '<http://apacheflexbuild.cloudapp.net:8080/job/flex-asjs/ws/mustella/tests/bin/js-debug/org/apache/flex/core/IStatesImpl.js'>
     [java] Dependencies calculated for '<http://apacheflexbuild.cloudapp.net:8080/job/flex-asjs/ws/mustella/tests/bin/js-debug/org/apache/flex/core/IStatesObject.js'>
     [java] Dependencies calculated for '<http://apacheflexbuild.cloudapp.net:8080/job/flex-asjs/ws/mustella/tests/bin/js-debug/org/apache/flex/html/supportClasses/ContainerContentArea.js'>
     [java] Dependencies calculated for '<http://apacheflexbuild.cloudapp.net:8080/job/flex-asjs/ws/mustella/tests/bin/js-debug/org/apache/flex/core/UIBase.js'>
     [java] Dependencies calculated for '<http://apacheflexbuild.cloudapp.net:8080/job/flex-asjs/ws/mustella/tests/bin/js-debug/org/apache/flex/core/HTMLElementWrapper.js'>
     [java] Dependencies calculated for '<http://apacheflexbuild.cloudapp.net:8080/job/flex-asjs/ws/mustella/tests/bin/js-debug/org/apache/flex/events/BrowserEvent.js'>
     [java] Dependencies calculated for '<http://apacheflexbuild.cloudapp.net:8080/job/flex-asjs/ws/mustella/tests/bin/js-debug/org/apache/flex/events/ElementEvents.js'>
     [java] Dependencies calculated for '<http://apacheflexbuild.cloudapp.net:8080/job/flex-asjs/ws/mustella/tests/bin/js-debug/org/apache/flex/core/IBeadModel.js'>
     [java] Dependencies calculated for '<http://apacheflexbuild.cloudapp.net:8080/job/flex-asjs/ws/mustella/tests/bin/js-debug/org/apache/flex/core/IBeadController.js'>
     [java] Dependencies calculated for '<http://apacheflexbuild.cloudapp.net:8080/job/flex-asjs/ws/mustella/tests/bin/js-debug/org/apache/flex/core/IBeadView.js'>
     [java] Dependencies calculated for '<http://apacheflexbuild.cloudapp.net:8080/job/flex-asjs/ws/mustella/tests/bin/js-debug/org/apache/flex/core/IFlexJSElement.js'>
     [java] Dependencies calculated for '<http://apacheflexbuild.cloudapp.net:8080/job/flex-asjs/ws/mustella/tests/bin/js-debug/org/apache/flex/core/ILayoutChild.js'>
     [java] Dependencies calculated for '<http://apacheflexbuild.cloudapp.net:8080/job/flex-asjs/ws/mustella/tests/bin/js-debug/org/apache/flex/core/IChild.js'>
     [java] Dependencies calculated for '<http://apacheflexbuild.cloudapp.net:8080/job/flex-asjs/ws/mustella/tests/bin/js-debug/org/apache/flex/core/IMeasurementBead.js'>
     [java] Dependencies calculated for '<http://apacheflexbuild.cloudapp.net:8080/job/flex-asjs/ws/mustella/tests/bin/js-debug/org/apache/flex/core/IParentIUIBase.js'>
     [java] Dependencies calculated for '<http://apacheflexbuild.cloudapp.net:8080/job/flex-asjs/ws/mustella/tests/bin/js-debug/org/apache/flex/core/IStrandWithModel.js'>
     [java] Dependencies calculated for '<http://apacheflexbuild.cloudapp.net:8080/job/flex-asjs/ws/mustella/tests/bin/js-debug/org/apache/flex/core/IStyleableObject.js'>
     [java] Dependencies calculated for '<http://apacheflexbuild.cloudapp.net:8080/job/flex-asjs/ws/mustella/tests/bin/js-debug/org/apache/flex/core/IContentView.js'>
     [java] Dependencies calculated for '<http://apacheflexbuild.cloudapp.net:8080/job/flex-asjs/ws/mustella/tests/bin/js-debug/org/apache/flex/html/beads/layouts/BasicLayout.js'>
     [java] Dependencies calculated for '<http://apacheflexbuild.cloudapp.net:8080/job/flex-asjs/ws/mustella/tests/bin/js-debug/org/apache/flex/core/IBeadLayout.js'>
     [java] Dependencies calculated for '<http://apacheflexbuild.cloudapp.net:8080/job/flex-asjs/ws/mustella/tests/bin/js-debug/org/apache/flex/core/ILayoutHost.js'>
     [java] Dependencies calculated for '<http://apacheflexbuild.cloudapp.net:8080/job/flex-asjs/ws/mustella/tests/bin/js-debug/org/apache/flex/html/supportClasses/Viewport.js'>
     [java] Dependencies calculated for '<http://apacheflexbuild.cloudapp.net:8080/job/flex-asjs/ws/mustella/tests/bin/js-debug/org/apache/flex/geom/Size.js'>
     [java] Dependencies calculated for '<http://apacheflexbuild.cloudapp.net:8080/job/flex-asjs/ws/mustella/tests/bin/js-debug/org/apache/flex/utils/CSSContainerUtils.js'>
     [java] Dependencies calculated for '<http://apacheflexbuild.cloudapp.net:8080/job/flex-asjs/ws/mustella/tests/bin/js-debug/org/apache/flex/geom/Rectangle.js'>
     [java] Dependencies calculated for '<http://apacheflexbuild.cloudapp.net:8080/job/flex-asjs/ws/mustella/tests/bin/js-debug/org/apache/flex/utils/CSSUtils.js'>
     [java] Dependencies calculated for '<http://apacheflexbuild.cloudapp.net:8080/job/flex-asjs/ws/mustella/tests/bin/js-debug/org/apache/flex/core/IViewport.js'>
     [java] Dependencies calculated for '<http://apacheflexbuild.cloudapp.net:8080/job/flex-asjs/ws/mustella/tests/bin/js-debug/org/apache/flex/html/beads/ContainerView.js'>
     [java] Dependencies calculated for '<http://apacheflexbuild.cloudapp.net:8080/job/flex-asjs/ws/mustella/tests/bin/js-debug/org/apache/flex/core/BeadViewBase.js'>
     [java] Dependencies calculated for '<http://apacheflexbuild.cloudapp.net:8080/job/flex-asjs/ws/mustella/tests/bin/js-debug/org/apache/flex/core/IContainerView.js'>
     [java] Dependencies calculated for '<http://apacheflexbuild.cloudapp.net:8080/job/flex-asjs/ws/mustella/tests/bin/js-debug/org/apache/flex/core/IContentViewHost.js'>
     [java] Dependencies calculated for '<http://apacheflexbuild.cloudapp.net:8080/job/flex-asjs/ws/mustella/tests/bin/js-debug/org/apache/flex/core/IViewportModel.js'>
     [java] Dependencies calculated for '<http://apacheflexbuild.cloudapp.net:8080/job/flex-asjs/ws/mustella/tests/bin/js-debug/org/apache/flex/html/beads/IBackgroundBead.js'>
     [java] Dependencies calculated for '<http://apacheflexbuild.cloudapp.net:8080/job/flex-asjs/ws/mustella/tests/bin/js-debug/org/apache/flex/html/beads/IBorderBead.js'>
     [java] Dependencies calculated for '<http://apacheflexbuild.cloudapp.net:8080/job/flex-asjs/ws/mustella/tests/bin/js-debug/org/apache/flex/html/beads/models/ViewportModel.js'>
     [java] Dependencies calculated for '<http://apacheflexbuild.cloudapp.net:8080/job/flex-asjs/ws/mustella/tests/bin/js-debug/org/apache/flex/html/beads/DataItemRendererFactoryForArrayList.js'>
     [java] Dependencies calculated for '<http://apacheflexbuild.cloudapp.net:8080/job/flex-asjs/ws/mustella/tests/bin/js-debug/org/apache/flex/core/SimpleCSSStyles.js'>
     [java] Dependencies calculated for '<http://apacheflexbuild.cloudapp.net:8080/job/flex-asjs/ws/mustella/tests/bin/js-debug/org/apache/flex/html/List.js'>
     [java] Dependencies calculated for '<http://apacheflexbuild.cloudapp.net:8080/job/flex-asjs/ws/mustella/tests/bin/js-debug/org/apache/flex/core/ListBase.js'>
     [java] Dependencies calculated for '<http://apacheflexbuild.cloudapp.net:8080/job/flex-asjs/ws/mustella/tests/bin/js-debug/org/apache/flex/core/ListBaseStrandChildren.js'>
     [java] Dependencies calculated for '<http://apacheflexbuild.cloudapp.net:8080/job/flex-asjs/ws/mustella/tests/bin/js-debug/org/apache/flex/html/beads/ListView.js'>
     [java] Dependencies calculated for '<http://apacheflexbuild.cloudapp.net:8080/job/flex-asjs/ws/mustella/tests/bin/js-debug/org/apache/flex/core/IItemRendererParent.js'>
     [java] Dependencies calculated for '<http://apacheflexbuild.cloudapp.net:8080/job/flex-asjs/ws/mustella/tests/bin/js-debug/org/apache/flex/core/IRollOverModel.js'>
     [java] Dependencies calculated for '<http://apacheflexbuild.cloudapp.net:8080/job/flex-asjs/ws/mustella/tests/bin/js-debug/org/apache/flex/core/ISelectableItemRenderer.js'>
     [java] Dependencies calculated for '<http://apacheflexbuild.cloudapp.net:8080/job/flex-asjs/ws/mustella/tests/bin/js-debug/org/apache/flex/core/IItemRenderer.js'>
     [java] Dependencies calculated for '<http://apacheflexbuild.cloudapp.net:8080/job/flex-asjs/ws/mustella/tests/bin/js-debug/org/apache/flex/core/ISelectionModel.js'>
     [java] Dependencies calculated for '<http://apacheflexbuild.cloudapp.net:8080/job/flex-asjs/ws/mustella/tests/bin/js-debug/org/apache/flex/html/beads/IListView.js'>
     [java] Dependencies calculated for '<http://apacheflexbuild.cloudapp.net:8080/job/flex-asjs/ws/mustella/tests/bin/js-debug/org/apache/flex/html/beads/models/ListPresentationModel.js'>
     [java] Dependencies calculated for '<http://apacheflexbuild.cloudapp.net:8080/job/flex-asjs/ws/mustella/tests/bin/js-debug/org/apache/flex/core/IListPresentationModel.js'>
     [java] Dependencies calculated for '<http://apacheflexbuild.cloudapp.net:8080/job/flex-asjs/ws/mustella/tests/bin/js-debug/org/apache/flex/core/IDataProviderItemRendererMapper.js'>
     [java] Dependencies calculated for '<http://apacheflexbuild.cloudapp.net:8080/job/flex-asjs/ws/mustella/tests/bin/js-debug/org/apache/flex/core/IItemRendererClassFactory.js'>
     [java] Dependencies calculated for '<http://apacheflexbuild.cloudapp.net:8080/job/flex-asjs/ws/mustella/tests/bin/js-debug/org/apache/flex/core/IItemRendererProvider.js'>
     [java] Dependencies calculated for '<http://apacheflexbuild.cloudapp.net:8080/job/flex-asjs/ws/mustella/tests/bin/js-debug/org/apache/flex/collections/IArrayList.js'>
     [java] Dependencies calculated for '<http://apacheflexbuild.cloudapp.net:8080/job/flex-asjs/ws/mustella/tests/bin/js-debug/org/apache/flex/html/supportClasses/DataGroup.js'>
     [java] Dependencies calculated for '<http://apacheflexbuild.cloudapp.net:8080/job/flex-asjs/ws/mustella/tests/bin/js-debug/org/apache/flex/events/ItemAddedEvent.js'>
     [java] Dependencies calculated for '<http://apacheflexbuild.cloudapp.net:8080/job/flex-asjs/ws/mustella/tests/bin/js-debug/org/apache/flex/events/CustomEvent.js'>
     [java] Dependencies calculated for '<http://apacheflexbuild.cloudapp.net:8080/job/flex-asjs/ws/mustella/tests/bin/js-debug/org/apache/flex/events/ItemRemovedEvent.js'>
     [java] Dependencies calculated for '<http://apacheflexbuild.cloudapp.net:8080/job/flex-asjs/ws/mustella/tests/bin/js-debug/org/apache/flex/html/supportClasses/DataItemRenderer.js'>
     [java] Dependencies calculated for '<http://apacheflexbuild.cloudapp.net:8080/job/flex-asjs/ws/mustella/tests/bin/js-debug/org/apache/flex/html/beads/controllers/ItemRendererMouseController.js'>
     [java] Dependencies calculated for '<http://apacheflexbuild.cloudapp.net:8080/job/flex-asjs/ws/mustella/tests/bin/js-debug/org/apache/flex/events/ItemClickedEvent.js'>
     [java] Dependencies calculated for '<http://apacheflexbuild.cloudapp.net:8080/job/flex-asjs/ws/mustella/tests/bin/js-debug/org/apache/flex/html/supportClasses/UIItemRendererBase.js'>
     [java] Dependencies calculated for '<http://apacheflexbuild.cloudapp.net:8080/job/flex-asjs/ws/mustella/tests/bin/js-debug/org/apache/flex/html/beads/layouts/VerticalLayout.js'>
     [java] Dependencies calculated for '<http://apacheflexbuild.cloudapp.net:8080/job/flex-asjs/ws/mustella/tests/bin/js-debug/org/apache/flex/html/beads/controllers/ListSingleSelectionMouseController.js'>
     [java] Dependencies calculated for '<http://apacheflexbuild.cloudapp.net:8080/job/flex-asjs/ws/mustella/tests/bin/js-debug/org/apache/flex/core/ItemRendererClassFactory.js'>
     [java] Dependencies calculated for '<http://apacheflexbuild.cloudapp.net:8080/job/flex-asjs/ws/mustella/tests/bin/js-debug/org/apache/flex/core/ClassFactory.js'>
     [java] Dependencies calculated for '<http://apacheflexbuild.cloudapp.net:8080/job/flex-asjs/ws/mustella/tests/bin/js-debug/org/apache/flex/core/IFactory.js'>
     [java] Dependencies calculated for '<http://apacheflexbuild.cloudapp.net:8080/job/flex-asjs/ws/mustella/tests/bin/js-debug/org/apache/flex/core/Strand.js'>
     [java] Dependencies calculated for '<http://apacheflexbuild.cloudapp.net:8080/job/flex-asjs/ws/mustella/tests/bin/js-debug/org/apache/flex/html/supportClasses/StringItemRenderer.js'>
     [java] Dependencies calculated for '<http://apacheflexbuild.cloudapp.net:8080/job/flex-asjs/ws/mustella/tests/bin/js-debug/org/apache/flex/html/beads/ITextItemRenderer.js'>
     [java] Dependencies calculated for '<http://apacheflexbuild.cloudapp.net:8080/job/flex-asjs/ws/mustella/tests/bin/js-debug/org/apache/flex/html/beads/models/DataGridModel.js'>
     [java] Dependencies calculated for '<http://apacheflexbuild.cloudapp.net:8080/job/flex-asjs/ws/mustella/tests/bin/js-debug/org/apache/flex/html/beads/models/ArrayListSelectionModel.js'>
     [java] Dependencies calculated for '<http://apacheflexbuild.cloudapp.net:8080/job/flex-asjs/ws/mustella/tests/bin/js-debug/org/apache/flex/core/IDataGridModel.js'>
     [java] Dependencies calculated for '<http://apacheflexbuild.cloudapp.net:8080/job/flex-asjs/ws/mustella/tests/bin/js-debug/org/apache/flex/html/beads/DataItemRendererFactoryForArrayData.js'>
     [java] Dependencies calculated for '<http://apacheflexbuild.cloudapp.net:8080/job/flex-asjs/ws/mustella/tests/bin/js-debug/org/apache/flex/html/supportClasses/ScrollingViewport.js'>
     [java] Dependencies calculated for '<http://apacheflexbuild.cloudapp.net:8080/job/flex-asjs/ws/mustella/tests/bin/js-debug/org/apache/flex/html/beads/models/ArraySelectionModel.js'>
     [java] Dependencies calculated for '<http://apacheflexbuild.cloudapp.net:8080/job/flex-asjs/ws/mustella/tests/bin/js-debug/org/apache/flex/core/Application.js'>
     [java] Dependencies calculated for '<http://apacheflexbuild.cloudapp.net:8080/job/flex-asjs/ws/mustella/tests/bin/js-debug/org/apache/flex/core/ApplicationBase.js'>
     [java] Dependencies calculated for '<http://apacheflexbuild.cloudapp.net:8080/job/flex-asjs/ws/mustella/tests/bin/js-debug/org/apache/flex/core/IFlexInfo.js'>
     [java] Dependencies calculated for '<http://apacheflexbuild.cloudapp.net:8080/job/flex-asjs/ws/mustella/tests/bin/js-debug/org/apache/flex/utils/Timer.js'>
     [java] Dependencies calculated for '<http://apacheflexbuild.cloudapp.net:8080/job/flex-asjs/ws/mustella/tests/bin/js-debug/org/apache/flex/core/SimpleCSSValuesImpl.js'>
     [java] Dependencies calculated for '<http://apacheflexbuild.cloudapp.net:8080/job/flex-asjs/ws/mustella/tests/bin/js-debug/org/apache/flex/core/IValuesImpl.js'>
     [java] Dependencies calculated for '<http://apacheflexbuild.cloudapp.net:8080/job/flex-asjs/ws/mustella/tests/bin/js-debug/BasicTests.js'>
     [java] Dependencies calculated for '<http://apacheflexbuild.cloudapp.net:8080/job/flex-asjs/ws/mustella/tests/bin/js-debug/org/apache/flex/core/View.js'>
     [java] Dependencies calculated for '<http://apacheflexbuild.cloudapp.net:8080/job/flex-asjs/ws/mustella/tests/bin/js-debug/org/apache/flex/core/ViewBase.js'>
     [java] Dependencies calculated for '<http://apacheflexbuild.cloudapp.net:8080/job/flex-asjs/ws/mustella/tests/bin/js-debug/org/apache/flex/core/ContainerBase.js'>
     [java] Dependencies calculated for '<http://apacheflexbuild.cloudapp.net:8080/job/flex-asjs/ws/mustella/tests/bin/js-debug/org/apache/flex/core/ContainerBaseStrandChildren.js'>
     [java] Dependencies calculated for '<http://apacheflexbuild.cloudapp.net:8080/job/flex-asjs/ws/mustella/tests/bin/js-debug/org/apache/flex/core/IApplicationView.js'>
     [java] Dependencies calculated for '<http://apacheflexbuild.cloudapp.net:8080/job/flex-asjs/ws/mustella/tests/bin/js-debug/org/apache/flex/core/IPopUpHost.js'>
     [java] Dependencies calculated for '<http://apacheflexbuild.cloudapp.net:8080/job/flex-asjs/ws/mustella/tests/bin/js-debug/org/apache/flex/states/State.js'>
     [java] Dependencies calculated for '<http://apacheflexbuild.cloudapp.net:8080/job/flex-asjs/ws/mustella/tests/bin/js-debug/halo/views/ButtonTests.js'>
     [java] Dependencies calculated for '<http://apacheflexbuild.cloudapp.net:8080/job/flex-asjs/ws/mustella/tests/bin/js-debug/shim/VBox.js'>
     [java] Dependencies calculated for '<http://apacheflexbuild.cloudapp.net:8080/job/flex-asjs/ws/mustella/tests/bin/js-debug/org/apache/flex/html/Container.js'>
     [java] Dependencies calculated for '<http://apacheflexbuild.cloudapp.net:8080/job/flex-asjs/ws/mustella/tests/bin/js-debug/org/apache/flex/html/TextButton.js'>
     [java] Dependencies calculated for '<http://apacheflexbuild.cloudapp.net:8080/job/flex-asjs/ws/mustella/tests/bin/js-debug/org/apache/flex/html/Button.js'>
     [java] Dependencies calculated for '<http://apacheflexbuild.cloudapp.net:8080/job/flex-asjs/ws/mustella/tests/bin/js-debug/org/apache/flex/html/Label.js'>
     [java] Dependencies calculated for '<http://apacheflexbuild.cloudapp.net:8080/job/flex-asjs/ws/mustella/tests/bin/js-debug/org/apache/flex/events/MouseEvent.js'>
     [java] Dependencies calculated for '<http://apacheflexbuild.cloudapp.net:8080/job/flex-asjs/ws/mustella/tests/bin/js-debug/org/apache/flex/geom/Point.js'>
     [java] Dependencies calculated for '<http://apacheflexbuild.cloudapp.net:8080/job/flex-asjs/ws/mustella/tests/bin/js-debug/org/apache/flex/utils/PointUtils.js'>
     [java] Dependencies calculated for '<http://apacheflexbuild.cloudapp.net:8080/job/flex-asjs/ws/mustella/tests/bin/js-debug/halo/views/CheckBoxTests.js'>
     [java] Dependencies calculated for '<http://apacheflexbuild.cloudapp.net:8080/job/flex-asjs/ws/mustella/tests/bin/js-debug/org/apache/flex/html/CheckBox.js'>
     [java] Dependencies calculated for '<http://apacheflexbuild.cloudapp.net:8080/job/flex-asjs/ws/mustella/tests/bin/js-debug/org/apache/flex/html/supportClasses/CheckBoxIcon.js'>
     [java] Dependencies calculated for '<http://apacheflexbuild.cloudapp.net:8080/job/flex-asjs/ws/mustella/tests/bin/js-debug/org/apache/flex/utils/MixinManager.js'>
     [java] Dependencies calculated for '<http://apacheflexbuild.cloudapp.net:8080/job/flex-asjs/ws/mustella/tests/bin/js-debug/org/apache/flex/core/CSSFontFaceBead.js'>
     [java] Dependencies calculated for '<http://apacheflexbuild.cloudapp.net:8080/job/flex-asjs/ws/mustella/tests/bin/js-debug/FlexJSContext.js'>
     [java] Dependencies calculated for '<http://apacheflexbuild.cloudapp.net:8080/job/flex-asjs/ws/mustella/tests/bin/js-debug/SendFormattedResultsToLog.js'>
     [java] Dependencies calculated for '<http://apacheflexbuild.cloudapp.net:8080/job/flex-asjs/ws/mustella/tests/bin/js-debug/SetShowRTE.js'>
     [java] Dependencies calculated for '<http://apacheflexbuild.cloudapp.net:8080/job/flex-asjs/ws/mustella/tests/bin/js-debug/ExitWhenDone.js'>
     [java] Dependencies calculated for '<http://apacheflexbuild.cloudapp.net:8080/job/flex-asjs/ws/mustella/tests/bin/js-debug/halo/scripts/CheckBoxTestScript.js'>
     [java] Dependencies calculated for '<http://apacheflexbuild.cloudapp.net:8080/job/flex-asjs/ws/mustella/tests/bin/js-debug/UnitTester.js'>
     [java] Dependencies calculated for '<http://apacheflexbuild.cloudapp.net:8080/job/flex-asjs/ws/mustella/tests/bin/js-debug/TestCase.js'>
     [java] Dependencies calculated for '<http://apacheflexbuild.cloudapp.net:8080/job/flex-asjs/ws/mustella/tests/bin/js-debug/SetProperty.js'>
     [java] Dependencies calculated for '<http://apacheflexbuild.cloudapp.net:8080/job/flex-asjs/ws/mustella/tests/bin/js-debug/AssertPropertyValue.js'>
     [java] Dependencies calculated for '<http://apacheflexbuild.cloudapp.net:8080/job/flex-asjs/ws/mustella/tests/bin/js-debug/DispatchMouseEvent.js'>
     [java] Dependencies calculated for '<http://apacheflexbuild.cloudapp.net:8080/job/flex-asjs/ws/mustella/tests/bin/js-debug/DispatchMouseClickEvent.js'>
     [java] Dependencies calculated for '<http://apacheflexbuild.cloudapp.net:8080/job/flex-asjs/ws/mustella/tests/bin/js-debug/halo/scripts/ButtonTestScript.js'>
     [java] The project 'BasicTestsApp' has been successfully compiled and optimized.
     [java] Picked up JAVA_TOOL_OPTIONS: -Dfile.encoding=UTF8

basictests-compile-java:
   [delete] Deleting directory <http://apacheflexbuild.cloudapp.net:8080/job/flex-asjs/ws/mustella/java/bin>
    [mkdir] Created dir: <http://apacheflexbuild.cloudapp.net:8080/job/flex-asjs/ws/mustella/java/bin>
    [javac] <http://apacheflexbuild.cloudapp.net:8080/job/flex-asjs/ws/build.xml>:1217:
warning: 'includeantruntime' was not set, defaulting to build.sysclasspath=last; set to false
for repeatable builds
    [javac] Compiling 11 source files to <http://apacheflexbuild.cloudapp.net:8080/job/flex-asjs/ws/mustella/java/bin>

basictests-run-js:
     [echo] url=file://<http://apacheflexbuild.cloudapp.net:8080/job/flex-asjs/ws/mustella/tests/basicTests/bin/js-debug/index.html>
     [echo] script=<http://apacheflexbuild.cloudapp.net:8080/job/flex-asjs/ws/mustella/tests/basicTests/halo/scripts/ButtonTestScript.mxml>
     [echo] script=<http://apacheflexbuild.cloudapp.net:8080/job/flex-asjs/ws/mustella/tests/basicTests/halo/scripts/CheckBoxTestScript.mxml>
     [java] file://<http://apacheflexbuild.cloudapp.net:8080/job/flex-asjs/ws/mustella/tests/bin/js-debug/index.html>
     [java] org.openqa.selenium.firefox.NotConnectedException: Unable to connect to host 127.0.0.1
on port 7055 after 45000 ms. Firefox console output:
     [java] -global:{972ce4c6-7e08-4474-a285-3208198ce6fd} visible
     [java] 1467009246201	DeferredSave.extensions.json	DEBUG	Save changes
     [java] 1467009246201	addons.xpi	DEBUG	Updating XPIState for {"id":"fxdriver@googlecode.com","syncGUID":"2h88nddAwy2-","location":"app-profile","version":"2.53.0","type":"extension","internalName":null,"updateURL":null,"updateKey":null,"optionsURL":null,"optionsType":null,"aboutURL":null,"iconURL":null,"icon64URL":null,"defaultLocale":{"name":"Firefox
WebDriver","description":"WebDriver implementation for Firefox","creator":"Simon Stewart","homepageURL":null},"visible":true,"active":true,"userDisabled":false,"appDisabled":false,"descriptor":"C:\\Users\\APACHE~1\\AppData\\Local\\Temp\\2\\anonymous4748222921659697062webdriver-profile\\extensions\\fxdriver@googlecode.com","installDate":1467009202227,"updateDate":1467009202227,"applyBackgroundUpdates":1,"bootstrap":false,"size":3249525,"sourceURI":null,"releaseNotesURI":null,"softDisabled":false,"foreignInstall":true,"hasBinaryComponents":true,"strictCompatibility":false,"locales":[],"targetApplications":[{"id":"{ec8030f7-c20a-464f-9b0e-13a3a9e97384}","minVersion":"3.0","maxVersion":"47.0"}],"targetPlatforms":[{"os":"Darwin","abi":null},{"os":"SunOS","abi":null},{"os":"FreeBSD","abi":null},{"os":"OpenBSD","abi":null},{"os":"WINNT","abi":null},{"os":"Linux","abi":null}],"multiprocessCompatible":false,"signedState":0}
     [java] 1467009246202	addons.xpi	DEBUG	getModTime: Recursive scan of fxdriver@googlecode.com
     [java] 1467009246212	addons.xpi	DEBUG	Updating XPIState for {"id":"{972ce4c6-7e08-4474-a285-3208198ce6fd}","syncGUID":"1aGPtjuXxL-8","location":"app-global","version":"43.0.1","type":"theme","internalName":"classic/1.0","updateURL":null,"updateKey":null,"optionsURL":null,"optionsType":null,"aboutURL":null,"iconURL":null,"icon64URL":null,"defaultLocale":{"name":"Default","description":"The
default theme.","creator":"Mozilla","homepageURL":null,"contributors":["Mozilla Contributors"]},"visible":true,"active":true,"userDisabled":false,"appDisabled":false,"descriptor":"C:\\Program
Files (x86)\\Mozilla Firefox\\browser\\extensions\\{972ce4c6-7e08-4474-a285-3208198ce6fd}","installDate":1451367994962,"updateDate":1451367994962,"applyBackgroundUpdates":1,"skinnable":true,"size":24172,"sourceURI":null,"releaseNotesURI":null,"softDisabled":false,"foreignInstall":false,"hasBinaryComponents":false,"strictCompatibility":true,"locales":[],"targetApplications":[{"id":"{ec8030f7-c20a-464f-9b0e-13a3a9e97384}","minVersion":"43.0.1","maxVersion":"43.0.1"}],"targetPlatforms":[]}
     [java] 1467009246219	addons.xpi	DEBUG	getModTime: Recursive scan of {972ce4c6-7e08-4474-a285-3208198ce6fd}
     [java] 1467009246221	DeferredSave.extensions.json	DEBUG	Save changes
     [java] 1467009246221	addons.xpi	DEBUG	Updating database with changes to installed add-ons
     [java] 1467009246226	addons.xpi-utils	DEBUG	Updating add-on states
     [java] 1467009246227	addons.xpi-utils	DEBUG	Writing add-ons list
     [java] 1467009246524	addons.manager	DEBUG	Registering shutdown blocker for XPIProvider
     [java] 1467009246525	addons.manager	DEBUG	Provider finished startup: XPIProvider
     [java] 1467009246530	addons.manager	DEBUG	Starting provider: LightweightThemeManager
     [java] 1467009246531	addons.manager	DEBUG	Registering shutdown blocker for LightweightThemeManager
     [java] 1467009246531	addons.manager	DEBUG	Provider finished startup: LightweightThemeManager
     [java] 1467009246532	addons.manager	DEBUG	Starting provider: GMPProvider
     [java] 1467009246587	addons.manager	DEBUG	Registering shutdown blocker for GMPProvider
     [java] 1467009246588	addons.manager	DEBUG	Provider finished startup: GMPProvider
     [java] 1467009246588	addons.manager	DEBUG	Starting provider: PluginProvider
     [java] 1467009246588	addons.manager	DEBUG	Registering shutdown blocker for PluginProvider
     [java] 1467009246588	addons.manager	DEBUG	Provider finished startup: PluginProvider
     [java] 1467009246589	addons.manager	DEBUG	Completed startup sequence
     [java] 1467009256236	addons.manager	DEBUG	Starting provider: <unnamed-provider>
     [java] 1467009256236	addons.manager	DEBUG	Registering shutdown blocker for <unnamed-provider>
     [java] 1467009256237	addons.manager	DEBUG	Provider finished startup: <unnamed-provider>
     [java] 
     [java] 	at org.openqa.selenium.firefox.internal.NewProfileExtensionConnection.start(NewProfileExtensionConnection.java:112)
     [java] 	at org.openqa.selenium.firefox.FirefoxDriver.startClient(FirefoxDriver.java:271)
     [java] 	at org.openqa.selenium.remote.RemoteWebDriver.<init>(RemoteWebDriver.java:119)
     [java] 	at org.openqa.selenium.firefox.FirefoxDriver.<init>(FirefoxDriver.java:218)
     [java] 	at org.openqa.selenium.firefox.FirefoxDriver.<init>(FirefoxDriver.java:211)
     [java] 	at org.openqa.selenium.firefox.FirefoxDriver.<init>(FirefoxDriver.java:207)
     [java] 	at org.openqa.selenium.firefox.FirefoxDriver.<init>(FirefoxDriver.java:120)
     [java] 	at marmotinni.MarmotinniRunner.main(Unknown Source)
     [java] Exception in thread "main" org.openqa.selenium.WebDriverException: Failed to connect
to binary FirefoxBinary(C:\Program Files (x86)\Mozilla Firefox\firefox.exe) on port 7055;
process output follows: 
     [java] 6201	DeferredSave.extensions.json	DEBUG	Save changes
     [java] 1467009246201	addons.xpi	DEBUG	Updating XPIState for {"id":"fxdriver@googlecode.com","syncGUID":"2h88nddAwy2-","location":"app-profile","version":"2.53.0","type":"extension","internalName":null,"updateURL":null,"updateKey":null,"optionsURL":null,"optionsType":null,"aboutURL":null,"iconURL":null,"icon64URL":null,"defaultLocale":{"name":"Firefox
WebDriver","description":"WebDriver implementation for Firefox","creator":"Simon Stewart","homepageURL":null},"visible":true,"active":true,"userDisabled":false,"appDisabled":false,"descriptor":"C:\\Users\\APACHE~1\\AppData\\Local\\Temp\\2\\anonymous4748222921659697062webdriver-profile\\extensions\\fxdriver@googlecode.com","installDate":1467009202227,"updateDate":1467009202227,"applyBackgroundUpdates":1,"bootstrap":false,"size":3249525,"sourceURI":null,"releaseNotesURI":null,"softDisabled":false,"foreignInstall":true,"hasBinaryComponents":true,"strictCompatibility":false,"locales":[],"targetApplications":[{"id":"{ec8030f7-c20a-464f-9b0e-13a3a9e97384}","minVersion":"3.0","maxVersion":"47.0"}],"targetPlatforms":[{"os":"Darwin","abi":null},{"os":"SunOS","abi":null},{"os":"FreeBSD","abi":null},{"os":"OpenBSD","abi":null},{"os":"WINNT","abi":null},{"os":"Linux","abi":null}],"multiprocessCompatible":false,"signedState":0}
     [java] 1467009246202	addons.xpi	DEBUG	getModTime: Recursive scan of fxdriver@googlecode.com
     [java] 1467009246212	addons.xpi	DEBUG	Updating XPIState for {"id":"{972ce4c6-7e08-4474-a285-3208198ce6fd}","syncGUID":"1aGPtjuXxL-8","location":"app-global","version":"43.0.1","type":"theme","internalName":"classic/1.0","updateURL":null,"updateKey":null,"optionsURL":null,"optionsType":null,"aboutURL":null,"iconURL":null,"icon64URL":null,"defaultLocale":{"name":"Default","description":"The
default theme.","creator":"Mozilla","homepageURL":null,"contributors":["Mozilla Contributors"]},"visible":true,"active":true,"userDisabled":false,"appDisabled":false,"descriptor":"C:\\Program
Files (x86)\\Mozilla Firefox\\browser\\extensions\\{972ce4c6-7e08-4474-a285-3208198ce6fd}","installDate":1451367994962,"updateDate":1451367994962,"applyBackgroundUpdates":1,"skinnable":true,"size":24172,"sourceURI":null,"releaseNotesURI":null,"softDisabled":false,"foreignInstall":false,"hasBinaryComponents":false,"strictCompatibility":true,"locales":[],"targetApplications":[{"id":"{ec8030f7-c20a-464f-9b0e-13a3a9e97384}","minVersion":"43.0.1","maxVersion":"43.0.1"}],"targetPlatforms":[]}
     [java] 1467009246219	addons.xpi	DEBUG	getModTime: Recursive scan of {972ce4c6-7e08-4474-a285-3208198ce6fd}
     [java] 1467009246221	DeferredSave.extensions.json	DEBUG	Save changes
     [java] 1467009246221	addons.xpi	DEBUG	Updating database with changes to installed add-ons
     [java] 1467009246226	addons.xpi-utils	DEBUG	Updating add-on states
     [java] 1467009246227	addons.xpi-utils	DEBUG	Writing add-ons list
     [java] 1467009246524	addons.manager	DEBUG	Registering shutdown blocker for XPIProvider
     [java] 1467009246525	addons.manager	DEBUG	Provider finished startup: XPIProvider
     [java] 1467009246530	addons.manager	DEBUG	Starting provider: LightweightThemeManager
     [java] 1467009246531	addons.manager	DEBUG	Registering shutdown blocker for LightweightThemeManager
     [java] 1467009246531	addons.manager	DEBUG	Provider finished startup: LightweightThemeManager
     [java] 1467009246532	addons.manager	DEBUG	Starting provider: GMPProvider
     [java] 1467009246587	addons.manager	DEBUG	Registering shutdown blocker for GMPProvider
     [java] 1467009246588	addons.manager	DEBUG	Provider finished startup: GMPProvider
     [java] 1467009246588	addons.manager	DEBUG	Starting provider: PluginProvider
     [java] 1467009246588	addons.manager	DEBUG	Registering shutdown blocker for PluginProvider
     [java] 1467009246588	addons.manager	DEBUG	Provider finished startup: PluginProvider
     [java] 1467009246589	addons.manager	DEBUG	Completed startup sequence
     [java] 1467009256236	addons.manager	DEBUG	Starting provider: <unnamed-provider>
     [java] 1467009256236	addons.manager	DEBUG	Registering shutdown blocker for <unnamed-provider>
     [java] 1467009256237	addons.manager	DEBUG	Provider finished startup: <unnamed-provider>
     [java] 1467009259309	DeferredSave.extensions.json	DEBUG	Starting write
     [java] 
     [java] Build info: version: '2.53.0', revision: '35ae25b', time: '2016-03-15 16:57:40'
     [java] System info: host: 'apacheflexbuild', ip: '100.68.242.38', os.name: 'Windows Server
2008 R2', os.arch: 'amd64', os.version: '6.1', java.version: '1.7.0_55'
     [java] Driver info: driver.version: FirefoxDriver
     [java] 	at org.openqa.selenium.firefox.internal.NewProfileExtensionConnection.start(NewProfileExtensionConnection.java:124)
     [java] 	at org.openqa.selenium.firefox.FirefoxDriver.startClient(FirefoxDriver.java:271)
     [java] 	at org.openqa.selenium.remote.RemoteWebDriver.<init>(RemoteWebDriver.java:119)
     [java] 	at org.openqa.selenium.firefox.FirefoxDriver.<init>(FirefoxDriver.java:218)
     [java] 	at org.openqa.selenium.firefox.FirefoxDriver.<init>(FirefoxDriver.java:211)
     [java] 	at org.openqa.selenium.firefox.FirefoxDriver.<init>(FirefoxDriver.java:207)
     [java] 	at org.openqa.selenium.firefox.FirefoxDriver.<init>(FirefoxDriver.java:120)
     [java] 	at marmotinni.MarmotinniRunner.main(Unknown Source)
     [java] Caused by: org.openqa.selenium.firefox.NotConnectedException: Unable to connect
to host 127.0.0.1 on port 7055 after 45000 ms. Firefox console output:
     [java] -global:{972ce4c6-7e08-4474-a285-3208198ce6fd} visible
     [java] 1467009246201	DeferredSave.extensions.json	DEBUG	Save changes
     [java] 1467009246201	addons.xpi	DEBUG	Updating XPIState for {"id":"fxdriver@googlecode.com","syncGUID":"2h88nddAwy2-","location":"app-profile","version":"2.53.0","type":"extension","internalName":null,"updateURL":null,"updateKey":null,"optionsURL":null,"optionsType":null,"aboutURL":null,"iconURL":null,"icon64URL":null,"defaultLocale":{"name":"Firefox
WebDriver","description":"WebDriver implementation for Firefox","creator":"Simon Stewart","homepageURL":null},"visible":true,"active":true,"userDisabled":false,"appDisabled":false,"descriptor":"C:\\Users\\APACHE~1\\AppData\\Local\\Temp\\2\\anonymous4748222921659697062webdriver-profile\\extensions\\fxdriver@googlecode.com","installDate":1467009202227,"updateDate":1467009202227,"applyBackgroundUpdates":1,"bootstrap":false,"size":3249525,"sourceURI":null,"releaseNotesURI":null,"softDisabled":false,"foreignInstall":true,"hasBinaryComponents":true,"strictCompatibility":false,"locales":[],"targetApplications":[{"id":"{ec8030f7-c20a-464f-9b0e-13a3a9e97384}","minVersion":"3.0","maxVersion":"47.0"}],"targetPlatforms":[{"os":"Darwin","abi":null},{"os":"SunOS","abi":null},{"os":"FreeBSD","abi":null},{"os":"OpenBSD","abi":null},{"os":"WINNT","abi":null},{"os":"Linux","abi":null}],"multiprocessCompatible":false,"signedState":0}
     [java] 1467009246202	addons.xpi	DEBUG	getModTime: Recursive scan of fxdriver@googlecode.com
     [java] 1467009246212	addons.xpi	DEBUG	Updating XPIState for {"id":"{972ce4c6-7e08-4474-a285-3208198ce6fd}","syncGUID":"1aGPtjuXxL-8","location":"app-global","version":"43.0.1","type":"theme","internalName":"classic/1.0","updateURL":null,"updateKey":null,"optionsURL":null,"optionsType":null,"aboutURL":null,"iconURL":null,"icon64URL":null,"defaultLocale":{"name":"Default","description":"The
default theme.","creator":"Mozilla","homepageURL":null,"contributors":["Mozilla Contributors"]},"visible":true,"active":true,"userDisabled":false,"appDisabled":false,"descriptor":"C:\\Program
Files (x86)\\Mozilla Firefox\\browser\\extensions\\{972ce4c6-7e08-4474-a285-3208198ce6fd}","installDate":1451367994962,"updateDate":1451367994962,"applyBackgroundUpdates":1,"skinnable":true,"size":24172,"sourceURI":null,"releaseNotesURI":null,"softDisabled":false,"foreignInstall":false,"hasBinaryComponents":false,"strictCompatibility":true,"locales":[],"targetApplications":[{"id":"{ec8030f7-c20a-464f-9b0e-13a3a9e97384}","minVersion":"43.0.1","maxVersion":"43.0.1"}],"targetPlatforms":[]}
     [java] 1467009246219	addons.xpi	DEBUG	getModTime: Recursive scan of {972ce4c6-7e08-4474-a285-3208198ce6fd}
     [java] 1467009246221	DeferredSave.extensions.json	DEBUG	Save changes
     [java] 1467009246221	addons.xpi	DEBUG	Updating database with changes to installed add-ons
     [java] 1467009246226	addons.xpi-utils	DEBUG	Updating add-on states
     [java] 1467009246227	addons.xpi-utils	DEBUG	Writing add-ons list
     [java] 1467009246524	addons.manager	DEBUG	Registering shutdown blocker for XPIProvider
     [java] 1467009246525	addons.manager	DEBUG	Provider finished startup: XPIProvider
     [java] 1467009246530	addons.manager	DEBUG	Starting provider: LightweightThemeManager
     [java] 1467009246531	addons.manager	DEBUG	Registering shutdown blocker for LightweightThemeManager
     [java] 1467009246531	addons.manager	DEBUG	Provider finished startup: LightweightThemeManager
     [java] 1467009246532	addons.manager	DEBUG	Starting provider: GMPProvider
     [java] 1467009246587	addons.manager	DEBUG	Registering shutdown blocker for GMPProvider
     [java] 1467009246588	addons.manager	DEBUG	Provider finished startup: GMPProvider
     [java] 1467009246588	addons.manager	DEBUG	Starting provider: PluginProvider
     [java] 1467009246588	addons.manager	DEBUG	Registering shutdown blocker for PluginProvider
     [java] 1467009246588	addons.manager	DEBUG	Provider finished startup: PluginProvider
     [java] 1467009246589	addons.manager	DEBUG	Completed startup sequence
     [java] 1467009256236	addons.manager	DEBUG	Starting provider: <unnamed-provider>
     [java] 1467009256236	addons.manager	DEBUG	Registering shutdown blocker for <unnamed-provider>
     [java] 1467009256237	addons.manager	DEBUG	Provider finished startup: <unnamed-provider>
     [java] 
     [java] 	at org.openqa.selenium.firefox.internal.NewProfileExtensionConnection.start(NewProfileExtensionConnection.java:112)
     [java] 	... 7 more
     [java] Picked up JAVA_TOOL_OPTIONS: -Dfile.encoding=UTF8

BUILD FAILED
<http://apacheflexbuild.cloudapp.net:8080/job/flex-asjs/ws/build.xml>:1111: Java returned:
1

Total time: 32 minutes 25 seconds
Picked up JAVA_TOOL_OPTIONS: -Dfile.encoding=UTF8
Build step 'Invoke Ant' marked build as failure
Skipped archiving because build is not successful


Mime
View raw message