flex-commits mailing list archives

Site index · List index
Message view « Date » · « Thread »
Top « Date » · « Thread »
From flex.ci.bui...@gmail.com
Subject Build failed in Jenkins: flex-falcon #958
Date Wed, 27 Apr 2016 06:48:29 GMT
See <http://apacheflexbuild.cloudapp.net:8080/job/flex-falcon/958/>

------------------------------------------
[...truncated 5068 lines...]
    [junit] 	at org.apache.tools.ant.Project.executeTargets(Project.java:1248)
    [junit] 	at org.apache.tools.ant.Main.runBuild(Main.java:851)
    [junit] 	at org.apache.tools.ant.Main.startAnt(Main.java:235)
    [junit] 	at org.apache.tools.ant.launch.Launcher.run(Launcher.java:280)
    [junit] 	at org.apache.tools.ant.launch.Launcher.main(Launcher.java:109)
Unable to obtain resource from <http://apacheflexbuild.cloudapp.net:8080/job/flex-falcon/ws/compiler-build-tools/target/classes/org/apache/flex/utils/EnvProperties.class>:
java.util.zip.ZipException: error in opening zip file
    [junit] Unable to obtain resource from <http://apacheflexbuild.cloudapp.net:8080/job/flex-falcon/ws/compiler-build-tools/target/classes/org/apache/flex/utils/EnvProperties.class>:

    [junit] java.util.zip.ZipException: error in opening zip file
    [junit] 	at java.util.zip.ZipFile.open(Native Method)
    [junit] 	at java.util.zip.ZipFile.<init>(ZipFile.java:215)
    [junit] 	at java.util.zip.ZipFile.<init>(ZipFile.java:145)
    [junit] 	at java.util.jar.JarFile.<init>(JarFile.java:153)
    [junit] 	at java.util.jar.JarFile.<init>(JarFile.java:117)
    [junit] 	at org.apache.tools.ant.AntClassLoader.getResourceURL(AntClassLoader.java:1006)
    [junit] 	at org.apache.tools.ant.AntClassLoader$ResourceEnumeration.findNextResource(AntClassLoader.java:149)
    [junit] 	at org.apache.tools.ant.AntClassLoader$ResourceEnumeration.<init>(AntClassLoader.java:110)
    [junit] 	at org.apache.tools.ant.AntClassLoader.findResources(AntClassLoader.java:953)
    [junit] 	at org.apache.tools.ant.AntClassLoader.getNamedResources(AntClassLoader.java:922)
    [junit] 	at org.apache.tools.ant.loader.AntClassLoader5.getResources(AntClassLoader5.java:58)
    [junit] 	at org.apache.tools.ant.taskdefs.optional.junit.JUnitTask.checkForkedPath(JUnitTask.java:1182)
    [junit] 	at org.apache.tools.ant.taskdefs.optional.junit.JUnitTask.executeAsForked(JUnitTask.java:1062)
    [junit] 	at org.apache.tools.ant.taskdefs.optional.junit.JUnitTask.execute(JUnitTask.java:921)
    [junit] 	at org.apache.tools.ant.taskdefs.optional.junit.JUnitTask.execute(JUnitTask.java:822)
    [junit] 	at org.apache.tools.ant.UnknownElement.execute(UnknownElement.java:292)
    [junit] 	at sun.reflect.GeneratedMethodAccessor53.invoke(Unknown Source)
    [junit] 	at sun.reflect.DelegatingMethodAccessorImpl.invoke(DelegatingMethodAccessorImpl.java:43)
    [junit] 	at java.lang.reflect.Method.invoke(Method.java:606)
    [junit] 	at org.apache.tools.ant.dispatch.DispatchUtils.execute(DispatchUtils.java:106)
    [junit] 	at org.apache.tools.ant.Task.perform(Task.java:348)
    [junit] 	at org.apache.tools.ant.Target.execute(Target.java:435)
    [junit] 	at org.apache.tools.ant.Target.performTasks(Target.java:456)
    [junit] 	at org.apache.tools.ant.Project.executeSortedTargets(Project.java:1393)
    [junit] 	at org.apache.tools.ant.helper.SingleCheckExecutor.executeTargets(SingleCheckExecutor.java:38)
    [junit] 	at org.apache.tools.ant.Project.executeTargets(Project.java:1248)
    [junit] 	at org.apache.tools.ant.taskdefs.Ant.execute(Ant.java:440)
    [junit] 	at org.apache.tools.ant.UnknownElement.execute(UnknownElement.java:292)
    [junit] 	at sun.reflect.GeneratedMethodAccessor53.invoke(Unknown Source)
    [junit] 	at sun.reflect.DelegatingMethodAccessorImpl.invoke(DelegatingMethodAccessorImpl.java:43)
    [junit] 	at java.lang.reflect.Method.invoke(Method.java:606)
    [junit] 	at org.apache.tools.ant.dispatch.DispatchUtils.execute(DispatchUtils.java:106)
    [junit] 	at org.apache.tools.ant.Task.perform(Task.java:348)
    [junit] 	at org.apache.tools.ant.Target.execute(Target.java:435)
    [junit] 	at org.apache.tools.ant.Target.performTasks(Target.java:456)
    [junit] 	at org.apache.tools.ant.Project.executeSortedTargets(Project.java:1393)
    [junit] 	at org.apache.tools.ant.Project.executeTarget(Project.java:1364)
    [junit] 	at org.apache.tools.ant.helper.DefaultExecutor.executeTargets(DefaultExecutor.java:41)
    [junit] 	at org.apache.tools.ant.Project.executeTargets(Project.java:1248)
    [junit] 	at org.apache.tools.ant.Main.runBuild(Main.java:851)
    [junit] 	at org.apache.tools.ant.Main.startAnt(Main.java:235)
    [junit] 	at org.apache.tools.ant.launch.Launcher.run(Launcher.java:280)
    [junit] 	at org.apache.tools.ant.launch.Launcher.main(Launcher.java:109)
Unable to obtain resource from <http://apacheflexbuild.cloudapp.net:8080/job/flex-falcon/ws/compiler-build-tools/target/classes/org/apache/flex/utils/FilenameNormalization.class>:
java.util.zip.ZipException: error in opening zip file
    [junit] Unable to obtain resource from <http://apacheflexbuild.cloudapp.net:8080/job/flex-falcon/ws/compiler-build-tools/target/classes/org/apache/flex/utils/FilenameNormalization.class>:

    [junit] java.util.zip.ZipException: error in opening zip file
    [junit] 	at java.util.zip.ZipFile.open(Native Method)
    [junit] 	at java.util.zip.ZipFile.<init>(ZipFile.java:215)
    [junit] 	at java.util.zip.ZipFile.<init>(ZipFile.java:145)
    [junit] 	at java.util.jar.JarFile.<init>(JarFile.java:153)
    [junit] 	at java.util.jar.JarFile.<init>(JarFile.java:117)
    [junit] 	at org.apache.tools.ant.AntClassLoader.getResourceURL(AntClassLoader.java:1006)
    [junit] 	at org.apache.tools.ant.AntClassLoader$ResourceEnumeration.findNextResource(AntClassLoader.java:149)
    [junit] 	at org.apache.tools.ant.AntClassLoader$ResourceEnumeration.<init>(AntClassLoader.java:110)
    [junit] 	at org.apache.tools.ant.AntClassLoader.findResources(AntClassLoader.java:953)
    [junit] 	at org.apache.tools.ant.AntClassLoader.getNamedResources(AntClassLoader.java:922)
    [junit] 	at org.apache.tools.ant.loader.AntClassLoader5.getResources(AntClassLoader5.java:58)
    [junit] 	at org.apache.tools.ant.taskdefs.optional.junit.JUnitTask.checkForkedPath(JUnitTask.java:1182)
    [junit] 	at org.apache.tools.ant.taskdefs.optional.junit.JUnitTask.executeAsForked(JUnitTask.java:1062)
    [junit] 	at org.apache.tools.ant.taskdefs.optional.junit.JUnitTask.execute(JUnitTask.java:921)
    [junit] 	at org.apache.tools.ant.taskdefs.optional.junit.JUnitTask.execute(JUnitTask.java:822)
    [junit] 	at org.apache.tools.ant.UnknownElement.execute(UnknownElement.java:292)
    [junit] 	at sun.reflect.GeneratedMethodAccessor53.invoke(Unknown Source)
    [junit] 	at sun.reflect.DelegatingMethodAccessorImpl.invoke(DelegatingMethodAccessorImpl.java:43)
    [junit] 	at java.lang.reflect.Method.invoke(Method.java:606)
    [junit] 	at org.apache.tools.ant.dispatch.DispatchUtils.execute(DispatchUtils.java:106)
    [junit] 	at org.apache.tools.ant.Task.perform(Task.java:348)
    [junit] 	at org.apache.tools.ant.Target.execute(Target.java:435)
    [junit] 	at org.apache.tools.ant.Target.performTasks(Target.java:456)
    [junit] 	at org.apache.tools.ant.Project.executeSortedTargets(Project.java:1393)
    [junit] 	at org.apache.tools.ant.helper.SingleCheckExecutor.executeTargets(SingleCheckExecutor.java:38)
    [junit] 	at org.apache.tools.ant.Project.executeTargets(Project.java:1248)
    [junit] 	at org.apache.tools.ant.taskdefs.Ant.execute(Ant.java:440)
    [junit] 	at org.apache.tools.ant.UnknownElement.execute(UnknownElement.java:292)
    [junit] 	at sun.reflect.GeneratedMethodAccessor53.invoke(Unknown Source)
    [junit] 	at sun.reflect.DelegatingMethodAccessorImpl.invoke(DelegatingMethodAccessorImpl.java:43)
    [junit] 	at java.lang.reflect.Method.invoke(Method.java:606)
    [junit] 	at org.apache.tools.ant.dispatch.DispatchUtils.execute(DispatchUtils.java:106)
    [junit] 	at org.apache.tools.ant.Task.perform(Task.java:348)
    [junit] 	at org.apache.tools.ant.Target.execute(Target.java:435)
    [junit] 	at org.apache.tools.ant.Target.performTasks(Target.java:456)
    [junit] 	at org.apache.tools.ant.Project.executeSortedTargets(Project.java:1393)
    [junit] 	at org.apache.tools.ant.Project.executeTarget(Project.java:1364)
    [junit] 	at org.apache.tools.ant.helper.DefaultExecutor.executeTargets(DefaultExecutor.java:41)
    [junit] 	at org.apache.tools.ant.Project.executeTargets(Project.java:1248)
    [junit] 	at org.apache.tools.ant.Main.runBuild(Main.java:851)
    [junit] 	at org.apache.tools.ant.Main.startAnt(Main.java:235)
    [junit] 	at org.apache.tools.ant.launch.Launcher.run(Launcher.java:280)
    [junit] 	at org.apache.tools.ant.launch.Launcher.main(Launcher.java:109)
Unable to obtain resource from <http://apacheflexbuild.cloudapp.net:8080/job/flex-falcon/ws/compiler-build-tools/target/classes/org/apache/flex/utils/ITestAdapter.class>:
java.util.zip.ZipException: error in opening zip file
    [junit] Unable to obtain resource from <http://apacheflexbuild.cloudapp.net:8080/job/flex-falcon/ws/compiler-build-tools/target/classes/org/apache/flex/utils/ITestAdapter.class>:

    [junit] java.util.zip.ZipException: error in opening zip file
    [junit] 	at java.util.zip.ZipFile.open(Native Method)
    [junit] 	at java.util.zip.ZipFile.<init>(ZipFile.java:215)
    [junit] 	at java.util.zip.ZipFile.<init>(ZipFile.java:145)
    [junit] 	at java.util.jar.JarFile.<init>(JarFile.java:153)
    [junit] 	at java.util.jar.JarFile.<init>(JarFile.java:117)
    [junit] 	at org.apache.tools.ant.AntClassLoader.getResourceURL(AntClassLoader.java:1006)
    [junit] 	at org.apache.tools.ant.AntClassLoader$ResourceEnumeration.findNextResource(AntClassLoader.java:149)
    [junit] 	at org.apache.tools.ant.AntClassLoader$ResourceEnumeration.<init>(AntClassLoader.java:110)
    [junit] 	at org.apache.tools.ant.AntClassLoader.findResources(AntClassLoader.java:953)
    [junit] 	at org.apache.tools.ant.AntClassLoader.getNamedResources(AntClassLoader.java:922)
    [junit] 	at org.apache.tools.ant.loader.AntClassLoader5.getResources(AntClassLoader5.java:58)
    [junit] 	at org.apache.tools.ant.taskdefs.optional.junit.JUnitTask.checkForkedPath(JUnitTask.java:1182)
    [junit] 	at org.apache.tools.ant.taskdefs.optional.junit.JUnitTask.executeAsForked(JUnitTask.java:1062)
    [junit] 	at org.apache.tools.ant.taskdefs.optional.junit.JUnitTask.execute(JUnitTask.java:921)
    [junit] 	at org.apache.tools.ant.taskdefs.optional.junit.JUnitTask.execute(JUnitTask.java:822)
    [junit] 	at org.apache.tools.ant.UnknownElement.execute(UnknownElement.java:292)
    [junit] 	at sun.reflect.GeneratedMethodAccessor53.invoke(Unknown Source)
    [junit] 	at sun.reflect.DelegatingMethodAccessorImpl.invoke(DelegatingMethodAccessorImpl.java:43)
    [junit] 	at java.lang.reflect.Method.invoke(Method.java:606)
    [junit] 	at org.apache.tools.ant.dispatch.DispatchUtils.execute(DispatchUtils.java:106)
    [junit] 	at org.apache.tools.ant.Task.perform(Task.java:348)
    [junit] 	at org.apache.tools.ant.Target.execute(Target.java:435)
    [junit] 	at org.apache.tools.ant.Target.performTasks(Target.java:456)
    [junit] 	at org.apache.tools.ant.Project.executeSortedTargets(Project.java:1393)
    [junit] 	at org.apache.tools.ant.helper.SingleCheckExecutor.executeTargets(SingleCheckExecutor.java:38)
    [junit] 	at org.apache.tools.ant.Project.executeTargets(Project.java:1248)
    [junit] 	at org.apache.tools.ant.taskdefs.Ant.execute(Ant.java:440)
    [junit] 	at org.apache.tools.ant.UnknownElement.execute(UnknownElement.java:292)
    [junit] 	at sun.reflect.GeneratedMethodAccessor53.invoke(Unknown Source)
    [junit] 	at sun.reflect.DelegatingMethodAccessorImpl.invoke(DelegatingMethodAccessorImpl.java:43)
    [junit] 	at java.lang.reflect.Method.invoke(Method.java:606)
    [junit] 	at org.apache.tools.ant.dispatch.DispatchUtils.execute(DispatchUtils.java:106)
    [junit] 	at org.apache.tools.ant.Task.perform(Task.java:348)
    [junit] 	at org.apache.tools.ant.Target.execute(Target.java:435)
    [junit] 	at org.apache.tools.ant.Target.performTasks(Target.java:456)
    [junit] 	at org.apache.tools.ant.Project.executeSortedTargets(Project.java:1393)
    [junit] 	at org.apache.tools.ant.Project.executeTarget(Project.java:1364)
    [junit] 	at org.apache.tools.ant.helper.DefaultExecutor.executeTargets(DefaultExecutor.java:41)
    [junit] 	at org.apache.tools.ant.Project.executeTargets(Project.java:1248)
    [junit] 	at org.apache.tools.ant.Main.runBuild(Main.java:851)
    [junit] 	at org.apache.tools.ant.Main.startAnt(Main.java:235)
    [junit] 	at org.apache.tools.ant.launch.Launcher.run(Launcher.java:280)
    [junit] 	at org.apache.tools.ant.launch.Launcher.main(Launcher.java:109)
Unable to obtain resource from <http://apacheflexbuild.cloudapp.net:8080/job/flex-falcon/ws/compiler-build-tools/target/classes/org/apache/flex/utils/MavenTestAdapter.class>:
java.util.zip.ZipException: error in opening zip file
    [junit] Unable to obtain resource from <http://apacheflexbuild.cloudapp.net:8080/job/flex-falcon/ws/compiler-build-tools/target/classes/org/apache/flex/utils/MavenTestAdapter.class>:

    [junit] java.util.zip.ZipException: error in opening zip file
    [junit] 	at java.util.zip.ZipFile.open(Native Method)
    [junit] 	at java.util.zip.ZipFile.<init>(ZipFile.java:215)
    [junit] 	at java.util.zip.ZipFile.<init>(ZipFile.java:145)
    [junit] 	at java.util.jar.JarFile.<init>(JarFile.java:153)
    [junit] 	at java.util.jar.JarFile.<init>(JarFile.java:117)
    [junit] 	at org.apache.tools.ant.AntClassLoader.getResourceURL(AntClassLoader.java:1006)
    [junit] 	at org.apache.tools.ant.AntClassLoader$ResourceEnumeration.findNextResource(AntClassLoader.java:149)
    [junit] 	at org.apache.tools.ant.AntClassLoader$ResourceEnumeration.<init>(AntClassLoader.java:110)
    [junit] 	at org.apache.tools.ant.AntClassLoader.findResources(AntClassLoader.java:953)
    [junit] 	at org.apache.tools.ant.AntClassLoader.getNamedResources(AntClassLoader.java:922)
    [junit] 	at org.apache.tools.ant.loader.AntClassLoader5.getResources(AntClassLoader5.java:58)
    [junit] 	at org.apache.tools.ant.taskdefs.optional.junit.JUnitTask.checkForkedPath(JUnitTask.java:1182)
    [junit] 	at org.apache.tools.ant.taskdefs.optional.junit.JUnitTask.executeAsForked(JUnitTask.java:1062)
    [junit] 	at org.apache.tools.ant.taskdefs.optional.junit.JUnitTask.execute(JUnitTask.java:921)
    [junit] 	at org.apache.tools.ant.taskdefs.optional.junit.JUnitTask.execute(JUnitTask.java:822)
    [junit] 	at org.apache.tools.ant.UnknownElement.execute(UnknownElement.java:292)
    [junit] 	at sun.reflect.GeneratedMethodAccessor53.invoke(Unknown Source)
    [junit] 	at sun.reflect.DelegatingMethodAccessorImpl.invoke(DelegatingMethodAccessorImpl.java:43)
    [junit] 	at java.lang.reflect.Method.invoke(Method.java:606)
    [junit] 	at org.apache.tools.ant.dispatch.DispatchUtils.execute(DispatchUtils.java:106)
    [junit] 	at org.apache.tools.ant.Task.perform(Task.java:348)
    [junit] 	at org.apache.tools.ant.Target.execute(Target.java:435)
    [junit] 	at org.apache.tools.ant.Target.performTasks(Target.java:456)
    [junit] 	at org.apache.tools.ant.Project.executeSortedTargets(Project.java:1393)
    [junit] 	at org.apache.tools.ant.helper.SingleCheckExecutor.executeTargets(SingleCheckExecutor.java:38)
    [junit] 	at org.apache.tools.ant.Project.executeTargets(Project.java:1248)
    [junit] 	at org.apache.tools.ant.taskdefs.Ant.execute(Ant.java:440)
    [junit] 	at org.apache.tools.ant.UnknownElement.execute(UnknownElement.java:292)
    [junit] 	at sun.reflect.GeneratedMethodAccessor53.invoke(Unknown Source)
    [junit] 	at sun.reflect.DelegatingMethodAccessorImpl.invoke(DelegatingMethodAccessorImpl.java:43)
    [junit] 	at java.lang.reflect.Method.invoke(Method.java:606)
    [junit] 	at org.apache.tools.ant.dispatch.DispatchUtils.execute(DispatchUtils.java:106)
    [junit] 	at org.apache.tools.ant.Task.perform(Task.java:348)
    [junit] 	at org.apache.tools.ant.Target.execute(Target.java:435)
    [junit] 	at org.apache.tools.ant.Target.performTasks(Target.java:456)
    [junit] 	at org.apache.tools.ant.Project.executeSortedTargets(Project.java:1393)
    [junit] 	at org.apache.tools.ant.Project.executeTarget(Project.java:1364)
    [junit] 	at org.apache.tools.ant.helper.DefaultExecutor.executeTargets(DefaultExecutor.java:41)
    [junit] 	at org.apache.tools.ant.Project.executeTargets(Project.java:1248)
    [junit] 	at org.apache.tools.ant.Main.runBuild(Main.java:851)
    [junit] 	at org.apache.tools.ant.Main.startAnt(Main.java:235)
    [junit] 	at org.apache.tools.ant.launch.Launcher.run(Launcher.java:280)
    [junit] 	at org.apache.tools.ant.launch.Launcher.main(Launcher.java:109)
Unable to obtain resource from <http://apacheflexbuild.cloudapp.net:8080/job/flex-falcon/ws/compiler-build-tools/target/classes/org/apache/flex/utils/TestAdapterFactory.class>:
java.util.zip.ZipException: error in opening zip file
    [junit] Unable to obtain resource from <http://apacheflexbuild.cloudapp.net:8080/job/flex-falcon/ws/compiler-build-tools/target/classes/org/apache/flex/utils/TestAdapterFactory.class>:

    [junit] java.util.zip.ZipException: error in opening zip file
    [junit] 	at java.util.zip.ZipFile.open(Native Method)
    [junit] 	at java.util.zip.ZipFile.<init>(ZipFile.java:215)
    [junit] 	at java.util.zip.ZipFile.<init>(ZipFile.java:145)
    [junit] 	at java.util.jar.JarFile.<init>(JarFile.java:153)
    [junit] 	at java.util.jar.JarFile.<init>(JarFile.java:117)
    [junit] 	at org.apache.tools.ant.AntClassLoader.getResourceURL(AntClassLoader.java:1006)
    [junit] 	at org.apache.tools.ant.AntClassLoader$ResourceEnumeration.findNextResource(AntClassLoader.java:149)
    [junit] 	at org.apache.tools.ant.AntClassLoader$ResourceEnumeration.<init>(AntClassLoader.java:110)
    [junit] 	at org.apache.tools.ant.AntClassLoader.findResources(AntClassLoader.java:953)
    [junit] 	at org.apache.tools.ant.AntClassLoader.getNamedResources(AntClassLoader.java:922)
    [junit] 	at org.apache.tools.ant.loader.AntClassLoader5.getResources(AntClassLoader5.java:58)
    [junit] 	at org.apache.tools.ant.taskdefs.optional.junit.JUnitTask.checkForkedPath(JUnitTask.java:1182)
    [junit] 	at org.apache.tools.ant.taskdefs.optional.junit.JUnitTask.executeAsForked(JUnitTask.java:1062)
    [junit] 	at org.apache.tools.ant.taskdefs.optional.junit.JUnitTask.execute(JUnitTask.java:921)
    [junit] 	at org.apache.tools.ant.taskdefs.optional.junit.JUnitTask.execute(JUnitTask.java:822)
    [junit] 	at org.apache.tools.ant.UnknownElement.execute(UnknownElement.java:292)
    [junit] 	at sun.reflect.GeneratedMethodAccessor53.invoke(Unknown Source)
    [junit] 	at sun.reflect.DelegatingMethodAccessorImpl.invoke(DelegatingMethodAccessorImpl.java:43)
    [junit] 	at java.lang.reflect.Method.invoke(Method.java:606)
    [junit] 	at org.apache.tools.ant.dispatch.DispatchUtils.execute(DispatchUtils.java:106)
    [junit] 	at org.apache.tools.ant.Task.perform(Task.java:348)
    [junit] 	at org.apache.tools.ant.Target.execute(Target.java:435)
    [junit] 	at org.apache.tools.ant.Target.performTasks(Target.java:456)
    [junit] 	at org.apache.tools.ant.Project.executeSortedTargets(Project.java:1393)
    [junit] 	at org.apache.tools.ant.helper.SingleCheckExecutor.executeTargets(SingleCheckExecutor.java:38)
    [junit] 	at org.apache.tools.ant.Project.executeTargets(Project.java:1248)
    [junit] 	at org.apache.tools.ant.taskdefs.Ant.execute(Ant.java:440)
    [junit] 	at org.apache.tools.ant.UnknownElement.execute(UnknownElement.java:292)
    [junit] 	at sun.reflect.GeneratedMethodAccessor53.invoke(Unknown Source)
    [junit] 	at sun.reflect.DelegatingMethodAccessorImpl.invoke(DelegatingMethodAccessorImpl.java:43)
    [junit] 	at java.lang.reflect.Method.invoke(Method.java:606)
    [junit] 	at org.apache.tools.ant.dispatch.DispatchUtils.execute(DispatchUtils.java:106)
    [junit] 	at org.apache.tools.ant.Task.perform(Task.java:348)
    [junit] 	at org.apache.tools.ant.Target.execute(Target.java:435)
    [junit] 	at org.apache.tools.ant.Target.performTasks(Target.java:456)
    [junit] 	at org.apache.tools.ant.Project.executeSortedTargets(Project.java:1393)
    [junit] 	at org.apache.tools.ant.Project.executeTarget(Project.java:1364)
    [junit] 	at org.apache.tools.ant.helper.DefaultExecutor.executeTargets(DefaultExecutor.java:41)
    [junit] 	at org.apache.tools.ant.Project.executeTargets(Project.java:1248)
    [junit] 	at org.apache.tools.ant.Main.runBuild(Main.java:851)
    [junit] 	at org.apache.tools.ant.Main.startAnt(Main.java:235)
    [junit] 	at org.apache.tools.ant.launch.Launcher.run(Launcher.java:280)
    [junit] 	at org.apache.tools.ant.launch.Launcher.main(Launcher.java:109)
    [junit] Running mxml.tags.MXMLComponentTagTests
    [junit] Generating test:
    [junit] Tests run: 1, Failures: 0, Errors: 1, Skipped: 0, Time elapsed: 0.262 sec
    [junit] Picked up JAVA_TOOL_OPTIONS: -Dfile.encoding=UTF8

BUILD FAILED
<http://apacheflexbuild.cloudapp.net:8080/job/flex-falcon/ws/build.xml>:729: The following
error occurred while executing this line:
<http://apacheflexbuild.cloudapp.net:8080/job/flex-falcon/ws/compiler/src/test/build.xml>:328:
Tests failed

Total time: 105 minutes 39 seconds
Picked up JAVA_TOOL_OPTIONS: -Dfile.encoding=UTF8
Build step 'Invoke Ant' marked build as failure
Skipped archiving because build is not successful
Recording test results

Mime
View raw message